[package - 122powerpc64-quarterly][audio/mous] Failed for mous-2.0.1_4 in build

From: <pkg-fallout_at_FreeBSD.org>
Date: Tue, 22 Jun 2021 03:29:45 GMT
You are receiving this mail as a port that you maintain
is failing to build on the FreeBSD package build server.
Please investigate the failure and submit a PR to fix
build.

Maintainer:     shen.elf_at_gmail.com
Log URL:        http://foul1.nyi.freebsd.org/data/122powerpc64-quarterly/dbe1c4c35016/logs/mous-2.0.1_4.log
Build URL:      http://foul1.nyi.freebsd.org/build.html?mastername=122powerpc64-quarterly&build=dbe1c4c35016
Log:

=>> Building audio/mous
build started at Tue Jun 22 03:28:47 UTC 2021
port directory: /usr/ports/audio/mous
package name: mous-2.0.1_4
building for: FreeBSD 122powerpc64-quarterly-job-03 12.2-RELEASE FreeBSD 12.2-RELEASE powerpc
maintained by: shen.elf_at_gmail.com
Makefile ident: 
Poudriere version: 3.2.8-8-gaf08dbda
Host OSVERSION: 1400008
Jail OSVERSION: 1202000
Job Id: 03

---Begin Environment---
SHELL=/bin/csh
OSVERSION=1202000
UNAME_v=FreeBSD 12.2-RELEASE
UNAME_r=12.2-RELEASE
BLOCKSIZE=K
MAIL=/var/mail/root
STATUS=1
HOME=/root
PATH=/sbin:/bin:/usr/sbin:/usr/bin:/usr/local/sbin:/usr/local/bin:/root/bin
LOCALBASE=/usr/local
USER=root
LIBEXECPREFIX=/usr/local/libexec/poudriere
POUDRIERE_VERSION=3.2.8-8-gaf08dbda
MASTERMNT=/usr/local/poudriere/data/.m/122powerpc64-quarterly/ref
POUDRIERE_BUILD_TYPE=bulk
PACKAGE_BUILDING=yes
SAVED_TERM=
PWD=/usr/local/poudriere/data/.m/122powerpc64-quarterly/ref/.p/pool
P_PORTS_FEATURES=FLAVORS SELECTED_OPTIONS
MASTERNAME=122powerpc64-quarterly
SCRIPTPREFIX=/usr/local/share/poudriere
OLDPWD=/usr/local/poudriere/data/.m/122powerpc64-quarterly/ref/.p
SCRIPTPATH=/usr/local/share/poudriere/bulk.sh
POUDRIEREPATH=/usr/local/bin/poudriere
---End Environment---

---Begin Poudriere Port Flags/Env---
PORT_FLAGS=
PKGENV=
FLAVOR=
DEPENDS_ARGS=
MAKE_ARGS=
---End Poudriere Port Flags/Env---

---Begin OPTIONS List---
===> The following configuration options are available for mous-2.0.1_4:
====> Interface support
     CLI=on: Command line interface support
     NCURSES=on: Console (text) interface support
     QT5=off: Qt 5 toolkit support
====> Generic plugins
     LIBCUE=on: CUE sheet support
     TAGLIB=on: TagLib support
====> Codec plugins
     FDK_AAC=on: FDK AAC codec support
     FLAC=on: FLAC lossless audio codec support
     LAME=on: LAME MP3 audio encoder support
     MAC=on: Monkey's Audio codec support
     MPG123=on: MP3 decoding support via mpg123
     VORBIS=on: Ogg Vorbis audio codec support
     WAV=on: WAV audio format support
     WAVPACK=on: WavPack lossless audio format support
====> Output plugins: you can only select none or one of them
     OSS=on: Open Sound System support
     SNDIO=off: Sndio audio support
===> Use 'make config' to modify these settings
---End OPTIONS List---

--MAINTAINER--
shen.elf_at_gmail.com
--End MAINTAINER--

--CONFIGURE_ARGS--

--End CONFIGURE_ARGS--

--CONFIGURE_ENV--
XDG_DATA_HOME=/wrkdirs/usr/ports/audio/mous/work  XDG_CONFIG_HOME=/wrkdirs/usr/ports/audio/mous/work  HOME=/wrkdirs/usr/ports/audio/mous/work TMPDIR="/tmp" PATH=/wrkdirs/usr/ports/audio/mous/work/.bin:/sbin:/bin:/usr/sbin:/usr/bin:/usr/local/sbin:/usr/local/bin:/root/bin SHELL=/bin/sh CONFIG_SHELL=/bin/sh
--End CONFIGURE_ENV--

--MAKE_ENV--
XDG_DATA_HOME=/wrkdirs/usr/ports/audio/mous/work  XDG_CONFIG_HOME=/wrkdirs/usr/ports/audio/mous/work  HOME=/wrkdirs/usr/ports/audio/mous/work TMPDIR="/tmp" PATH=/wrkdirs/usr/ports/audio/mous/work/.bin:/sbin:/bin:/usr/sbin:/usr/bin:/usr/local/sbin:/usr/local/bin:/root/bin NO_PIE=yes MK_DEBUG_FILES=no MK_KERNEL_SYMBOLS=no SHELL=/bin/sh NO_LINT=YES ADDR2LINE="/usr/local/bin/addr2line" AR="/usr/local/bin/ar" AS="/usr/local/bin/as" CPPFILT="/usr/local/bin/c++filt" GPROF="/usr/local/bin/gprof" LD="/usr/local/bin/ld" NM="/usr/local/bin/nm" OBJCOPY="/usr/local/bin/objcopy" OBJDUMP="/usr/local/bin/objdump" RANLIB="/usr/local/bin/ranlib" READELF="/usr/local/bin/readelf" SIZE="/usr/local/bin/size" STRINGS="/usr/local/bin/strings" DESTDIR=/wrkdirs/usr/ports/audio/mous/work/stage PREFIX=/usr/local  LOCALBASE=/usr/local  CC="gcc10" CFLAGS="-O2 -pipe  -fstack-protector-strong -Wl,-rpath=/usr/local/lib/gcc10 -fno-strict-aliasing "  CPP="cpp10" CPPFLAGS=""  LDFLAGS=" -fstack-protector-strong -Wl,-rpa
 th=/usr/local/lib/gcc10 -L/usr/local/lib/gcc10 " LIBS=""  CXX="g++10" CXXFLAGS="-O2 -pipe  -fstack-protector-strong -Wl,-rpath=/usr/local/lib/gcc10  -Wl,-rpath=/usr/local/lib/gcc10 "  MANPREFIX="/usr/local" BSD_INSTALL_PROGRAM="install  -s -m 555"  BSD_INSTALL_LIB="install  -s -m 0644"  BSD_INSTALL_SCRIPT="install  -m 555"  BSD_INSTALL_DATA="install  -m 0644"  BSD_INSTALL_MAN="install  -m 444"
--End MAKE_ENV--

--PLIST_SUB--
CLI="" NO_CLI="_at_comment " FDK_AAC="" NO_FDK_AAC="_at_comment " FLAC="" NO_FLAC="_at_comment " LAME="" NO_LAME="_at_comment " LIBCUE="" NO_LIBCUE="_at_comment " MAC="" NO_MAC="_at_comment " MPG123="" NO_MPG123="_at_comment " NCURSES="" NO_NCURSES="_at_comment " OSS="" NO_OSS="_at_comment " QT5="_at_comment " NO_QT5="" SNDIO="_at_comment " NO_SNDIO="" TAGLIB="" NO_TAGLIB="_at_comment " VORBIS="" NO_VORBIS="_at_comment " WAV="" NO_WAV="_at_comment " WAVPACK="" NO_WAVPACK="_at_comment " CMAKE_BUILD_TYPE="release" OSREL=12.2 PREFIX=%D LOCALBASE=/usr/local  RESETPREFIX=/usr/local LIB32DIR=lib DOCSDIR="share/doc/mous"  EXAMPLESDIR="share/examples/mous"  DATADIR="share/mous"  WWWDIR="www/mous"  ETCDIR="etc/mous"
--End PLIST_SUB--

--SUB_LIST--
CLI="" NO_CLI="_at_comment " FDK_AAC="" NO_FDK_AAC="_at_comment " FLAC="" NO_FLAC="_at_comment " LAME="" NO_LAME="_at_comment " LIBCUE="" NO_LIBCUE="_at_comment " MAC="" NO_MAC="_at_comment " MPG123="" NO_MPG123="_at_comment " NCURSES="" NO_NCURSES="_at_comment " OSS="" NO_OSS="_at_comment " QT5="_at_comment " NO_QT5="" SNDIO="_at_comment " NO_SNDIO="" TAGLIB="" NO_TAGLIB="_at_comment " VORBIS="" NO_VORBIS="_at_comment " WAV="" NO_WAV="_at_comment " WAVPACK="" NO_WAVPACK="_at_comment " PREFIX=/usr/local LOCALBASE=/usr/local  DATADIR=/usr/local/share/mous DOCSDIR=/usr/local/share/doc/mous EXAMPLESDIR=/usr/local/share/examples/mous  WWWDIR=/usr/local/www/mous ETCDIR=/usr/local/etc/mous
--End SUB_LIST--

---Begin make.conf---
USE_PACKAGE_DEPENDS=yes
BATCH=yes
WRKDIRPREFIX=/wrkdirs
PORTSDIR=/usr/ports
PACKAGES=/packages
DISTDIR=/distfiles
PACKAGE_BUILDING=yes
PACKAGE_BUILDING_FLAVORS=yes
#### /usr/local/etc/poudriere.d/make.conf ####
# XXX: We really need this but cannot use it while 'make checksum' does not
# try the next mirror on checksum failure.  It currently retries the same
# failed mirror and then fails rather then trying another.  It *does*
# try the next if the size is mismatched though.
#MASTER_SITE_FREEBSD=yes
# Build ALLOW_MAKE_JOBS_PACKAGES with 2 jobs
MAKE_JOBS_NUMBER=2
#### /usr/ports/Mk/Scripts/ports_env.sh ####
_CCVERSION_921dbbb2=cc (GCC) 4.2.1 20070831 patched [FreeBSD] Copyright (C) 2007 Free Software Foundation, Inc. This is free software; see the source for copying conditions. There is NO warranty; not even for MERCHANTABILITY or FITNESS FOR A PARTICULAR PURPOSE.
_ALTCCVERSION_921dbbb2=none
_CXXINTERNAL_acaad9ca=Using built-in specs. Target: powerpc64-undermydesk-freebsd Configured with: FreeBSD/powerpc64 system compiler Thread model: posix gcc version 4.2.1 20070831 patched [FreeBSD] "/usr/bin/ld" "--eh-frame-hdr" "-Qy" "-melf64ppc_fbsd" "--enable-new-dtags" "-dynamic-linker" "/libexec/ld-elf.so.1" "/usr/lib/crt1.o" "/usr/lib/crti.o" "/usr/lib/crtbegin.o" "-L/usr/lib" "-L/usr/lib" "/dev/null" "-lstdc++" "-lm" "-lgcc_s" "-lgcc" "-lc" "-lgcc_s" "-lgcc" "/usr/lib/crtsavres.o" "/usr/lib/crtend.o" "/usr/lib/crtn.o"
CC_OUTPUT_921dbbb2_58173849=yes
CC_OUTPUT_921dbbb2_9bdba57c=yes
CC_OUTPUT_921dbbb2_6a4fe7f5=cc1: error: unrecognized command line option "-std=c11"
CC_OUTPUT_921dbbb2_6bcac02b=yes
CC_OUTPUT_921dbbb2_67d20829=yes
CC_OUTPUT_921dbbb2_bfa62e83=cc1: error: unrecognized command line option "-std=gnu11"
CC_OUTPUT_921dbbb2_f0b4d593=yes
CC_OUTPUT_921dbbb2_308abb44=cc1plus: error: unrecognized command line option "-std=c++0x"
CC_OUTPUT_921dbbb2_f00456e5=cc1plus: error: unrecognized command line option "-std=c++11"
CC_OUTPUT_921dbbb2_65ad290d=cc1plus: error: unrecognized command line option "-std=c++14"
CC_OUTPUT_921dbbb2_f2776b26=cc1plus: error: unrecognized command line option "-std=c++17"
CC_OUTPUT_921dbbb2_b2657cc3=yes
CC_OUTPUT_921dbbb2_380987f7=cc1plus: error: unrecognized command line option "-std=gnu++11"
CC_OUTPUT_921dbbb2_160933ec=cc1plus: error: unrecognized command line option "-std=gnu++14"
CC_OUTPUT_921dbbb2_fb62803b=cc1plus: error: unrecognized command line option "-std=gnu++17"
_OBJC_CCVERSION_921dbbb2=cc (GCC) 4.2.1 20070831 patched [FreeBSD] Copyright (C) 2007 Free Software Foundation, Inc. This is free software; see the source for copying conditions. There is NO warranty; not even for MERCHANTABILITY or FITNESS FOR A PARTICULAR PURPOSE.
_OBJC_ALTCCVERSION_921dbbb2=none
ARCH=powerpc64
PPC_ABI=ELFv1
OPSYS=FreeBSD
_OSRELEASE=12.2-RELEASE
OSREL=12.2
OSVERSION=1202000
PYTHONBASE=/usr/local
CONFIGURE_MAX_CMD_LEN=524288
HAVE_PORTS_ENV=1
#### Misc Poudriere ####
GID=0
UID=0
---End make.conf---
--Resource limits--
cpu time               (seconds, -t)  unlimited
file size           (512-blocks, -f)  unlimited
data seg size           (kbytes, -d)  33554432
stack size              (kbytes, -s)  524288
core file size      (512-blocks, -c)  unlimited
max memory size         (kbytes, -m)  unlimited
locked memory           (kbytes, -l)  unlimited
max user processes              (-u)  89999
open files                      (-n)  1024
virtual mem size        (kbytes, -v)  unlimited
swap limit              (kbytes, -w)  unlimited
socket buffer size       (bytes, -b)  unlimited
pseudo-terminals                (-p)  unlimited
kqueues                         (-k)  unlimited
umtx shared locks               (-o)  unlimited
--End resource limits--
=======================<phase: check-sanity   >============================
===>  License BSD2CLAUSE accepted by the user
===========================================================================
=======================<phase: pkg-depends    >============================
===>   mous-2.0.1_4 depends on file: /usr/local/sbin/pkg - not found
===>   Installing existing package /packages/All/pkg-1.16.3.txz
[122powerpc64-quarterly-job-03] Installing pkg-1.16.3...
[122powerpc64-quarterly-job-03] Extracting pkg-1.16.3: .......... done
===>   mous-2.0.1_4 depends on file: /usr/local/sbin/pkg - found
===>   Returning to build of mous-2.0.1_4
===========================================================================
=======================<phase: fetch-depends  >============================
===========================================================================
=======================<phase: fetch          >============================
===>  License BSD2CLAUSE accepted by the user
===> Fetching all distfiles required by mous-2.0.1_4 for building
===========================================================================
=======================<phase: checksum       >============================
===>  License BSD2CLAUSE accepted by the user
===> Fetching all distfiles required by mous-2.0.1_4 for building
=> SHA256 Checksum OK for bsdelf-mous-v2.0.1_GH0.tar.gz.
===========================================================================
=======================<phase: extract-depends>============================
===========================================================================
=======================<phase: extract        >============================
===>  License BSD2CLAUSE accepted by the user
===> Fetching all distfiles required by mous-2.0.1_4 for building
===>  Extracting for mous-2.0.1_4
=> SHA256 Checksum OK for bsdelf-mous-v2.0.1_GH0.tar.gz.
===========================================================================
=======================<phase: patch-depends  >============================
===========================================================================
=======================<phase: patch          >============================
===>  Patching for mous-2.0.1_4
===========================================================================
=======================<phase: build-depends  >============================
<snip>
CMake Warning (dev) at CMakeLists.txt:311 (install):
  Policy CMP0095 is not set: RPATH entries are properly escaped in the
  intermediary CMake install script.  Run "cmake --help-policy CMP0095" for
  policy details.  Use the cmake_policy command to set the policy and
  suppress this warning.

  RPATH entries for target 'LameEncoder' will not be escaped in the
  intermediary cmake_install.cmake script.
This warning is for project developers.  Use -Wno-dev to suppress it.

CMake Warning (dev) at CMakeLists.txt:322 (install):
  Policy CMP0095 is not set: RPATH entries are properly escaped in the
  intermediary CMake install script.  Run "cmake --help-policy CMP0095" for
  policy details.  Use the cmake_policy command to set the policy and
  suppress this warning.

  RPATH entries for target 'VorbisDecoder' will not be escaped in the
  intermediary cmake_install.cmake script.
This warning is for project developers.  Use -Wno-dev to suppress it.

CMake Warning (dev) at CMakeLists.txt:322 (install):
  Policy CMP0095 is not set: RPATH entries are properly escaped in the
  intermediary CMake install script.  Run "cmake --help-policy CMP0095" for
  policy details.  Use the cmake_policy command to set the policy and
  suppress this warning.

  RPATH entries for target 'VorbisEncoder' will not be escaped in the
  intermediary cmake_install.cmake script.
This warning is for project developers.  Use -Wno-dev to suppress it.

CMake Warning (dev) at CMakeLists.txt:339 (install):
  Policy CMP0095 is not set: RPATH entries are properly escaped in the
  intermediary CMake install script.  Run "cmake --help-policy CMP0095" for
  policy details.  Use the cmake_policy command to set the policy and
  suppress this warning.

  RPATH entries for target 'MacDecoder' will not be escaped in the
  intermediary cmake_install.cmake script.
This warning is for project developers.  Use -Wno-dev to suppress it.

CMake Warning (dev) at CMakeLists.txt:346 (install):
  Policy CMP0095 is not set: RPATH entries are properly escaped in the
  intermediary CMake install script.  Run "cmake --help-policy CMP0095" for
  policy details.  Use the cmake_policy command to set the policy and
  suppress this warning.

  RPATH entries for target 'FlacDecoder' will not be escaped in the
  intermediary cmake_install.cmake script.
This warning is for project developers.  Use -Wno-dev to suppress it.

CMake Warning (dev) at CMakeLists.txt:353 (install):
  Policy CMP0095 is not set: RPATH entries are properly escaped in the
  intermediary CMake install script.  Run "cmake --help-policy CMP0095" for
  policy details.  Use the cmake_policy command to set the policy and
  suppress this warning.

  RPATH entries for target 'WvDecoder' will not be escaped in the
  intermediary cmake_install.cmake script.
This warning is for project developers.  Use -Wno-dev to suppress it.

CMake Warning (dev) at CMakeLists.txt:360 (install):
  Policy CMP0095 is not set: RPATH entries are properly escaped in the
  intermediary CMake install script.  Run "cmake --help-policy CMP0095" for
  policy details.  Use the cmake_policy command to set the policy and
  suppress this warning.

  RPATH entries for target 'FdkDecoder' will not be escaped in the
  intermediary cmake_install.cmake script.
This warning is for project developers.  Use -Wno-dev to suppress it.

CMake Warning (dev) at CMakeLists.txt:394 (install):
  Policy CMP0095 is not set: RPATH entries are properly escaped in the
  intermediary CMake install script.  Run "cmake --help-policy CMP0095" for
  policy details.  Use the cmake_policy command to set the policy and
  suppress this warning.

  RPATH entries for target 'TagLibParser' will not be escaped in the
  intermediary cmake_install.cmake script.
This warning is for project developers.  Use -Wno-dev to suppress it.

CMake Warning (dev) at CMakeLists.txt:401 (install):
  Policy CMP0095 is not set: RPATH entries are properly escaped in the
  intermediary CMake install script.  Run "cmake --help-policy CMP0095" for
  policy details.  Use the cmake_policy command to set the policy and
  suppress this warning.

  RPATH entries for target 'CueParser' will not be escaped in the
  intermediary cmake_install.cmake script.
This warning is for project developers.  Use -Wno-dev to suppress it.

-- Generating done
CMake Warning:
  Manually-specified variables were not used by the project:

    CMAKE_COLOR_MAKEFILE
    CMAKE_CXX_FLAGS_DEBUG
    CMAKE_C_FLAGS_DEBUG
    CMAKE_C_FLAGS_RELEASE
    CMAKE_MODULE_LINKER_FLAGS
    CMAKE_VERBOSE_MAKEFILE


-- Build files have been written to: /wrkdirs/usr/ports/audio/mous/work/.build
===========================================================================
=======================<phase: build          >============================
===>  Building for mous-2.0.1_4
[1/101] /usr/local/bin/g++10 -DCMAKE_INSTALL_PREFIX=\"/usr/local\" -DCueParser_EXPORTS -DUSE_POSIX_SEMAPHORE -I/wrkdirs/usr/ports/audio/mous/work/mous-2.0.1/deps -I/wrkdirs/usr/ports/audio/mous/work/mous-2.0.1/sdk -O2 -pipe  -fstack-protector-strong -Wl,-rpath=/usr/local/lib/gcc10  -Wl,-rpath=/usr/local/lib/gcc10 -Wall -O2 -pipe  -fstack-protector-strong -Wl,-rpath=/usr/local/lib/gcc10  -Wl,-rpath=/usr/local/lib/gcc10 -fPIC -std=c++14 -MD -MT CMakeFiles/CueParser.dir/plugins/libcue/CuePlugin.cpp.o -MF CMakeFiles/CueParser.dir/plugins/libcue/CuePlugin.cpp.o.d -o CMakeFiles/CueParser.dir/plugins/libcue/CuePlugin.cpp.o -c /wrkdirs/usr/ports/audio/mous/work/mous-2.0.1/plugins/libcue/CuePlugin.cpp
[2/101] /usr/local/bin/g++10 -DCMAKE_INSTALL_PREFIX=\"/usr/local\" -DCueParser_EXPORTS -DUSE_POSIX_SEMAPHORE -I/wrkdirs/usr/ports/audio/mous/work/mous-2.0.1/deps -I/wrkdirs/usr/ports/audio/mous/work/mous-2.0.1/sdk -O2 -pipe  -fstack-protector-strong -Wl,-rpath=/usr/local/lib/gcc10  -Wl,-rpath=/usr/local/lib/gcc10 -Wall -O2 -pipe  -fstack-protector-strong -Wl,-rpath=/usr/local/lib/gcc10  -Wl,-rpath=/usr/local/lib/gcc10 -fPIC -std=c++14 -MD -MT CMakeFiles/CueParser.dir/plugins/libcue/CueSheetParser.cpp.o -MF CMakeFiles/CueParser.dir/plugins/libcue/CueSheetParser.cpp.o.d -o CMakeFiles/CueParser.dir/plugins/libcue/CueSheetParser.cpp.o -c /wrkdirs/usr/ports/audio/mous/work/mous-2.0.1/plugins/libcue/CueSheetParser.cpp
[3/101] : && /usr/local/bin/g++10 -fPIC -O2 -pipe  -fstack-protector-strong -Wl,-rpath=/usr/local/lib/gcc10  -Wl,-rpath=/usr/local/lib/gcc10 -Wall -O2 -pipe  -fstack-protector-strong -Wl,-rpath=/usr/local/lib/gcc10  -Wl,-rpath=/usr/local/lib/gcc10  -fstack-protector-strong -Wl,-rpath=/usr/local/lib/gcc10 -L/usr/local/lib/gcc10 -shared -Wl,-soname,libCueParser.so -o plugins/libCueParser.so CMakeFiles/CueParser.dir/plugins/libcue/CuePlugin.cpp.o CMakeFiles/CueParser.dir/plugins/libcue/CueSheetParser.cpp.o -L/usr/local/lib -Wl,-rpath,/usr/local/lib::::::::::::::::::::::::::::::::::::::::::::::::::::::::  /usr/local/lib/libcue.so && :
[4/101] /usr/local/bin/g++10 -DCMAKE_INSTALL_PREFIX=\"/usr/local\" -DTagLibParser_EXPORTS -DUSE_POSIX_SEMAPHORE -I/wrkdirs/usr/ports/audio/mous/work/mous-2.0.1/deps -I/wrkdirs/usr/ports/audio/mous/work/mous-2.0.1/sdk -O2 -pipe  -fstack-protector-strong -Wl,-rpath=/usr/local/lib/gcc10  -Wl,-rpath=/usr/local/lib/gcc10 -Wall -O2 -pipe  -fstack-protector-strong -Wl,-rpath=/usr/local/lib/gcc10  -Wl,-rpath=/usr/local/lib/gcc10 -fPIC -std=c++14 -MD -MT CMakeFiles/TagLibParser.dir/plugins/taglib/CoverArt.cpp.o -MF CMakeFiles/TagLibParser.dir/plugins/taglib/CoverArt.cpp.o.d -o CMakeFiles/TagLibParser.dir/plugins/taglib/CoverArt.cpp.o -c /wrkdirs/usr/ports/audio/mous/work/mous-2.0.1/plugins/taglib/CoverArt.cpp
/wrkdirs/usr/ports/audio/mous/work/mous-2.0.1/plugins/taglib/CoverArt.cpp: In function 'mous::CoverFormat DumpMp4Cover(const string&, std::vector<char>&)':
/wrkdirs/usr/ports/audio/mous/work/mous-2.0.1/plugins/taglib/CoverArt.cpp:42:59: warning: 'TagLib::MP4::ItemMap& TagLib::MP4::Tag::itemListMap()' is deprecated [-Wdeprecated-declarations]
   42 |     MP4::ItemListMap::Iterator iter = mp4tag->itemListMap().find("covr");
      |                                                           ^
In file included from /usr/local/include/taglib/mp4file.h:33,
                 from /wrkdirs/usr/ports/audio/mous/work/mous-2.0.1/plugins/taglib/CoverArt.cpp:10:
/usr/local/include/taglib/mp4tag.h:77:36: note: declared here
   77 |         TAGLIB_DEPRECATED ItemMap &itemListMap();
      |                                    ^~~~~~~~~~~
/wrkdirs/usr/ports/audio/mous/work/mous-2.0.1/plugins/taglib/CoverArt.cpp:43:37: warning: 'TagLib::MP4::ItemMap& TagLib::MP4::Tag::itemListMap()' is deprecated [-Wdeprecated-declarations]
   43 |     if (iter != mp4tag->itemListMap().end()) {
      |                                     ^
In file included from /usr/local/include/taglib/mp4file.h:33,
                 from /wrkdirs/usr/ports/audio/mous/work/mous-2.0.1/plugins/taglib/CoverArt.cpp:10:
/usr/local/include/taglib/mp4tag.h:77:36: note: declared here
   77 |         TAGLIB_DEPRECATED ItemMap &itemListMap();
      |                                    ^~~~~~~~~~~
/wrkdirs/usr/ports/audio/mous/work/mous-2.0.1/plugins/taglib/CoverArt.cpp: In function 'bool StoreMp3Cover(const string&, mous::CoverFormat, const char*, size_t)':
/wrkdirs/usr/ports/audio/mous/work/mous-2.0.1/plugins/taglib/CoverArt.cpp:127:80: warning: 'bool TagLib::MPEG::File::save(int, bool, int, bool)' is deprecated [-Wdeprecated-declarations]
  127 |             return ref->save(TagLib::MPEG::File::TagTypes::ID3v2, true, 3, true);
      |                                                                                ^
In file included from /wrkdirs/usr/ports/audio/mous/work/mous-2.0.1/plugins/taglib/CoverArt.cpp:14:
/usr/local/include/taglib/mpegfile.h:211:30: note: declared here
  211 |       TAGLIB_DEPRECATED bool save(int tags, bool stripOthers, int id3v2Version, bool duplicateTags);
      |                              ^~~~
/wrkdirs/usr/ports/audio/mous/work/mous-2.0.1/plugins/taglib/CoverArt.cpp: In function 'bool StoreMp4Cover(const string&, mous::CoverFormat, const char*, size_t)':
/wrkdirs/usr/ports/audio/mous/work/mous-2.0.1/plugins/taglib/CoverArt.cpp:165:59: warning: 'TagLib::MP4::ItemMap& TagLib::MP4::Tag::itemListMap()' is deprecated [-Wdeprecated-declarations]
  165 |     MP4::ItemListMap::Iterator iter = mp4tag->itemListMap().find("covr");
      |                                                           ^
In file included from /usr/local/include/taglib/mp4file.h:33,
                 from /wrkdirs/usr/ports/audio/mous/work/mous-2.0.1/plugins/taglib/CoverArt.cpp:10:
/usr/local/include/taglib/mp4tag.h:77:36: note: declared here
   77 |         TAGLIB_DEPRECATED ItemMap &itemListMap();
      |                                    ^~~~~~~~~~~
/wrkdirs/usr/ports/audio/mous/work/mous-2.0.1/plugins/taglib/CoverArt.cpp:166:37: warning: 'TagLib::MP4::ItemMap& TagLib::MP4::Tag::itemListMap()' is deprecated [-Wdeprecated-declarations]
  166 |     if (iter == mp4tag->itemListMap().end()) {
      |                                     ^
In file included from /usr/local/include/taglib/mp4file.h:33,
                 from /wrkdirs/usr/ports/audio/mous/work/mous-2.0.1/plugins/taglib/CoverArt.cpp:10:
/usr/local/include/taglib/mp4tag.h:77:36: note: declared here
   77 |         TAGLIB_DEPRECATED ItemMap &itemListMap();
      |                                    ^~~~~~~~~~~
/wrkdirs/usr/ports/audio/mous/work/mous-2.0.1/plugins/taglib/CoverArt.cpp:168:29: warning: 'TagLib::MP4::ItemMap& TagLib::MP4::Tag::itemListMap()' is deprecated [-Wdeprecated-declarations]
  168 |         mp4tag->itemListMap().insert("covr", item);
      |                             ^
In file included from /usr/local/include/taglib/mp4file.h:33,
                 from /wrkdirs/usr/ports/audio/mous/work/mous-2.0.1/plugins/taglib/CoverArt.cpp:10:
/usr/local/include/taglib/mp4tag.h:77:36: note: declared here
   77 |         TAGLIB_DEPRECATED ItemMap &itemListMap();
      |                                    ^~~~~~~~~~~
[5/101] /usr/local/bin/g++10 -DCMAKE_INSTALL_PREFIX=\"/usr/local\" -DTagLibParser_EXPORTS -DUSE_POSIX_SEMAPHORE -I/wrkdirs/usr/ports/audio/mous/work/mous-2.0.1/deps -I/wrkdirs/usr/ports/audio/mous/work/mous-2.0.1/sdk -O2 -pipe  -fstack-protector-strong -Wl,-rpath=/usr/local/lib/gcc10  -Wl,-rpath=/usr/local/lib/gcc10 -Wall -O2 -pipe  -fstack-protector-strong -Wl,-rpath=/usr/local/lib/gcc10  -Wl,-rpath=/usr/local/lib/gcc10 -fPIC -std=c++14 -MD -MT CMakeFiles/TagLibParser.dir/plugins/taglib/TagLibPlugin.cpp.o -MF CMakeFiles/TagLibParser.dir/plugins/taglib/TagLibPlugin.cpp.o.d -o CMakeFiles/TagLibParser.dir/plugins/taglib/TagLibPlugin.cpp.o -c /wrkdirs/usr/ports/audio/mous/work/mous-2.0.1/plugins/taglib/TagLibPlugin.cpp
[6/101] /usr/local/bin/g++10 -DCMAKE_INSTALL_PREFIX=\"/usr/local\" -DTagLibParser_EXPORTS -DUSE_POSIX_SEMAPHORE -I/wrkdirs/usr/ports/audio/mous/work/mous-2.0.1/deps -I/wrkdirs/usr/ports/audio/mous/work/mous-2.0.1/sdk -O2 -pipe  -fstack-protector-strong -Wl,-rpath=/usr/local/lib/gcc10  -Wl,-rpath=/usr/local/lib/gcc10 -Wall -O2 -pipe  -fstack-protector-strong -Wl,-rpath=/usr/local/lib/gcc10  -Wl,-rpath=/usr/local/lib/gcc10 -fPIC -std=c++14 -MD -MT CMakeFiles/TagLibParser.dir/plugins/taglib/TagLibParser.cpp.o -MF CMakeFiles/TagLibParser.dir/plugins/taglib/TagLibParser.cpp.o.d -o CMakeFiles/TagLibParser.dir/plugins/taglib/TagLibParser.cpp.o -c /wrkdirs/usr/ports/audio/mous/work/mous-2.0.1/plugins/taglib/TagLibParser.cpp
/wrkdirs/usr/ports/audio/mous/work/mous-2.0.1/plugins/taglib/TagLibParser.cpp: In member function 'virtual bool TagLibParser::Save()':
/wrkdirs/usr/ports/audio/mous/work/mous-2.0.1/plugins/taglib/TagLibParser.cpp:180:76: warning: 'bool TagLib::MPEG::File::save(int, bool, int, bool)' is deprecated [-Wdeprecated-declarations]
  180 |         return ref->save(TagLib::MPEG::File::TagTypes::ID3v2, true, 3, true);
      |                                                                            ^
In file included from /wrkdirs/usr/ports/audio/mous/work/mous-2.0.1/plugins/taglib/TagLibParser.cpp:15:
/usr/local/include/taglib/mpegfile.h:211:30: note: declared here
  211 |       TAGLIB_DEPRECATED bool save(int tags, bool stripOthers, int id3v2Version, bool duplicateTags);
      |                              ^~~~
[7/101] /usr/local/bin/g++10 -DCMAKE_INSTALL_PREFIX=\"/usr/local\" -DFdkDecoder_EXPORTS -DUSE_POSIX_SEMAPHORE -I/wrkdirs/usr/ports/audio/mous/work/mous-2.0.1/deps -I/wrkdirs/usr/ports/audio/mous/work/mous-2.0.1/sdk -O2 -pipe  -fstack-protector-strong -Wl,-rpath=/usr/local/lib/gcc10  -Wl,-rpath=/usr/local/lib/gcc10 -Wall -O2 -pipe  -fstack-protector-strong -Wl,-rpath=/usr/local/lib/gcc10  -Wl,-rpath=/usr/local/lib/gcc10 -fPIC -std=c++14 -MD -MT CMakeFiles/FdkDecoder.dir/plugins/fdk-aac/decoder/FdkDecoder.cc.o -MF CMakeFiles/FdkDecoder.dir/plugins/fdk-aac/decoder/FdkDecoder.cc.o.d -o CMakeFiles/FdkDecoder.dir/plugins/fdk-aac/decoder/FdkDecoder.cc.o -c /wrkdirs/usr/ports/audio/mous/work/mous-2.0.1/plugins/fdk-aac/decoder/FdkDecoder.cc
FAILED: CMakeFiles/FdkDecoder.dir/plugins/fdk-aac/decoder/FdkDecoder.cc.o 
/usr/local/bin/g++10 -DCMAKE_INSTALL_PREFIX=\"/usr/local\" -DFdkDecoder_EXPORTS -DUSE_POSIX_SEMAPHORE -I/wrkdirs/usr/ports/audio/mous/work/mous-2.0.1/deps -I/wrkdirs/usr/ports/audio/mous/work/mous-2.0.1/sdk -O2 -pipe  -fstack-protector-strong -Wl,-rpath=/usr/local/lib/gcc10  -Wl,-rpath=/usr/local/lib/gcc10 -Wall -O2 -pipe  -fstack-protector-strong -Wl,-rpath=/usr/local/lib/gcc10  -Wl,-rpath=/usr/local/lib/gcc10 -fPIC -std=c++14 -MD -MT CMakeFiles/FdkDecoder.dir/plugins/fdk-aac/decoder/FdkDecoder.cc.o -MF CMakeFiles/FdkDecoder.dir/plugins/fdk-aac/decoder/FdkDecoder.cc.o.d -o CMakeFiles/FdkDecoder.dir/plugins/fdk-aac/decoder/FdkDecoder.cc.o -c /wrkdirs/usr/ports/audio/mous/work/mous-2.0.1/plugins/fdk-aac/decoder/FdkDecoder.cc
In file included from /wrkdirs/usr/ports/audio/mous/work/mous-2.0.1/plugins/fdk-aac/decoder/FdkDecoder.h:7,
                 from /wrkdirs/usr/ports/audio/mous/work/mous-2.0.1/plugins/fdk-aac/decoder/FdkDecoder.cc:1:
/wrkdirs/usr/ports/audio/mous/work/mous-2.0.1/sdk/plugin/IDecoder.h:30:23: error: declaration of 'virtual mous::AudioMode mous::IDecoder::AudioMode() const' changes meaning of 'AudioMode' [-fpermissive]
   30 |     virtual AudioMode AudioMode() const = 0;
      |                       ^~~~~~~~~
In file included from /wrkdirs/usr/ports/audio/mous/work/mous-2.0.1/sdk/plugin/IDecoder.h:6,
                 from /wrkdirs/usr/ports/audio/mous/work/mous-2.0.1/plugins/fdk-aac/decoder/FdkDecoder.h:7,
                 from /wrkdirs/usr/ports/audio/mous/work/mous-2.0.1/plugins/fdk-aac/decoder/FdkDecoder.cc:1:
/wrkdirs/usr/ports/audio/mous/work/mous-2.0.1/sdk/util/AudioMode.h:7:12: note: 'AudioMode' declared here as 'enum class mous::AudioMode'
    7 | enum class AudioMode : uint8_t
      |            ^~~~~~~~~
In file included from /usr/local/include/mp4v2/mp4v2.h:57,
                 from /wrkdirs/usr/ports/audio/mous/work/mous-2.0.1/plugins/fdk-aac/decoder/FdkDecoder.h:12,
                 from /wrkdirs/usr/ports/audio/mous/work/mous-2.0.1/plugins/fdk-aac/decoder/FdkDecoder.cc:1:
/wrkdirs/usr/ports/audio/mous/work/mous-2.0.1/plugins/fdk-aac/decoder/FdkDecoder.cc: In member function 'mous::ErrorCode FdkDecoder::OpenMP4(const string&)':
/wrkdirs/usr/ports/audio/mous/work/mous-2.0.1/plugins/fdk-aac/decoder/FdkDecoder.cc:58:17: error: 'strcasecmp' was not declared in this scope; did you mean 'wcscasecmp'?
   58 |             if (MP4_IS_AUDIO_TRACK_TYPE(MP4GetTrackType(m_mp4, itrack))) {
      |                 ^~~~~~~~~~~~~~~~~~~~~~~
[8/101] : && /usr/local/bin/g++10 -fPIC -O2 -pipe  -fstack-protector-strong -Wl,-rpath=/usr/local/lib/gcc10  -Wl,-rpath=/usr/local/lib/gcc10 -Wall -O2 -pipe  -fstack-protector-strong -Wl,-rpath=/usr/local/lib/gcc10  -Wl,-rpath=/usr/local/lib/gcc10  -fstack-protector-strong -Wl,-rpath=/usr/local/lib/gcc10 -L/usr/local/lib/gcc10 -shared -Wl,-soname,libTagLibParser.so -o plugins/libTagLibParser.so CMakeFiles/TagLibParser.dir/plugins/taglib/CoverArt.cpp.o CMakeFiles/TagLibParser.dir/plugins/taglib/TagLibParser.cpp.o CMakeFiles/TagLibParser.dir/plugins/taglib/TagLibPlugin.cpp.o -L/usr/local/lib -Wl,-rpath,/usr/local/lib::::::::::::::::::::::::::::::::::::::::::::::::::::::::  /usr/local/lib/libtag.so && :
ninja: build stopped: subcommand failed.
===> Compilation failed unexpectedly.
Try to set MAKE_JOBS_UNSAFE=yes and rebuild before reporting the failure to
the maintainer.
*** Error code 1

Stop.
make: stopped in /usr/ports/audio/mous
Received on Tue Jun 22 2021 - 03:29:45 UTC

Original text of this message