[package - 122powerpc64-quarterly][devel/libclc] Failed for libclc-0.4.0.20190527_2 in build

From: <pkg-fallout_at_FreeBSD.org>
Date: Tue, 22 Jun 2021 03:15:46 GMT
You are receiving this mail as a port that you maintain
is failing to build on the FreeBSD package build server.
Please investigate the failure and submit a PR to fix
build.

Maintainer:     x11_at_FreeBSD.org
Log URL:        http://foul1.nyi.freebsd.org/data/122powerpc64-quarterly/dbe1c4c35016/logs/libclc-0.4.0.20190527_2.log
Build URL:      http://foul1.nyi.freebsd.org/build.html?mastername=122powerpc64-quarterly&build=dbe1c4c35016
Log:

=>> Building devel/libclc
build started at Tue Jun 22 03:11:15 UTC 2021
port directory: /usr/ports/devel/libclc
package name: libclc-0.4.0.20190527_2
building for: FreeBSD 122powerpc64-quarterly-job-07 12.2-RELEASE FreeBSD 12.2-RELEASE powerpc
maintained by: x11_at_FreeBSD.org
Makefile ident: 
Poudriere version: 3.2.8-8-gaf08dbda
Host OSVERSION: 1400008
Jail OSVERSION: 1202000
Job Id: 07

---Begin Environment---
SHELL=/bin/csh
OSVERSION=1202000
UNAME_v=FreeBSD 12.2-RELEASE
UNAME_r=12.2-RELEASE
BLOCKSIZE=K
MAIL=/var/mail/root
STATUS=1
HOME=/root
PATH=/sbin:/bin:/usr/sbin:/usr/bin:/usr/local/sbin:/usr/local/bin:/root/bin
LOCALBASE=/usr/local
USER=root
LIBEXECPREFIX=/usr/local/libexec/poudriere
POUDRIERE_VERSION=3.2.8-8-gaf08dbda
MASTERMNT=/usr/local/poudriere/data/.m/122powerpc64-quarterly/ref
POUDRIERE_BUILD_TYPE=bulk
PACKAGE_BUILDING=yes
SAVED_TERM=
PWD=/usr/local/poudriere/data/.m/122powerpc64-quarterly/ref/.p/pool
P_PORTS_FEATURES=FLAVORS SELECTED_OPTIONS
MASTERNAME=122powerpc64-quarterly
SCRIPTPREFIX=/usr/local/share/poudriere
OLDPWD=/usr/local/poudriere/data/.m/122powerpc64-quarterly/ref/.p
SCRIPTPATH=/usr/local/share/poudriere/bulk.sh
POUDRIEREPATH=/usr/local/bin/poudriere
---End Environment---

---Begin Poudriere Port Flags/Env---
PORT_FLAGS=
PKGENV=
FLAVOR=
DEPENDS_ARGS=
MAKE_ARGS=
---End Poudriere Port Flags/Env---

---Begin OPTIONS List---
---End OPTIONS List---

--MAINTAINER--
x11_at_FreeBSD.org
--End MAINTAINER--

--CONFIGURE_ARGS--

--End CONFIGURE_ARGS--

--CONFIGURE_ENV--
MAKE=gmake PYTHON="/usr/local/bin/python2.7" XDG_DATA_HOME=/wrkdirs/usr/ports/devel/libclc/work  XDG_CONFIG_HOME=/wrkdirs/usr/ports/devel/libclc/work  HOME=/wrkdirs/usr/ports/devel/libclc/work TMPDIR="/tmp" PATH=/wrkdirs/usr/ports/devel/libclc/work/.bin:/sbin:/bin:/usr/sbin:/usr/bin:/usr/local/sbin:/usr/local/bin:/root/bin SHELL=/bin/sh CONFIG_SHELL=/bin/sh
--End CONFIGURE_ENV--

--MAKE_ENV--
MAKE=gmake DESTDIR=/wrkdirs/usr/ports/devel/libclc/work/stage XDG_DATA_HOME=/wrkdirs/usr/ports/devel/libclc/work  XDG_CONFIG_HOME=/wrkdirs/usr/ports/devel/libclc/work  HOME=/wrkdirs/usr/ports/devel/libclc/work TMPDIR="/tmp" PATH=/wrkdirs/usr/ports/devel/libclc/work/.bin:/sbin:/bin:/usr/sbin:/usr/bin:/usr/local/sbin:/usr/local/bin:/root/bin NO_PIE=yes MK_DEBUG_FILES=no MK_KERNEL_SYMBOLS=no SHELL=/bin/sh NO_LINT=YES PREFIX=/usr/local  LOCALBASE=/usr/local  CC="cc" CFLAGS="-O2 -pipe  -fstack-protector-strong -fno-strict-aliasing "  CPP="cpp" CPPFLAGS=""  LDFLAGS=" -fstack-protector-strong " LIBS=""  CXX="c++" CXXFLAGS="-O2 -pipe -fstack-protector-strong -fno-strict-aliasing  "  MANPREFIX="/usr/local" BSD_INSTALL_PROGRAM="install  -s -m 555"  BSD_INSTALL_LIB="install  -s -m 0644"  BSD_INSTALL_SCRIPT="install  -m 555"  BSD_INSTALL_DATA="install  -m 0644"  BSD_INSTALL_MAN="install  -m 444"
--End MAKE_ENV--

--PLIST_SUB--
PYTHON_INCLUDEDIR=include/python2.7  PYTHON_LIBDIR=lib/python2.7  PYTHON_PLATFORM=freebsd12  PYTHON_SITELIBDIR=lib/python2.7/site-packages  PYTHON_SUFFIX=27  PYTHON_EXT_SUFFIX=  PYTHON_VER=2.7  PYTHON_VERSION=python2.7 PYTHON2="" PYTHON3="_at_comment " OSREL=12.2 PREFIX=%D LOCALBASE=/usr/local  RESETPREFIX=/usr/local LIB32DIR=lib DOCSDIR="share/doc/libclc"  EXAMPLESDIR="share/examples/libclc"  DATADIR="share/libclc"  WWWDIR="www/libclc"  ETCDIR="etc/libclc"
--End PLIST_SUB--

--SUB_LIST--
PREFIX=/usr/local LOCALBASE=/usr/local  DATADIR=/usr/local/share/libclc DOCSDIR=/usr/local/share/doc/libclc EXAMPLESDIR=/usr/local/share/examples/libclc  WWWDIR=/usr/local/www/libclc ETCDIR=/usr/local/etc/libclc
--End SUB_LIST--

---Begin make.conf---
USE_PACKAGE_DEPENDS=yes
BATCH=yes
WRKDIRPREFIX=/wrkdirs
PORTSDIR=/usr/ports
PACKAGES=/packages
DISTDIR=/distfiles
PACKAGE_BUILDING=yes
PACKAGE_BUILDING_FLAVORS=yes
#### /usr/local/etc/poudriere.d/make.conf ####
# XXX: We really need this but cannot use it while 'make checksum' does not
# try the next mirror on checksum failure.  It currently retries the same
# failed mirror and then fails rather then trying another.  It *does*
# try the next if the size is mismatched though.
#MASTER_SITE_FREEBSD=yes
# Build ALLOW_MAKE_JOBS_PACKAGES with 2 jobs
MAKE_JOBS_NUMBER=2
#### /usr/ports/Mk/Scripts/ports_env.sh ####
_CCVERSION_921dbbb2=cc (GCC) 4.2.1 20070831 patched [FreeBSD] Copyright (C) 2007 Free Software Foundation, Inc. This is free software; see the source for copying conditions. There is NO warranty; not even for MERCHANTABILITY or FITNESS FOR A PARTICULAR PURPOSE.
_ALTCCVERSION_921dbbb2=none
_CXXINTERNAL_acaad9ca=Using built-in specs. Target: powerpc64-undermydesk-freebsd Configured with: FreeBSD/powerpc64 system compiler Thread model: posix gcc version 4.2.1 20070831 patched [FreeBSD] "/usr/bin/ld" "--eh-frame-hdr" "-Qy" "-melf64ppc_fbsd" "--enable-new-dtags" "-dynamic-linker" "/libexec/ld-elf.so.1" "/usr/lib/crt1.o" "/usr/lib/crti.o" "/usr/lib/crtbegin.o" "-L/usr/lib" "-L/usr/lib" "/dev/null" "-lstdc++" "-lm" "-lgcc_s" "-lgcc" "-lc" "-lgcc_s" "-lgcc" "/usr/lib/crtsavres.o" "/usr/lib/crtend.o" "/usr/lib/crtn.o"
CC_OUTPUT_921dbbb2_58173849=yes
CC_OUTPUT_921dbbb2_9bdba57c=yes
CC_OUTPUT_921dbbb2_6a4fe7f5=cc1: error: unrecognized command line option "-std=c11"
CC_OUTPUT_921dbbb2_6bcac02b=yes
CC_OUTPUT_921dbbb2_67d20829=yes
CC_OUTPUT_921dbbb2_bfa62e83=cc1: error: unrecognized command line option "-std=gnu11"
CC_OUTPUT_921dbbb2_f0b4d593=yes
CC_OUTPUT_921dbbb2_308abb44=cc1plus: error: unrecognized command line option "-std=c++0x"
CC_OUTPUT_921dbbb2_f00456e5=cc1plus: error: unrecognized command line option "-std=c++11"
CC_OUTPUT_921dbbb2_65ad290d=cc1plus: error: unrecognized command line option "-std=c++14"
CC_OUTPUT_921dbbb2_f2776b26=cc1plus: error: unrecognized command line option "-std=c++17"
CC_OUTPUT_921dbbb2_b2657cc3=yes
CC_OUTPUT_921dbbb2_380987f7=cc1plus: error: unrecognized command line option "-std=gnu++11"
CC_OUTPUT_921dbbb2_160933ec=cc1plus: error: unrecognized command line option "-std=gnu++14"
CC_OUTPUT_921dbbb2_fb62803b=cc1plus: error: unrecognized command line option "-std=gnu++17"
_OBJC_CCVERSION_921dbbb2=cc (GCC) 4.2.1 20070831 patched [FreeBSD] Copyright (C) 2007 Free Software Foundation, Inc. This is free software; see the source for copying conditions. There is NO warranty; not even for MERCHANTABILITY or FITNESS FOR A PARTICULAR PURPOSE.
_OBJC_ALTCCVERSION_921dbbb2=none
ARCH=powerpc64
PPC_ABI=ELFv1
OPSYS=FreeBSD
_OSRELEASE=12.2-RELEASE
OSREL=12.2
OSVERSION=1202000
PYTHONBASE=/usr/local
CONFIGURE_MAX_CMD_LEN=524288
HAVE_PORTS_ENV=1
#### Misc Poudriere ####
GID=0
UID=0
---End make.conf---
--Resource limits--
cpu time               (seconds, -t)  unlimited
file size           (512-blocks, -f)  unlimited
data seg size           (kbytes, -d)  33554432
stack size              (kbytes, -s)  524288
core file size      (512-blocks, -c)  unlimited
max memory size         (kbytes, -m)  unlimited
locked memory           (kbytes, -l)  unlimited
max user processes              (-u)  89999
open files                      (-n)  1024
virtual mem size        (kbytes, -v)  unlimited
swap limit              (kbytes, -w)  unlimited
socket buffer size       (bytes, -b)  unlimited
pseudo-terminals                (-p)  unlimited
kqueues                         (-k)  unlimited
umtx shared locks               (-o)  unlimited
--End resource limits--
=======================<phase: check-sanity   >============================
===>   NOTICE:

This port is deprecated; you may wish to reconsider installing it:

Uses Python 2.7 which is EOLed upstream.

It is scheduled to be removed on or after 2020-12-31.

===>  License LLVM accepted by the user
===========================================================================
=======================<phase: pkg-depends    >============================
===>   libclc-0.4.0.20190527_2 depends on file: /usr/local/sbin/pkg - not found
===>   Installing existing package /packages/All/pkg-1.16.3.txz
[122powerpc64-quarterly-job-07] Installing pkg-1.16.3...
[122powerpc64-quarterly-job-07] Extracting pkg-1.16.3: .......... done
===>   libclc-0.4.0.20190527_2 depends on file: /usr/local/sbin/pkg - found
===>   Returning to build of libclc-0.4.0.20190527_2
===========================================================================
=======================<phase: fetch-depends  >============================
===========================================================================
=======================<phase: fetch          >============================
===>   NOTICE:

This port is deprecated; you may wish to reconsider installing it:

Uses Python 2.7 which is EOLed upstream.

It is scheduled to be removed on or after 2020-12-31.

===>  License LLVM accepted by the user
===> Fetching all distfiles required by libclc-0.4.0.20190527_2 for building
===========================================================================
=======================<phase: checksum       >============================
===>   NOTICE:

This port is deprecated; you may wish to reconsider installing it:

Uses Python 2.7 which is EOLed upstream.

It is scheduled to be removed on or after 2020-12-31.

===>  License LLVM accepted by the user
===> Fetching all distfiles required by libclc-0.4.0.20190527_2 for building
=> SHA256 Checksum OK for llvm-mirror-libclc-0.4.0.20190527-9f6204e_GH0.tar.gz.
===========================================================================
=======================<phase: extract-depends>============================
===========================================================================
=======================<phase: extract        >============================
===>   NOTICE:

This port is deprecated; you may wish to reconsider installing it:

Uses Python 2.7 which is EOLed upstream.

It is scheduled to be removed on or after 2020-12-31.

<snip>
    ret = ax > 0x3f800000 & iy == PINFBITPATT_SP32 ? PINFBITPATT_SP32 : ret;
                                                   ^
                            (                                              )
generic/lib/math/clc_powr.cl:352:43: warning: operator '?:' has lower precedence than '&'; '&' will be evaluated first [-Wbitwise-conditional-parentheses]
        inty = !(yexp < 1) & !(yexp > 53) ? inty1 : inty;
               ~~~~~~~~~~~~~~~~~~~~~~~~~~ ^
generic/lib/math/clc_powr.cl:352:43: note: place parentheses around the '&' expression to silence this warning
        inty = !(yexp < 1) & !(yexp > 53) ? inty1 : inty;
                                          ^
               (                         )
generic/lib/math/clc_powr.cl:352:43: note: place parentheses around the '?:' expression to evaluate it first
        inty = !(yexp < 1) & !(yexp > 53) ? inty1 : inty;
                                          ^
                             (                          )
generic/lib/math/clc_powr.cl:360:61: warning: operator '?:' has lower precedence than '&'; '&' will be evaluated first [-Wbitwise-conditional-parentheses]
    ret = ax < 0x3ff0000000000000L & uy == NINFBITPATT_DP64 ? PINFBITPATT_DP64 : ret;
          ~~~~~~~~~~~~~~~~~~~~~~~~~~~~~~~~~~~~~~~~~~~~~~~~~ ^
generic/lib/math/clc_powr.cl:360:61: note: place parentheses around the '&' expression to silence this warning
    ret = ax < 0x3ff0000000000000L & uy == NINFBITPATT_DP64 ? PINFBITPATT_DP64 : ret;
          ~~~~~~~~~~~~~~~~~~~~~~~~~~~~~~~~~~~~~~~~~~~~~~~~~ ^
generic/lib/math/clc_powr.cl:360:61: note: place parentheses around the '?:' expression to evaluate it first
    ret = ax < 0x3ff0000000000000L & uy == NINFBITPATT_DP64 ? PINFBITPATT_DP64 : ret;
                                                            ^
                                     (                                              )
generic/lib/math/clc_powr.cl:361:61: warning: operator '?:' has lower precedence than '&'; '&' will be evaluated first [-Wbitwise-conditional-parentheses]
    ret = ax < 0x3ff0000000000000L & uy == PINFBITPATT_DP64 ? 0L : ret;
          ~~~~~~~~~~~~~~~~~~~~~~~~~~~~~~~~~~~~~~~~~~~~~~~~~ ^
generic/lib/math/clc_powr.cl:361:61: note: place parentheses around the '&' expression to silence this warning
    ret = ax < 0x3ff0000000000000L & uy == PINFBITPATT_DP64 ? 0L : ret;
          ~~~~~~~~~~~~~~~~~~~~~~~~~~~~~~~~~~~~~~~~~~~~~~~~~ ^
generic/lib/math/clc_powr.cl:361:61: note: place parentheses around the '?:' expression to evaluate it first
    ret = ax < 0x3ff0000000000000L & uy == PINFBITPATT_DP64 ? 0L : ret;
                                                            ^
                                     (                                )
generic/lib/math/clc_powr.cl:362:61: warning: operator '?:' has lower precedence than '&'; '&' will be evaluated first [-Wbitwise-conditional-parentheses]
    ret = ax == 0x3ff0000000000000L & ay < PINFBITPATT_DP64 ? 0x3ff0000000000000L : ret;
          ~~~~~~~~~~~~~~~~~~~~~~~~~~~~~~~~~~~~~~~~~~~~~~~~~ ^
generic/lib/math/clc_powr.cl:362:61: note: place parentheses around the '&' expression to silence this warning
    ret = ax == 0x3ff0000000000000L & ay < PINFBITPATT_DP64 ? 0x3ff0000000000000L : ret;
          ~~~~~~~~~~~~~~~~~~~~~~~~~~~~~~~~~~~~~~~~~~~~~~~~~ ^
generic/lib/math/clc_powr.cl:362:61: note: place parentheses around the '?:' expression to evaluate it first
    ret = ax == 0x3ff0000000000000L & ay < PINFBITPATT_DP64 ? 0x3ff0000000000000L : ret;
                                                            ^
                                      (                                                )
generic/lib/math/clc_powr.cl:363:62: warning: operator '?:' has lower precedence than '&'; '&' will be evaluated first [-Wbitwise-conditional-parentheses]
    ret = ax == 0x3ff0000000000000L & ay == PINFBITPATT_DP64 ? QNANBITPATT_DP64 : ret;
          ~~~~~~~~~~~~~~~~~~~~~~~~~~~~~~~~~~~~~~~~~~~~~~~~~~ ^
generic/lib/math/clc_powr.cl:363:62: note: place parentheses around the '&' expression to silence this warning
    ret = ax == 0x3ff0000000000000L & ay == PINFBITPATT_DP64 ? QNANBITPATT_DP64 : ret;
          ~~~~~~~~~~~~~~~~~~~~~~~~~~~~~~~~~~~~~~~~~~~~~~~~~~ ^
generic/lib/math/clc_powr.cl:363:62: note: place parentheses around the '?:' expression to evaluate it first
    ret = ax == 0x3ff0000000000000L & ay == PINFBITPATT_DP64 ? QNANBITPATT_DP64 : ret;
                                                             ^
                                      (                                              )
generic/lib/math/clc_powr.cl:364:61: warning: operator '?:' has lower precedence than '&'; '&' will be evaluated first [-Wbitwise-conditional-parentheses]
    ret = ax > 0x3ff0000000000000L & uy == NINFBITPATT_DP64 ? 0L : ret;
          ~~~~~~~~~~~~~~~~~~~~~~~~~~~~~~~~~~~~~~~~~~~~~~~~~ ^
generic/lib/math/clc_powr.cl:364:61: note: place parentheses around the '&' expression to silence this warning
    ret = ax > 0x3ff0000000000000L & uy == NINFBITPATT_DP64 ? 0L : ret;
          ~~~~~~~~~~~~~~~~~~~~~~~~~~~~~~~~~~~~~~~~~~~~~~~~~ ^
generic/lib/math/clc_powr.cl:364:61: note: place parentheses around the '?:' expression to evaluate it first
    ret = ax > 0x3ff0000000000000L & uy == NINFBITPATT_DP64 ? 0L : ret;
                                                            ^
                                     (                                )
generic/lib/math/clc_powr.cl:365:61: warning: operator '?:' has lower precedence than '&'; '&' will be evaluated first [-Wbitwise-conditional-parentheses]
    ret = ax > 0x3ff0000000000000L & uy == PINFBITPATT_DP64 ? PINFBITPATT_DP64 : ret;
          ~~~~~~~~~~~~~~~~~~~~~~~~~~~~~~~~~~~~~~~~~~~~~~~~~ ^
generic/lib/math/clc_powr.cl:365:61: note: place parentheses around the '&' expression to silence this warning
    ret = ax > 0x3ff0000000000000L & uy == PINFBITPATT_DP64 ? PINFBITPATT_DP64 : ret;
          ~~~~~~~~~~~~~~~~~~~~~~~~~~~~~~~~~~~~~~~~~~~~~~~~~ ^
generic/lib/math/clc_powr.cl:365:61: note: place parentheses around the '?:' expression to evaluate it first
    ret = ax > 0x3ff0000000000000L & uy == PINFBITPATT_DP64 ? PINFBITPATT_DP64 : ret;
                                                            ^
                                     (                                              )
generic/lib/math/clc_powr.cl:366:44: warning: operator '?:' has lower precedence than '&'; '&' will be evaluated first [-Wbitwise-conditional-parentheses]
    ret = ux < PINFBITPATT_DP64 & ay == 0L ? 0x3ff0000000000000L : ret;
          ~~~~~~~~~~~~~~~~~~~~~~~~~~~~~~~~ ^
generic/lib/math/clc_powr.cl:366:44: note: place parentheses around the '&' expression to silence this warning
    ret = ux < PINFBITPATT_DP64 & ay == 0L ? 0x3ff0000000000000L : ret;
                                           ^
          (                               )
generic/lib/math/clc_powr.cl:366:44: note: place parentheses around the '?:' expression to evaluate it first
    ret = ux < PINFBITPATT_DP64 & ay == 0L ? 0x3ff0000000000000L : ret;
                                           ^
                                  (                                   )
LLVM-CC nvptx--nvidiacl/lib/math/clc_remainder.cl.bc
14 warnings generated.
LLVM-CC nvptx--nvidiacl/lib/math/remainder.cl.bc
LLVM-CC nvptx--nvidiacl/lib/math/clc_remquo.cl.bc
LLVM-CC nvptx--nvidiacl/lib/math/remquo.cl.bc
LLVM-CC nvptx--nvidiacl/lib/math/rint.cl.bc
LLVM-CC nvptx--nvidiacl/lib/math/clc_rootn.cl.bc
LLVM-CC nvptx--nvidiacl/lib/math/rootn.cl.bc
LLVM-CC nvptx--nvidiacl/lib/math/round.cl.bc
LLVM-CC nvptx--nvidiacl/lib/math/sin.cl.bc
LLVM-CC nvptx--nvidiacl/lib/math/sincos.cl.bc
LLVM-CC nvptx--nvidiacl/lib/math/sincos_helpers.cl.bc
LLVM-CC nvptx--nvidiacl/lib/math/sinh.cl.bc
generic/lib/math/sincos_helpers.cl:82:50: warning: operator '?:' has lower precedence than '&'; '&' will be evaluated first [-Wbitwise-conditional-parentheses]
    qx = (ix >= 0x3e99999a) & (ix <= 0x3f480000) ? xby4 : qx;
         ~~~~~~~~~~~~~~~~~~~~~~~~~~~~~~~~~~~~~~~ ^
generic/lib/math/sincos_helpers.cl:82:50: note: place parentheses around the '&' expression to silence this warning
    qx = (ix >= 0x3e99999a) & (ix <= 0x3f480000) ? xby4 : qx;
                                                 ^
         (                                      )
generic/lib/math/sincos_helpers.cl:82:50: note: place parentheses around the '?:' expression to evaluate it first
    qx = (ix >= 0x3e99999a) & (ix <= 0x3f480000) ? xby4 : qx;
                                                 ^
                              (                             )
1 warning generated.
LLVM-CC nvptx--nvidiacl/lib/math/sinpi.cl.bc
generic/lib/math/sinh.cl:97:52: warning: operator '?:' has lower precedence than '|'; '|' will be evaluated first [-Wbitwise-conditional-parentheses]
    z = aux > PINFBITPATT_SP32 | aux < 0x38800000U ? x : z;
        ~~~~~~~~~~~~~~~~~~~~~~~~~~~~~~~~~~~~~~~~~~ ^
generic/lib/math/sinh.cl:97:52: note: place parentheses around the '|' expression to silence this warning
    z = aux > PINFBITPATT_SP32 | aux < 0x38800000U ? x : z;
                                                   ^
        (                                         )
generic/lib/math/sinh.cl:97:52: note: place parentheses around the '?:' expression to evaluate it first
    z = aux > PINFBITPATT_SP32 | aux < 0x38800000U ? x : z;
                                                   ^
                                 (                        )
1 warning generated.
LLVM-CC nvptx--nvidiacl/lib/math/clc_sqrt.cl.bc
LLVM-CC nvptx--nvidiacl/lib/math/sqrt.cl.bc
LLVM-CC nvptx--nvidiacl/lib/math/clc_tan.cl.bc
LLVM-CC nvptx--nvidiacl/lib/math/tan.cl.bc
LLVM-CC nvptx--nvidiacl/lib/math/tanh.cl.bc
LLVM-CC nvptx--nvidiacl/lib/math/clc_tanpi.cl.bc
generic/lib/math/tanh.cl:70:45: warning: operator '?:' has lower precedence than '|'; '|' will be evaluated first [-Wbitwise-conditional-parentheses]
    z = aux < 0x39000000 | aux > 0x7f800000 ? x : z;
        ~~~~~~~~~~~~~~~~~~~~~~~~~~~~~~~~~~~ ^
generic/lib/math/tanh.cl:70:45: note: place parentheses around the '|' expression to silence this warning
    z = aux < 0x39000000 | aux > 0x7f800000 ? x : z;
                                            ^
        (                                  )
generic/lib/math/tanh.cl:70:45: note: place parentheses around the '?:' expression to evaluate it first
    z = aux < 0x39000000 | aux > 0x7f800000 ? x : z;
                                            ^
                           (                       )
generic/lib/math/tanh.cl:137:47: warning: operator '?:' has lower precedence than '|'; '|' will be evaluated first [-Wbitwise-conditional-parentheses]
    z = y < 0x1.0p-28 | ax > PINFBITPATT_DP64 ? x : z;
        ~~~~~~~~~~~~~~~~~~~~~~~~~~~~~~~~~~~~~ ^
generic/lib/math/tanh.cl:137:47: note: place parentheses around the '|' expression to silence this warning
    z = y < 0x1.0p-28 | ax > PINFBITPATT_DP64 ? x : z;
        ~~~~~~~~~~~~~~~~~~~~~~~~~~~~~~~~~~~~~ ^
generic/lib/math/tanh.cl:137:47: note: place parentheses around the '?:' expression to evaluate it first
    z = y < 0x1.0p-28 | ax > PINFBITPATT_DP64 ? x : z;
                                              ^
                        (                            )
2 warnings generated.
LLVM-CC nvptx--nvidiacl/lib/math/tanpi.cl.bc
LLVM-CC nvptx--nvidiacl/lib/math/tgamma.cl.bc
LLVM-CC nvptx--nvidiacl/lib/math/trunc.cl.bc
LLVM-CC nvptx--nvidiacl/lib/misc/shuffle.cl.bc
LLVM-CC nvptx--nvidiacl/lib/misc/shuffle2.cl.bc
LLVM-CC nvptx--nvidiacl/lib/relational/all.cl.bc
LLVM-CC nvptx--nvidiacl/lib/relational/any.cl.bc
LLVM-CC nvptx--nvidiacl/lib/relational/bitselect.cl.bc
LLVM-CC nvptx--nvidiacl/lib/relational/isequal.cl.bc
LLVM-CC nvptx--nvidiacl/lib/relational/isfinite.cl.bc
LLVM-CC nvptx--nvidiacl/lib/relational/isgreater.cl.bc
LLVM-CC nvptx--nvidiacl/lib/relational/isgreaterequal.cl.bc
LLVM-CC nvptx--nvidiacl/lib/relational/isinf.cl.bc
LLVM-CC nvptx--nvidiacl/lib/relational/isless.cl.bc
LLVM-CC nvptx--nvidiacl/lib/relational/islessequal.cl.bc
LLVM-CC nvptx--nvidiacl/lib/relational/islessgreater.cl.bc
LLVM-CC nvptx--nvidiacl/lib/relational/isnan.cl.bc
LLVM-CC nvptx--nvidiacl/lib/relational/isnormal.cl.bc
LLVM-CC nvptx--nvidiacl/lib/relational/isnotequal.cl.bc
LLVM-CC nvptx--nvidiacl/lib/relational/isordered.cl.bc
LLVM-CC nvptx--nvidiacl/lib/relational/isunordered.cl.bc
LLVM-CC nvptx--nvidiacl/lib/relational/select.cl.bc
LLVM-CC nvptx--nvidiacl/lib/relational/signbit.cl.bc
LLVM-CC nvptx--nvidiacl/lib/shared/clamp.cl.bc
LLVM-CC nvptx--nvidiacl/lib/shared/max.cl.bc
LLVM-CC nvptx--nvidiacl/lib/shared/min.cl.bc
LLVM-CC nvptx--nvidiacl/lib/shared/vload.cl.bc
LLVM-CC nvptx--nvidiacl/lib/shared/vstore.cl.bc
LLVM-CC nvptx--nvidiacl/lib/workitem/get_global_size.cl.bc
CXX utils/prepare-builtins.o
In file included from utils/prepare-builtins.cpp:2:
In file included from /usr/local/llvm10/include/llvm/Bitcode/BitcodeReader.h:16:
In file included from /usr/local/llvm10/include/llvm/ADT/ArrayRef.h:12:
In file included from /usr/local/llvm10/include/llvm/ADT/Hashing.h:47:
In file included from /usr/local/llvm10/include/llvm/Support/DataTypes.h:16:
/usr/local/llvm10/include/llvm-c/DataTypes.h:28:10: fatal error: 'cmath' file not found
#include <cmath>
         ^~~~~~~
1 error generated.
gmake[1]: *** [Makefile:9: utils/prepare-builtins.o] Error 1
gmake[1]: *** Waiting for unfinished jobs....
gmake[1]: Leaving directory '/wrkdirs/usr/ports/devel/libclc/work/libclc-9f6204e'
===> Compilation failed unexpectedly.
Try to set MAKE_JOBS_UNSAFE=yes and rebuild before reporting the failure to
the maintainer.
*** Error code 1

Stop.
make: stopped in /usr/ports/devel/libclc
Received on Tue Jun 22 2021 - 03:15:46 UTC

Original text of this message