[package - 122powerpc64-quarterly][devel/llvm80] Failed for llvm80-8.0.1_4 in build

From: <pkg-fallout_at_FreeBSD.org>
Date: Tue, 22 Jun 2021 03:10:40 GMT
You are receiving this mail as a port that you maintain
is failing to build on the FreeBSD package build server.
Please investigate the failure and submit a PR to fix
build.

Maintainer:     brooks_at_FreeBSD.org
Log URL:        http://foul1.nyi.freebsd.org/data/122powerpc64-quarterly/dbe1c4c35016/logs/llvm80-8.0.1_4.log
Build URL:      http://foul1.nyi.freebsd.org/build.html?mastername=122powerpc64-quarterly&build=dbe1c4c35016
Log:

=>> Building devel/llvm80
build started at Tue Jun 22 03:06:13 UTC 2021
port directory: /usr/ports/devel/llvm80
package name: llvm80-8.0.1_4
building for: FreeBSD 122powerpc64-quarterly-job-02 12.2-RELEASE FreeBSD 12.2-RELEASE powerpc
maintained by: brooks_at_FreeBSD.org
Makefile ident: 
Poudriere version: 3.2.8-8-gaf08dbda
Host OSVERSION: 1400008
Jail OSVERSION: 1202000
Job Id: 02

---Begin Environment---
SHELL=/bin/csh
OSVERSION=1202000
UNAME_v=FreeBSD 12.2-RELEASE
UNAME_r=12.2-RELEASE
BLOCKSIZE=K
MAIL=/var/mail/root
STATUS=1
HOME=/root
PATH=/sbin:/bin:/usr/sbin:/usr/bin:/usr/local/sbin:/usr/local/bin:/root/bin
LOCALBASE=/usr/local
USER=root
LIBEXECPREFIX=/usr/local/libexec/poudriere
POUDRIERE_VERSION=3.2.8-8-gaf08dbda
MASTERMNT=/usr/local/poudriere/data/.m/122powerpc64-quarterly/ref
POUDRIERE_BUILD_TYPE=bulk
PACKAGE_BUILDING=yes
SAVED_TERM=
PWD=/usr/local/poudriere/data/.m/122powerpc64-quarterly/ref/.p/pool
P_PORTS_FEATURES=FLAVORS SELECTED_OPTIONS
MASTERNAME=122powerpc64-quarterly
SCRIPTPREFIX=/usr/local/share/poudriere
OLDPWD=/usr/local/poudriere/data/.m/122powerpc64-quarterly/ref/.p
SCRIPTPATH=/usr/local/share/poudriere/bulk.sh
POUDRIEREPATH=/usr/local/bin/poudriere
---End Environment---

---Begin Poudriere Port Flags/Env---
PORT_FLAGS=
PKGENV=
FLAVOR=
DEPENDS_ARGS=
MAKE_ARGS=
---End Poudriere Port Flags/Env---

---Begin OPTIONS List---
===> The following configuration options are available for llvm80-8.0.1_4:
     BE_AMDGPU=on: AMD GPU backend (required by mesa)
     CLANG=on: Build clang
     DOCS=on: Build and/or install documentation
     EXTRAS=on: Extra clang tools
     GOLD=off: Build the LLVM Gold plugin for LTO
     LIT=on: Install lit and FileCheck test tools
     LLD=on: Install lld, the LLVM linker
     LLDB=on: Install lldb, the LLVM debugger
     OPENMP=on: Install libomp, the LLVM OpenMP runtime library
     PYCLANG=on: Install python bindings to libclang
====> Options available for the single BACKENDS: you have to select exactly one of them
     BE_FREEBSD=off: Backends for FreeBSD architectures
     BE_NATIVE=off: Backend(s) for this architecture (PowerPC)
     BE_STANDARD=on: All non-experimental backends
===> Use 'make config' to modify these settings
---End OPTIONS List---

--MAINTAINER--
brooks_at_FreeBSD.org
--End MAINTAINER--

--CONFIGURE_ARGS--

--End CONFIGURE_ARGS--

--CONFIGURE_ENV--
ac_cv_path_PERL=/usr/local/bin/perl ac_cv_path_PERL_PATH=/usr/local/bin/perl  PERL_USE_UNSAFE_INC=1 PYTHON="/usr/local/bin/python3.7" XDG_DATA_HOME=/wrkdirs/usr/ports/devel/llvm80/work  XDG_CONFIG_HOME=/wrkdirs/usr/ports/devel/llvm80/work  HOME=/wrkdirs/usr/ports/devel/llvm80/work TMPDIR="/tmp" PATH=/wrkdirs/usr/ports/devel/llvm80/work/.bin:/sbin:/bin:/usr/sbin:/usr/bin:/usr/local/sbin:/usr/local/bin:/root/bin SHELL=/bin/sh CONFIG_SHELL=/bin/sh CMAKE_PREFIX_PATH="/usr/local" LANG=en_US.UTF-8 LC_ALL=en_US.UTF-8
--End CONFIGURE_ENV--

--MAKE_ENV--
PERL_USE_UNSAFE_INC=1 XDG_DATA_HOME=/wrkdirs/usr/ports/devel/llvm80/work  XDG_CONFIG_HOME=/wrkdirs/usr/ports/devel/llvm80/work  HOME=/wrkdirs/usr/ports/devel/llvm80/work TMPDIR="/tmp" PATH=/wrkdirs/usr/ports/devel/llvm80/work/.bin:/sbin:/bin:/usr/sbin:/usr/bin:/usr/local/sbin:/usr/local/bin:/root/bin NO_PIE=yes MK_DEBUG_FILES=no MK_KERNEL_SYMBOLS=no SHELL=/bin/sh NO_LINT=YES ADDR2LINE="/usr/local/bin/addr2line" AR="/usr/local/bin/ar" AS="/usr/local/bin/as" CPPFILT="/usr/local/bin/c++filt" GPROF="/usr/local/bin/gprof" LD="/usr/local/bin/ld" NM="/usr/local/bin/nm" OBJCOPY="/usr/local/bin/objcopy" OBJDUMP="/usr/local/bin/objdump" RANLIB="/usr/local/bin/ranlib" READELF="/usr/local/bin/readelf" SIZE="/usr/local/bin/size" STRINGS="/usr/local/bin/strings" DESTDIR=/wrkdirs/usr/ports/devel/llvm80/work/stage LANG=en_US.UTF-8 LC_ALL=en_US.UTF-8 PREFIX=/usr/local  LOCALBASE=/usr/local  CC="gcc10" CFLAGS="-O2 -pipe  -DNDEBUG -fstack-protector-strong -Wl,-rpath=/usr/local/lib/gcc10 -isystem /usr/l
 ocal/include -fno-strict-aliasing "  CPP="cpp10" CPPFLAGS="-isystem /usr/local/include"  LDFLAGS=" -fstack-protector-strong -Wl,-rpath=/usr/local/lib/gcc10 -L/usr/local/lib/gcc10 " LIBS="libclangApplyReplacements  libclangChangeNamespace  libclangDaemon  libclangDoc  libclangIncludeFixer  libclangMove  libclangQuery  libclangRename  libclangReorderFields  libclangTidy  libclangTidyGoogleModule  libclangTidyLLVMModule  libclangTidyMiscModule  libclangTidyReadabilityModule  libclangTidyUtils  libfindAllSymbols  libmodernizeCore -L/usr/local/lib"  CXX="g++10" CXXFLAGS="-O2 -pipe  -DNDEBUG -fstack-protector-strong -Wl,-rpath=/usr/local/lib/gcc10  -DNDEBUG -Wl,-rpath=/usr/local/lib/gcc10 -isystem /usr/local/include "  MANPREFIX="/usr/local" BSD_INSTALL_PROGRAM="install  -s -m 555"  BSD_INSTALL_LIB="install  -s -m 0644"  BSD_INSTALL_SCRIPT="install  -m 555"  BSD_INSTALL_DATA="install  -m 0644"  BSD_INSTALL_MAN="install  -m 444"
--End MAKE_ENV--

--PLIST_SUB--
LLVM_RELEASE=8.0.1  LLVM_SUFFIX=80  LLVM_MAJOR=8 PORTDOCS="" BE_AMDGPU="" NO_BE_AMDGPU="_at_comment " BE_FREEBSD="_at_comment " NO_BE_FREEBSD="" BE_NATIVE="_at_comment " NO_BE_NATIVE="" BE_STANDARD="" NO_BE_STANDARD="_at_comment " CLANG="" NO_CLANG="_at_comment " DOCS="" NO_DOCS="_at_comment " EXTRAS="" NO_EXTRAS="_at_comment " GOLD="_at_comment " NO_GOLD="" LIT="" NO_LIT="_at_comment " LLD="" NO_LLD="_at_comment " LLDB="" NO_LLDB="_at_comment " OPENMP="" NO_OPENMP="_at_comment " PYCLANG="" NO_PYCLANG="_at_comment " CMAKE_BUILD_TYPE="release" PYTHON_INCLUDEDIR=include/python3.7m  PYTHON_LIBDIR=lib/python3.7  PYTHON_PLATFORM=freebsd12  PYTHON_SITELIBDIR=lib/python3.7/site-packages  PYTHON_SUFFIX=37  PYTHON_EXT_SUFFIX=  PYTHON_VER=3.7  PYTHON_VERSION=python3.7 PYTHON2="_at_comment " PYTHON3="" GTK2_VERSION="2.10.0"  GTK3_VERSION="3.0.0" COMPILER_RT="_at_comment " OSREL=12.2 PREFIX=%D LOCALBASE=/usr/local  RESETPREFIX=/usr/local LIB32DIR=lib PERL_VERSION=5.32.1  PERL_VER=5.32  PERL5_MAN1=lib/perl5/site_perl/man/man1  PERL5_MAN3=li
 b/perl5/site_perl/man/man3  SITE_PERL=lib/perl5/site_perl  SITE_ARCH=lib/perl5/site_perl/mach/5.32 DOCSDIR="share/doc/llvm80"  EXAMPLESDIR="share/examples/llvm"  DATADIR="share/llvm80"  WWWDIR="www/llvm"  ETCDIR="etc/llvm"
--End PLIST_SUB--

--SUB_LIST--
LLVM_PREFIX="/usr/local/llvm80" LLVM_SUFFIX="80" BE_AMDGPU="" NO_BE_AMDGPU="_at_comment " BE_FREEBSD="_at_comment " NO_BE_FREEBSD="" BE_NATIVE="_at_comment " NO_BE_NATIVE="" BE_STANDARD="" NO_BE_STANDARD="_at_comment " CLANG="" NO_CLANG="_at_comment " DOCS="" NO_DOCS="_at_comment " EXTRAS="" NO_EXTRAS="_at_comment " GOLD="_at_comment " NO_GOLD="" LIT="" NO_LIT="_at_comment " LLD="" NO_LLD="_at_comment " LLDB="" NO_LLDB="_at_comment " OPENMP="" NO_OPENMP="_at_comment " PYCLANG="" NO_PYCLANG="_at_comment " PREFIX=/usr/local LOCALBASE=/usr/local  DATADIR=/usr/local/share/llvm80 DOCSDIR=/usr/local/share/doc/llvm80 EXAMPLESDIR=/usr/local/share/examples/llvm  WWWDIR=/usr/local/www/llvm ETCDIR=/usr/local/etc/llvm
--End SUB_LIST--

---Begin make.conf---
USE_PACKAGE_DEPENDS=yes
BATCH=yes
WRKDIRPREFIX=/wrkdirs
PORTSDIR=/usr/ports
PACKAGES=/packages
DISTDIR=/distfiles
PACKAGE_BUILDING=yes
PACKAGE_BUILDING_FLAVORS=yes
#### /usr/local/etc/poudriere.d/make.conf ####
# XXX: We really need this but cannot use it while 'make checksum' does not
# try the next mirror on checksum failure.  It currently retries the same
# failed mirror and then fails rather then trying another.  It *does*
# try the next if the size is mismatched though.
#MASTER_SITE_FREEBSD=yes
# Build ALLOW_MAKE_JOBS_PACKAGES with 2 jobs
MAKE_JOBS_NUMBER=2
#### /usr/ports/Mk/Scripts/ports_env.sh ####
_CCVERSION_921dbbb2=cc (GCC) 4.2.1 20070831 patched [FreeBSD] Copyright (C) 2007 Free Software Foundation, Inc. This is free software; see the source for copying conditions. There is NO warranty; not even for MERCHANTABILITY or FITNESS FOR A PARTICULAR PURPOSE.
_ALTCCVERSION_921dbbb2=none
_CXXINTERNAL_acaad9ca=Using built-in specs. Target: powerpc64-undermydesk-freebsd Configured with: FreeBSD/powerpc64 system compiler Thread model: posix gcc version 4.2.1 20070831 patched [FreeBSD] "/usr/bin/ld" "--eh-frame-hdr" "-Qy" "-melf64ppc_fbsd" "--enable-new-dtags" "-dynamic-linker" "/libexec/ld-elf.so.1" "/usr/lib/crt1.o" "/usr/lib/crti.o" "/usr/lib/crtbegin.o" "-L/usr/lib" "-L/usr/lib" "/dev/null" "-lstdc++" "-lm" "-lgcc_s" "-lgcc" "-lc" "-lgcc_s" "-lgcc" "/usr/lib/crtsavres.o" "/usr/lib/crtend.o" "/usr/lib/crtn.o"
CC_OUTPUT_921dbbb2_58173849=yes
CC_OUTPUT_921dbbb2_9bdba57c=yes
CC_OUTPUT_921dbbb2_6a4fe7f5=cc1: error: unrecognized command line option "-std=c11"
CC_OUTPUT_921dbbb2_6bcac02b=yes
CC_OUTPUT_921dbbb2_67d20829=yes
CC_OUTPUT_921dbbb2_bfa62e83=cc1: error: unrecognized command line option "-std=gnu11"
CC_OUTPUT_921dbbb2_f0b4d593=yes
CC_OUTPUT_921dbbb2_308abb44=cc1plus: error: unrecognized command line option "-std=c++0x"
CC_OUTPUT_921dbbb2_f00456e5=cc1plus: error: unrecognized command line option "-std=c++11"
CC_OUTPUT_921dbbb2_65ad290d=cc1plus: error: unrecognized command line option "-std=c++14"
CC_OUTPUT_921dbbb2_f2776b26=cc1plus: error: unrecognized command line option "-std=c++17"
CC_OUTPUT_921dbbb2_b2657cc3=yes
CC_OUTPUT_921dbbb2_380987f7=cc1plus: error: unrecognized command line option "-std=gnu++11"
CC_OUTPUT_921dbbb2_160933ec=cc1plus: error: unrecognized command line option "-std=gnu++14"
CC_OUTPUT_921dbbb2_fb62803b=cc1plus: error: unrecognized command line option "-std=gnu++17"
_OBJC_CCVERSION_921dbbb2=cc (GCC) 4.2.1 20070831 patched [FreeBSD] Copyright (C) 2007 Free Software Foundation, Inc. This is free software; see the source for copying conditions. There is NO warranty; not even for MERCHANTABILITY or FITNESS FOR A PARTICULAR PURPOSE.
_OBJC_ALTCCVERSION_921dbbb2=none
ARCH=powerpc64
PPC_ABI=ELFv1
OPSYS=FreeBSD
_OSRELEASE=12.2-RELEASE
OSREL=12.2
OSVERSION=1202000
PYTHONBASE=/usr/local
CONFIGURE_MAX_CMD_LEN=524288
HAVE_PORTS_ENV=1
#### Misc Poudriere ####
GID=0
UID=0
---End make.conf---
--Resource limits--
cpu time               (seconds, -t)  unlimited
file size           (512-blocks, -f)  unlimited
data seg size           (kbytes, -d)  33554432
stack size              (kbytes, -s)  524288
core file size      (512-blocks, -c)  unlimited
max memory size         (kbytes, -m)  unlimited
locked memory           (kbytes, -l)  unlimited
max user processes              (-u)  89999
open files                      (-n)  1024
virtual mem size        (kbytes, -v)  unlimited
swap limit              (kbytes, -w)  unlimited
socket buffer size       (bytes, -b)  unlimited
pseudo-terminals                (-p)  unlimited
kqueues                         (-k)  unlimited
umtx shared locks               (-o)  unlimited
--End resource limits--
=======================<phase: check-sanity   >============================
===>  License ARM BSD3CLAUSE LLVM MIT PD REGEX accepted by the user
===========================================================================
=======================<phase: pkg-depends    >============================
===>   llvm80-8.0.1_4 depends on file: /usr/local/sbin/pkg - not found
===>   Installing existing package /packages/All/pkg-1.16.3.txz
[122powerpc64-quarterly-job-02] Installing pkg-1.16.3...
[122powerpc64-quarterly-job-02] Extracting pkg-1.16.3: .......... done
===>   llvm80-8.0.1_4 depends on file: /usr/local/sbin/pkg - found
===>   Returning to build of llvm80-8.0.1_4
===========================================================================
=======================<phase: fetch-depends  >============================
===========================================================================
=======================<phase: fetch          >============================
===>  License ARM BSD3CLAUSE LLVM MIT PD REGEX accepted by the user
===> Fetching all distfiles required by llvm80-8.0.1_4 for building
===========================================================================
=======================<phase: checksum       >============================
===>  License ARM BSD3CLAUSE LLVM MIT PD REGEX accepted by the user
===> Fetching all distfiles required by llvm80-8.0.1_4 for building
=> SHA256 Checksum OK for llvm-8.0.1.src.tar.xz.
=> SHA256 Checksum OK for cfe-8.0.1.src.tar.xz.
=> SHA256 Checksum OK for clang-tools-extra-8.0.1.src.tar.xz.
=> SHA256 Checksum OK for lld-8.0.1.src.tar.xz.
=> SHA256 Checksum OK for lldb-8.0.1.src.tar.xz.
=> SHA256 Checksum OK for openmp-8.0.1.src.tar.xz.
===========================================================================
=======================<phase: extract-depends>============================
===========================================================================
=======================<phase: extract        >============================
===>  License ARM BSD3CLAUSE LLVM MIT PD REGEX accepted by the user
===> Fetching all distfiles required by llvm80-8.0.1_4 for building
===>  Extracting for llvm80-8.0.1_4
=> SHA256 Checksum OK for llvm-8.0.1.src.tar.xz.
=> SHA256 Checksum OK for cfe-8.0.1.src.tar.xz.
=> SHA256 Checksum OK for clang-tools-extra-8.0.1.src.tar.xz.
=> SHA256 Checksum OK for lld-8.0.1.src.tar.xz.
=> SHA256 Checksum OK for lldb-8.0.1.src.tar.xz.
=> SHA256 Checksum OK for openmp-8.0.1.src.tar.xz.
/bin/mv /wrkdirs/usr/ports/devel/llvm80/work/cfe-8.0.1.src /wrkdirs/usr/ports/devel/llvm80/work/llvm-8.0.1.src/tools/clang
/bin/mv /wrkdirs/usr/ports/devel/llvm80/work/clang-tools-extra-8.0.1.src /wrkdirs/usr/ports/devel/llvm80/work/llvm-8.0.1.src/tools/clang/tools/extra
<snip>
/wrkdirs/usr/ports/devel/llvm80/work/llvm-8.0.1.src/lib/Demangle/MicrosoftDemangle.cpp:1680:30: error: 'struct llvm::ms_demangle::TypeNode' has no member named 'Quals'
 1680 |   Ty->Quals = Qualifiers(Ty->Quals | Quals);
      |                              ^~~~~
/wrkdirs/usr/ports/devel/llvm80/work/llvm-8.0.1.src/lib/Demangle/MicrosoftDemangle.cpp:1680:38: error: 'Quals' was not declared in this scope
 1680 |   Ty->Quals = Qualifiers(Ty->Quals | Quals);
      |                                      ^~~~~
/wrkdirs/usr/ports/devel/llvm80/work/llvm-8.0.1.src/lib/Demangle/MicrosoftDemangle.cpp: In member function 'llvm::ms_demangle::FunctionSignatureNode* llvm::ms_demangle::Demangler::demangleFunctionType(StringView&, bool)':
/wrkdirs/usr/ports/devel/llvm80/work/llvm-8.0.1.src/lib/Demangle/MicrosoftDemangle.cpp:1699:10: error: 'struct llvm::ms_demangle::FunctionSignatureNode' has no member named 'Quals'
 1699 |     FTy->Quals = demanglePointerExtQualifiers(MangledName);
      |          ^~~~~
/wrkdirs/usr/ports/devel/llvm80/work/llvm-8.0.1.src/lib/Demangle/MicrosoftDemangle.cpp:1699:18: error: 'demanglePointerExtQualifiers' was not declared in this scope; did you mean 'demanglePointerCVQualifiers'?
 1699 |     FTy->Quals = demanglePointerExtQualifiers(MangledName);
      |                  ^~~~~~~~~~~~~~~~~~~~~~~~~~~~
      |                  demanglePointerCVQualifiers
/wrkdirs/usr/ports/devel/llvm80/work/llvm-8.0.1.src/lib/Demangle/MicrosoftDemangle.cpp:1701:10: error: 'struct llvm::ms_demangle::FunctionSignatureNode' has no member named 'Quals'
 1701 |     FTy->Quals = Qualifiers(FTy->Quals | demangleQualifiers(MangledName).first);
      |          ^~~~~
/wrkdirs/usr/ports/devel/llvm80/work/llvm-8.0.1.src/lib/Demangle/MicrosoftDemangle.cpp:1701:34: error: 'struct llvm::ms_demangle::FunctionSignatureNode' has no member named 'Quals'
 1701 |     FTy->Quals = Qualifiers(FTy->Quals | demangleQualifiers(MangledName).first);
      |                                  ^~~~~
/wrkdirs/usr/ports/devel/llvm80/work/llvm-8.0.1.src/lib/Demangle/MicrosoftDemangle.cpp:1701:74: error: request for member 'first' in '((llvm::ms_demangle::Demangler*)this)->llvm::ms_demangle::Demangler::demangleQualifiers((* & MangledName))', which is of non-class type 'int'
 1701 |     FTy->Quals = Qualifiers(FTy->Quals | demangleQualifiers(MangledName).first);
      |                                                                          ^~~~~
/wrkdirs/usr/ports/devel/llvm80/work/llvm-8.0.1.src/lib/Demangle/MicrosoftDemangle.cpp:1701:18: error: 'Qualifiers' was not declared in this scope
 1701 |     FTy->Quals = Qualifiers(FTy->Quals | demangleQualifiers(MangledName).first);
      |                  ^~~~~~~~~~
/wrkdirs/usr/ports/devel/llvm80/work/llvm-8.0.1.src/lib/Demangle/MicrosoftDemangle.cpp:1705:8: error: 'struct llvm::ms_demangle::FunctionSignatureNode' has no member named 'CallConvention'
 1705 |   FTy->CallConvention = demangleCallingConvention(MangledName);
      |        ^~~~~~~~~~~~~~
/wrkdirs/usr/ports/devel/llvm80/work/llvm-8.0.1.src/lib/Demangle/MicrosoftDemangle.cpp:1705:25: error: 'demangleCallingConvention' was not declared in this scope
 1705 |   FTy->CallConvention = demangleCallingConvention(MangledName);
      |                         ^~~~~~~~~~~~~~~~~~~~~~~~~
/wrkdirs/usr/ports/devel/llvm80/work/llvm-8.0.1.src/lib/Demangle/MicrosoftDemangle.cpp: In member function 'llvm::ms_demangle::FunctionSymbolNode* llvm::ms_demangle::Demangler::demangleFunctionEncoding(StringView&)':
/wrkdirs/usr/ports/devel/llvm80/work/llvm-8.0.1.src/lib/Demangle/MicrosoftDemangle.cpp:1722:3: error: 'FuncClass' was not declared in this scope
 1722 |   FuncClass ExtraFlags = FC_None;
      |   ^~~~~~~~~
/wrkdirs/usr/ports/devel/llvm80/work/llvm-8.0.1.src/lib/Demangle/MicrosoftDemangle.cpp:1724:5: error: 'ExtraFlags' was not declared in this scope
 1724 |     ExtraFlags = FC_ExternC;
      |     ^~~~~~~~~~
/wrkdirs/usr/ports/devel/llvm80/work/llvm-8.0.1.src/lib/Demangle/MicrosoftDemangle.cpp:1724:18: error: 'FC_ExternC' was not declared in this scope
 1724 |     ExtraFlags = FC_ExternC;
      |                  ^~~~~~~~~~
/wrkdirs/usr/ports/devel/llvm80/work/llvm-8.0.1.src/lib/Demangle/MicrosoftDemangle.cpp:1726:12: error: expected ';' before 'FC'
 1726 |   FuncClass FC = demangleFunctionClass(MangledName);
      |            ^~~
      |            ;
/wrkdirs/usr/ports/devel/llvm80/work/llvm-8.0.1.src/lib/Demangle/MicrosoftDemangle.cpp:1727:3: error: 'FC' was not declared in this scope
 1727 |   FC = FuncClass(ExtraFlags | FC);
      |   ^~
/wrkdirs/usr/ports/devel/llvm80/work/llvm-8.0.1.src/lib/Demangle/MicrosoftDemangle.cpp:1727:18: error: 'ExtraFlags' was not declared in this scope
 1727 |   FC = FuncClass(ExtraFlags | FC);
      |                  ^~~~~~~~~~
/wrkdirs/usr/ports/devel/llvm80/work/llvm-8.0.1.src/lib/Demangle/MicrosoftDemangle.cpp:1731:12: error: 'FC_StaticThisAdjust' was not declared in this scope
 1731 |   if (FC & FC_StaticThisAdjust) {
      |            ^~~~~~~~~~~~~~~~~~~
/wrkdirs/usr/ports/devel/llvm80/work/llvm-8.0.1.src/lib/Demangle/MicrosoftDemangle.cpp:1733:21: error: 'struct llvm::ms_demangle::ThunkSignatureNode::ThisAdjustor' has no member named 'StaticOffset'
 1733 |     TTN->ThisAdjust.StaticOffset = demangleSigned(MangledName);
      |                     ^~~~~~~~~~~~
/wrkdirs/usr/ports/devel/llvm80/work/llvm-8.0.1.src/lib/Demangle/MicrosoftDemangle.cpp:1734:19: error: 'FC_VirtualThisAdjust' was not declared in this scope
 1734 |   } else if (FC & FC_VirtualThisAdjust) {
      |                   ^~~~~~~~~~~~~~~~~~~~
/wrkdirs/usr/ports/devel/llvm80/work/llvm-8.0.1.src/lib/Demangle/MicrosoftDemangle.cpp:1736:14: error: 'FC_VirtualThisAdjustEx' was not declared in this scope
 1736 |     if (FC & FC_VirtualThisAdjustEx) {
      |              ^~~~~~~~~~~~~~~~~~~~~~
/wrkdirs/usr/ports/devel/llvm80/work/llvm-8.0.1.src/lib/Demangle/MicrosoftDemangle.cpp:1737:23: error: 'struct llvm::ms_demangle::ThunkSignatureNode::ThisAdjustor' has no member named 'VBPtrOffset'
 1737 |       TTN->ThisAdjust.VBPtrOffset = demangleSigned(MangledName);
      |                       ^~~~~~~~~~~
/wrkdirs/usr/ports/devel/llvm80/work/llvm-8.0.1.src/lib/Demangle/MicrosoftDemangle.cpp:1738:23: error: 'struct llvm::ms_demangle::ThunkSignatureNode::ThisAdjustor' has no member named 'VBOffsetOffset'
 1738 |       TTN->ThisAdjust.VBOffsetOffset = demangleSigned(MangledName);
      |                       ^~~~~~~~~~~~~~
/wrkdirs/usr/ports/devel/llvm80/work/llvm-8.0.1.src/lib/Demangle/MicrosoftDemangle.cpp:1740:21: error: 'struct llvm::ms_demangle::ThunkSignatureNode::ThisAdjustor' has no member named 'VtordispOffset'
 1740 |     TTN->ThisAdjust.VtordispOffset = demangleSigned(MangledName);
      |                     ^~~~~~~~~~~~~~
/wrkdirs/usr/ports/devel/llvm80/work/llvm-8.0.1.src/lib/Demangle/MicrosoftDemangle.cpp:1741:21: error: 'struct llvm::ms_demangle::ThunkSignatureNode::ThisAdjustor' has no member named 'StaticOffset'
 1741 |     TTN->ThisAdjust.StaticOffset = demangleSigned(MangledName);
      |                     ^~~~~~~~~~~~
/wrkdirs/usr/ports/devel/llvm80/work/llvm-8.0.1.src/lib/Demangle/MicrosoftDemangle.cpp:1744:12: error: 'FC_NoParameterList' was not declared in this scope
 1744 |   if (FC & FC_NoParameterList) {
      |            ^~~~~~~~~~~~~~~~~~
/wrkdirs/usr/ports/devel/llvm80/work/llvm-8.0.1.src/lib/Demangle/MicrosoftDemangle.cpp:1750:33: error: 'FC_Global' was not declared in this scope
 1750 |     bool HasThisQuals = !(FC & (FC_Global | FC_Static));
      |                                 ^~~~~~~~~
/wrkdirs/usr/ports/devel/llvm80/work/llvm-8.0.1.src/lib/Demangle/MicrosoftDemangle.cpp:1750:45: error: 'FC_Static' was not declared in this scope
 1750 |     bool HasThisQuals = !(FC & (FC_Global | FC_Static));
      |                                             ^~~~~~~~~
/wrkdirs/usr/ports/devel/llvm80/work/llvm-8.0.1.src/lib/Demangle/MicrosoftDemangle.cpp:1757:8: error: 'struct llvm::ms_demangle::FunctionSignatureNode' has no member named 'FunctionClass'
 1757 |   FSN->FunctionClass = FC;
      |        ^~~~~~~~~~~~~
/wrkdirs/usr/ports/devel/llvm80/work/llvm-8.0.1.src/lib/Demangle/MicrosoftDemangle.cpp: In member function 'llvm::ms_demangle::PointerTypeNode* llvm::ms_demangle::Demangler::demanglePointerType(StringView&)':
/wrkdirs/usr/ports/devel/llvm80/work/llvm-8.0.1.src/lib/Demangle/MicrosoftDemangle.cpp:1868:21: error: 'struct llvm::ms_demangle::PointerTypeNode' has no member named 'Quals'
 1868 |   std::tie(Pointer->Quals, Pointer->Affinity) =
      |                     ^~~~~
/wrkdirs/usr/ports/devel/llvm80/work/llvm-8.0.1.src/lib/Demangle/MicrosoftDemangle.cpp:1876:3: error: 'Qualifiers' was not declared in this scope
 1876 |   Qualifiers ExtQuals = demanglePointerExtQualifiers(MangledName);
      |   ^~~~~~~~~~
/wrkdirs/usr/ports/devel/llvm80/work/llvm-8.0.1.src/lib/Demangle/MicrosoftDemangle.cpp:1877:12: error: 'struct llvm::ms_demangle::PointerTypeNode' has no member named 'Quals'
 1877 |   Pointer->Quals = Qualifiers(Pointer->Quals | ExtQuals);
      |            ^~~~~
/wrkdirs/usr/ports/devel/llvm80/work/llvm-8.0.1.src/lib/Demangle/MicrosoftDemangle.cpp:1877:40: error: 'struct llvm::ms_demangle::PointerTypeNode' has no member named 'Quals'
 1877 |   Pointer->Quals = Qualifiers(Pointer->Quals | ExtQuals);
      |                                        ^~~~~
/wrkdirs/usr/ports/devel/llvm80/work/llvm-8.0.1.src/lib/Demangle/MicrosoftDemangle.cpp:1877:48: error: 'ExtQuals' was not declared in this scope
 1877 |   Pointer->Quals = Qualifiers(Pointer->Quals | ExtQuals);
      |                                                ^~~~~~~~
/wrkdirs/usr/ports/devel/llvm80/work/llvm-8.0.1.src/lib/Demangle/MicrosoftDemangle.cpp: In member function 'llvm::ms_demangle::PointerTypeNode* llvm::ms_demangle::Demangler::demangleMemberPointerType(StringView&)':
/wrkdirs/usr/ports/devel/llvm80/work/llvm-8.0.1.src/lib/Demangle/MicrosoftDemangle.cpp:1886:21: error: 'struct llvm::ms_demangle::PointerTypeNode' has no member named 'Quals'
 1886 |   std::tie(Pointer->Quals, Pointer->Affinity) =
      |                     ^~~~~
/wrkdirs/usr/ports/devel/llvm80/work/llvm-8.0.1.src/lib/Demangle/MicrosoftDemangle.cpp:1890:3: error: 'Qualifiers' was not declared in this scope
 1890 |   Qualifiers ExtQuals = demanglePointerExtQualifiers(MangledName);
      |   ^~~~~~~~~~
/wrkdirs/usr/ports/devel/llvm80/work/llvm-8.0.1.src/lib/Demangle/MicrosoftDemangle.cpp:1891:12: error: 'struct llvm::ms_demangle::PointerTypeNode' has no member named 'Quals'
 1891 |   Pointer->Quals = Qualifiers(Pointer->Quals | ExtQuals);
      |            ^~~~~
/wrkdirs/usr/ports/devel/llvm80/work/llvm-8.0.1.src/lib/Demangle/MicrosoftDemangle.cpp:1891:40: error: 'struct llvm::ms_demangle::PointerTypeNode' has no member named 'Quals'
 1891 |   Pointer->Quals = Qualifiers(Pointer->Quals | ExtQuals);
      |                                        ^~~~~
/wrkdirs/usr/ports/devel/llvm80/work/llvm-8.0.1.src/lib/Demangle/MicrosoftDemangle.cpp:1891:48: error: 'ExtQuals' was not declared in this scope
 1891 |   Pointer->Quals = Qualifiers(Pointer->Quals | ExtQuals);
      |                                                ^~~~~~~~
/wrkdirs/usr/ports/devel/llvm80/work/llvm-8.0.1.src/lib/Demangle/MicrosoftDemangle.cpp:1897:15: error: expected ';' before 'PointeeQuals'
 1897 |     Qualifiers PointeeQuals = Q_None;
      |               ^~~~~~~~~~~~~
      |               ;
/wrkdirs/usr/ports/devel/llvm80/work/llvm-8.0.1.src/lib/Demangle/MicrosoftDemangle.cpp:1899:14: error: 'PointeeQuals' was not declared in this scope
 1899 |     std::tie(PointeeQuals, IsMember) = demangleQualifiers(MangledName);
      |              ^~~~~~~~~~~~
/wrkdirs/usr/ports/devel/llvm80/work/llvm-8.0.1.src/lib/Demangle/MicrosoftDemangle.cpp:1904:23: error: 'struct llvm::ms_demangle::TypeNode' has no member named 'Quals'
 1904 |     Pointer->Pointee->Quals = PointeeQuals;
      |                       ^~~~~
/wrkdirs/usr/ports/devel/llvm80/work/llvm-8.0.1.src/lib/Demangle/MicrosoftDemangle.cpp: At global scope:
/wrkdirs/usr/ports/devel/llvm80/work/llvm-8.0.1.src/lib/Demangle/MicrosoftDemangle.cpp:1910:1: error: 'Qualifiers' does not name a type
 1910 | Qualifiers Demangler::demanglePointerExtQualifiers(StringView &MangledName) {
      | ^~~~~~~~~~
/wrkdirs/usr/ports/devel/llvm80/work/llvm-8.0.1.src/lib/Demangle/MicrosoftDemangle.cpp: In member function 'llvm::ms_demangle::ArrayTypeNode* llvm::ms_demangle::Demangler::demangleArrayType(StringView&)':
/wrkdirs/usr/ports/devel/llvm80/work/llvm-8.0.1.src/lib/Demangle/MicrosoftDemangle.cpp:1955:19: error: 'struct llvm::ms_demangle::ArrayTypeNode' has no member named 'Quals'
 1955 |     std::tie(ATy->Quals, IsMember) = demangleQualifiers(MangledName);
      |                   ^~~~~
/wrkdirs/usr/ports/devel/llvm80/work/llvm-8.0.1.src/lib/Demangle/MicrosoftDemangle.cpp: In member function 'llvm::ms_demangle::NodeArrayNode* llvm::ms_demangle::Demangler::demangleTemplateParameterList(StringView&)':
/wrkdirs/usr/ports/devel/llvm80/work/llvm-8.0.1.src/lib/Demangle/MicrosoftDemangle.cpp:2084:27: error: invalid types 'int[int]' for array subscript
 2084 |         TPRN->ThunkOffsets[TPRN->ThunkOffsetCount++] =
      |                           ^
/wrkdirs/usr/ports/devel/llvm80/work/llvm-8.0.1.src/lib/Demangle/MicrosoftDemangle.cpp:2088:27: error: invalid types 'int[int]' for array subscript
 2088 |         TPRN->ThunkOffsets[TPRN->ThunkOffsetCount++] =
      |                           ^
/wrkdirs/usr/ports/devel/llvm80/work/llvm-8.0.1.src/lib/Demangle/MicrosoftDemangle.cpp:2092:27: error: invalid types 'int[int]' for array subscript
 2092 |         TPRN->ThunkOffsets[TPRN->ThunkOffsetCount++] =
      |                           ^
/wrkdirs/usr/ports/devel/llvm80/work/llvm-8.0.1.src/lib/Demangle/MicrosoftDemangle.cpp:2118:27: error: invalid types 'int[int]' for array subscript
 2118 |         TPRN->ThunkOffsets[TPRN->ThunkOffsetCount++] =
      |                           ^
/wrkdirs/usr/ports/devel/llvm80/work/llvm-8.0.1.src/lib/Demangle/MicrosoftDemangle.cpp:2122:27: error: invalid types 'int[int]' for array subscript
 2122 |         TPRN->ThunkOffsets[TPRN->ThunkOffsetCount++] =
      |                           ^
/wrkdirs/usr/ports/devel/llvm80/work/llvm-8.0.1.src/lib/Demangle/MicrosoftDemangle.cpp:2124:27: error: invalid types 'int[int]' for array subscript
 2124 |         TPRN->ThunkOffsets[TPRN->ThunkOffsetCount++] =
      |                           ^
In file included from /wrkdirs/usr/ports/devel/llvm80/work/llvm-8.0.1.src/lib/Demangle/MicrosoftDemangle.cpp:17:
/wrkdirs/usr/ports/devel/llvm80/work/llvm-8.0.1.src/include/llvm/Demangle/MicrosoftDemangle.h: In instantiation of 'T* llvm::ms_demangle::ArenaAllocator::alloc(Args&& ...) [with T = llvm::ms_demangle::IntegerLiteralNode; Args = {long unsigned int&, bool&}]':
/wrkdirs/usr/ports/devel/llvm80/work/llvm-8.0.1.src/lib/Demangle/MicrosoftDemangle.cpp:1945:60:   required from here
/wrkdirs/usr/ports/devel/llvm80/work/llvm-8.0.1.src/include/llvm/Demangle/MicrosoftDemangle.h:108:14: error: no matching function for call to 'llvm::ms_demangle::IntegerLiteralNode::IntegerLiteralNode(long unsigned int&, bool&)'
  108 |       return new (PP) T(std::forward<Args>(ConstructorArgs)...);
      |              ^~~~~~~~~~~~~~~~~~~~~~~~~~~~~~~~~~~~~~~~~~~~~~~~~~
In file included from /wrkdirs/usr/ports/devel/llvm80/work/llvm-8.0.1.src/include/llvm/Demangle/MicrosoftDemangle.h:14,
                 from /wrkdirs/usr/ports/devel/llvm80/work/llvm-8.0.1.src/lib/Demangle/MicrosoftDemangle.cpp:17:
/wrkdirs/usr/ports/devel/llvm80/work/llvm-8.0.1.src/include/llvm/Demangle/MicrosoftDemangleNodes.h:529:3: note: candidate: 'llvm::ms_demangle::IntegerLiteralNode::IntegerLiteralNode()'
  529 |   IntegerLiteralNode() : Node(NodeKind::IntegerLiteral) {}
      |   ^~~~~~~~~~~~~~~~~~
/wrkdirs/usr/ports/devel/llvm80/work/llvm-8.0.1.src/include/llvm/Demangle/MicrosoftDemangleNodes.h:529:3: note:   candidate expects 0 arguments, 2 provided
/wrkdirs/usr/ports/devel/llvm80/work/llvm-8.0.1.src/include/llvm/Demangle/MicrosoftDemangleNodes.h:528:8: note: candidate: 'constexpr llvm::ms_demangle::IntegerLiteralNode::IntegerLiteralNode(const llvm::ms_demangle::IntegerLiteralNode&)'
  528 | struct IntegerLiteralNode : public Node {
      |        ^~~~~~~~~~~~~~~~~~
/wrkdirs/usr/ports/devel/llvm80/work/llvm-8.0.1.src/include/llvm/Demangle/MicrosoftDemangleNodes.h:528:8: note:   candidate expects 1 argument, 2 provided
/wrkdirs/usr/ports/devel/llvm80/work/llvm-8.0.1.src/include/llvm/Demangle/MicrosoftDemangleNodes.h:528:8: note: candidate: 'constexpr llvm::ms_demangle::IntegerLiteralNode::IntegerLiteralNode(llvm::ms_demangle::IntegerLiteralNode&&)'
/wrkdirs/usr/ports/devel/llvm80/work/llvm-8.0.1.src/include/llvm/Demangle/MicrosoftDemangleNodes.h:528:8: note:   candidate expects 1 argument, 2 provided
In file included from /wrkdirs/usr/ports/devel/llvm80/work/llvm-8.0.1.src/lib/Demangle/MicrosoftDemangle.cpp:17:
/wrkdirs/usr/ports/devel/llvm80/work/llvm-8.0.1.src/include/llvm/Demangle/MicrosoftDemangle.h:112:12: error: no matching function for call to 'llvm::ms_demangle::IntegerLiteralNode::IntegerLiteralNode(long unsigned int&, bool&)'
  112 |     return new (Head->Buf) T(std::forward<Args>(ConstructorArgs)...);
      |            ^~~~~~~~~~~~~~~~~~~~~~~~~~~~~~~~~~~~~~~~~~~~~~~~~~~~~~~~~
In file included from /wrkdirs/usr/ports/devel/llvm80/work/llvm-8.0.1.src/include/llvm/Demangle/MicrosoftDemangle.h:14,
                 from /wrkdirs/usr/ports/devel/llvm80/work/llvm-8.0.1.src/lib/Demangle/MicrosoftDemangle.cpp:17:
/wrkdirs/usr/ports/devel/llvm80/work/llvm-8.0.1.src/include/llvm/Demangle/MicrosoftDemangleNodes.h:529:3: note: candidate: 'llvm::ms_demangle::IntegerLiteralNode::IntegerLiteralNode()'
  529 |   IntegerLiteralNode() : Node(NodeKind::IntegerLiteral) {}
      |   ^~~~~~~~~~~~~~~~~~
/wrkdirs/usr/ports/devel/llvm80/work/llvm-8.0.1.src/include/llvm/Demangle/MicrosoftDemangleNodes.h:529:3: note:   candidate expects 0 arguments, 2 provided
/wrkdirs/usr/ports/devel/llvm80/work/llvm-8.0.1.src/include/llvm/Demangle/MicrosoftDemangleNodes.h:528:8: note: candidate: 'constexpr llvm::ms_demangle::IntegerLiteralNode::IntegerLiteralNode(const llvm::ms_demangle::IntegerLiteralNode&)'
  528 | struct IntegerLiteralNode : public Node {
      |        ^~~~~~~~~~~~~~~~~~
/wrkdirs/usr/ports/devel/llvm80/work/llvm-8.0.1.src/include/llvm/Demangle/MicrosoftDemangleNodes.h:528:8: note:   candidate expects 1 argument, 2 provided
/wrkdirs/usr/ports/devel/llvm80/work/llvm-8.0.1.src/include/llvm/Demangle/MicrosoftDemangleNodes.h:528:8: note: candidate: 'constexpr llvm::ms_demangle::IntegerLiteralNode::IntegerLiteralNode(llvm::ms_demangle::IntegerLiteralNode&&)'
/wrkdirs/usr/ports/devel/llvm80/work/llvm-8.0.1.src/include/llvm/Demangle/MicrosoftDemangleNodes.h:528:8: note:   candidate expects 1 argument, 2 provided
[2/4930] /usr/local/bin/g++10 -D__STDC_CONSTANT_MACROS -D__STDC_FORMAT_MACROS -D__STDC_LIMIT_MACROS -Ilib/Demangle -I/wrkdirs/usr/ports/devel/llvm80/work/llvm-8.0.1.src/lib/Demangle -Iinclude -I/wrkdirs/usr/ports/devel/llvm80/work/llvm-8.0.1.src/include -O2 -pipe  -DNDEBUG -fstack-protector-strong -Wl,-rpath=/usr/local/lib/gcc10  -DNDEBUG -Wl,-rpath=/usr/local/lib/gcc10 -isystem /usr/local/include -fPIC -fvisibility-inlines-hidden -Werror=date-time -std=c++11 -Wall -Wextra -Wno-unused-parameter -Wwrite-strings -Wcast-qual -Wno-missing-field-initializers -pedantic -Wno-long-long -Wimplicit-fallthrough -Wno-maybe-uninitialized -Wno-class-memaccess -Wno-noexcept-type -Wdelete-non-virtual-dtor -Wno-comment -fdiagnostics-color -ffunction-sections -fdata-sections -O2 -pipe  -DNDEBUG -fstack-protector-strong -Wl,-rpath=/usr/local/lib/gcc10  -DNDEBUG -Wl,-rpath=/usr/local/lib/gcc10 -isystem /usr/local/include  -fno-exceptions -MD -MT lib/Demangle/CMakeFiles/LLVMDemangle.dir/ItaniumDemangle.c
 pp.o -MF lib/Demangle/CMakeFiles/LLVMDemangle.dir/ItaniumDemangle.cpp.o.d -o lib/Demangle/CMakeFiles/LLVMDemangle.dir/ItaniumDemangle.cpp.o -c /wrkdirs/usr/ports/devel/llvm80/work/llvm-8.0.1.src/lib/Demangle/ItaniumDemangle.cpp
ninja: build stopped: subcommand failed.
===> Compilation failed unexpectedly.
Try to set MAKE_JOBS_UNSAFE=yes and rebuild before reporting the failure to
the maintainer.
*** Error code 1

Stop.
make: stopped in /usr/ports/devel/llvm80
Received on Tue Jun 22 2021 - 03:10:40 UTC

Original text of this message