[package - 130releng-armv6-quarterly][devel/py-bullet3] Failed for py37-bullet3-3.09 in build

From: <pkg-fallout_at_FreeBSD.org>
Date: Sat, 19 Jun 2021 18:12:02 GMT
You are receiving this mail as a port that you maintain
is failing to build on the FreeBSD package build server.
Please investigate the failure and submit a PR to fix
build.

Maintainer:     yuri_at_FreeBSD.org
Log URL:        http://beefy8.nyi.freebsd.org/data/130releng-armv6-quarterly/711a4ba94c32/logs/py37-bullet3-3.09.log
Build URL:      http://beefy8.nyi.freebsd.org/build.html?mastername=130releng-armv6-quarterly&build=711a4ba94c32
Log:

=>> Building devel/py-bullet3
build started at Sat Jun 19 18:03:40 UTC 2021
port directory: /usr/ports/devel/py-bullet3
package name: py37-bullet3-3.09
building for: FreeBSD 130releng-armv6-quarterly-job-09 13.0-RELEASE-p2 FreeBSD 13.0-RELEASE-p2 1300139 arm
maintained by: yuri_at_FreeBSD.org
Makefile ident: 
Poudriere version: 3.2.8-8-gaf08dbda
Host OSVERSION: 1300121
Jail OSVERSION: 1300139
Job Id: 09




!!! Jail is newer than host. (Jail: 1300139, Host: 1300121) !!!
!!! This is not supported. !!!
!!! Host kernel must be same or newer than jail. !!!
!!! Expect build failures. !!!



---Begin Environment---
SHELL=/bin/csh
UNAME_p=armv6
UNAME_m=arm
ABI_FILE=/usr/lib/crt1.o
OSVERSION=1300139
UNAME_v=FreeBSD 13.0-RELEASE-p2 1300139
UNAME_r=13.0-RELEASE-p2
BLOCKSIZE=K
MAIL=/var/mail/root
MM_CHARSET=UTF-8
LANG=C.UTF-8
STATUS=1
HOME=/root
PATH=/sbin:/bin:/usr/sbin:/usr/bin:/usr/local/sbin:/usr/local/bin:/root/bin
LOCALBASE=/usr/local
QEMU_EMULATING=1
USER=root
LIBEXECPREFIX=/usr/local/libexec/poudriere
POUDRIERE_VERSION=3.2.8-8-gaf08dbda
MASTERMNT=/usr/local/poudriere/data/.m/130releng-armv6-quarterly/ref
POUDRIERE_BUILD_TYPE=bulk
PACKAGE_BUILDING=yes
SAVED_TERM=
PWD=/usr/local/poudriere/data/.m/130releng-armv6-quarterly/ref/.p/pool
P_PORTS_FEATURES=FLAVORS SELECTED_OPTIONS
MASTERNAME=130releng-armv6-quarterly
SCRIPTPREFIX=/usr/local/share/poudriere
OLDPWD=/usr/local/poudriere/data/.m/130releng-armv6-quarterly/ref/.p
SCRIPTPATH=/usr/local/share/poudriere/bulk.sh
POUDRIEREPATH=/usr/local/bin/poudriere
---End Environment---

---Begin Poudriere Port Flags/Env---
PORT_FLAGS=
PKGENV=
FLAVOR=py37
DEPENDS_ARGS=
MAKE_ARGS= FLAVOR=py37
---End Poudriere Port Flags/Env---

---Begin OPTIONS List---
---End OPTIONS List---

--MAINTAINER--
yuri_at_FreeBSD.org
--End MAINTAINER--

--CONFIGURE_ARGS--

--End CONFIGURE_ARGS--

--CONFIGURE_ENV--
PYTHON="/usr/local/bin/python3.7" XDG_DATA_HOME=/wrkdirs/usr/ports/devel/py-bullet3/work-py37  XDG_CONFIG_HOME=/wrkdirs/usr/ports/devel/py-bullet3/work-py37  HOME=/wrkdirs/usr/ports/devel/py-bullet3/work-py37 TMPDIR="/tmp" PATH=/wrkdirs/usr/ports/devel/py-bullet3/work-py37/.bin:/sbin:/bin:/usr/sbin:/usr/bin:/usr/local/sbin:/usr/local/bin:/root/bin SHELL=/bin/sh CONFIG_SHELL=/bin/sh CMAKE_PREFIX_PATH="/usr/local"
--End CONFIGURE_ENV--

--MAKE_ENV--
XDG_DATA_HOME=/wrkdirs/usr/ports/devel/py-bullet3/work-py37  XDG_CONFIG_HOME=/wrkdirs/usr/ports/devel/py-bullet3/work-py37  HOME=/wrkdirs/usr/ports/devel/py-bullet3/work-py37 TMPDIR="/tmp" PATH=/wrkdirs/usr/ports/devel/py-bullet3/work-py37/.bin:/sbin:/bin:/usr/sbin:/usr/bin:/usr/local/sbin:/usr/local/bin:/root/bin NO_PIE=yes MK_DEBUG_FILES=no MK_KERNEL_SYMBOLS=no SHELL=/bin/sh NO_LINT=YES LDSHARED="/nxb-bin/usr/bin/cc -shared" PYTHONDONTWRITEBYTECODE= PYTHONOPTIMIZE= PREFIX=/usr/local  LOCALBASE=/usr/local  CC="/nxb-bin/usr/bin/cc" CFLAGS="-O2 -pipe  -fstack-protector-strong -isystem /usr/local/include -fno-strict-aliasing "  CPP="/nxb-bin/usr/bin/cpp" CPPFLAGS="-isystem /usr/local/include"  LDFLAGS=" -fstack-protector-strong " LIBS="-L/usr/local/lib"  CXX="/nxb-bin/usr/bin/c++" CXXFLAGS="-O2 -pipe -fstack-protector-strong -isystem /usr/local/include -fno-strict-aliasing  -isystem /usr/local/include "  MANPREFIX="/usr/local" BSD_INSTALL_PROGRAM="install  -s -m 555"  BSD_INSTALL_LIB="
 install  -s -m 0644"  BSD_INSTALL_SCRIPT="install  -m 555"  BSD_INSTALL_DATA="install  -m 0644"  BSD_INSTALL_MAN="install  -m 444"
--End MAKE_ENV--

--PLIST_SUB--
PYTHON_INCLUDEDIR=include/python3.7m  PYTHON_LIBDIR=lib/python3.7  PYTHON_PLATFORM=freebsd13  PYTHON_SITELIBDIR=lib/python3.7/site-packages  PYTHON_SUFFIX=37  PYTHON_EXT_SUFFIX=  PYTHON_VER=3.7  PYTHON_VERSION=python3.7 PYTHON2="_at_comment " PYTHON3="" OSREL=13.0 PREFIX=%D LOCALBASE=/usr/local  RESETPREFIX=/usr/local LIB32DIR=lib DOCSDIR="share/doc/bullet3"  EXAMPLESDIR="share/examples/bullet3"  DATADIR="share/bullet3"  WWWDIR="www/bullet3"  ETCDIR="etc/bullet3"
--End PLIST_SUB--

--SUB_LIST--
PREFIX=/usr/local LOCALBASE=/usr/local  DATADIR=/usr/local/share/bullet3 DOCSDIR=/usr/local/share/doc/bullet3 EXAMPLESDIR=/usr/local/share/examples/bullet3  WWWDIR=/usr/local/www/bullet3 ETCDIR=/usr/local/etc/bullet3
--End SUB_LIST--

---Begin make.conf---
.sinclude "/etc/make.nxb.conf"
USE_PACKAGE_DEPENDS=yes
BATCH=yes
WRKDIRPREFIX=/wrkdirs
PORTSDIR=/usr/ports
PACKAGES=/packages
DISTDIR=/distfiles
PACKAGE_BUILDING=yes
PACKAGE_BUILDING_FLAVORS=yes
MACHINE=arm
MACHINE_ARCH=armv6
ARCH=${MACHINE_ARCH}
#### /usr/local/etc/poudriere.d/make.conf ####
# XXX: We really need this but cannot use it while 'make checksum' does not
# try the next mirror on checksum failure.  It currently retries the same
# failed mirror and then fails rather then trying another.  It *does*
# try the next if the size is mismatched though.
#MASTER_SITE_FREEBSD=yes
# Build ALLOW_MAKE_JOBS_PACKAGES with 2 jobs
MAKE_JOBS_NUMBER=2
#### /usr/ports/Mk/Scripts/ports_env.sh ####
_CCVERSION_9d218390=FreeBSD clang version 11.0.1 (git_at_github.com:llvm/llvm-project.git llvmorg-11.0.1-0-g43ff75f2c3fe) Target: armv6-unknown-freebsd13.0-gnueabihf Thread model: posix InstalledDir: /nxb-bin/usr/bin
_ALTCCVERSION_9d218390=none
_CXXINTERNAL_9c45a5b1=FreeBSD clang version 11.0.1 (git_at_github.com:llvm/llvm-project.git llvmorg-11.0.1-0-g43ff75f2c3fe) Target: armv6-unknown-freebsd13.0-gnueabihf Thread model: posix InstalledDir: /nxb-bin/usr/bin "/nxb-bin/usr/bin/ld" "--eh-frame-hdr" "-dynamic-linker" "/libexec/ld-elf.so.1" "--hash-style=both" "--enable-new-dtags" "-o" "a.out" "/usr/lib/crt1.o" "/usr/lib/crti.o" "/usr/lib/crtbegin.o" "-L/usr/lib" "/dev/null" "-lc++" "-lm" "-lgcc" "--as-needed" "-lgcc_s" "--no-as-needed" "-lc" "-lgcc" "--as-needed" "-lgcc_s" "--no-as-needed" "/usr/lib/crtend.o" "/usr/lib/crtn.o"
CC_OUTPUT_9d218390_58173849=yes
CC_OUTPUT_9d218390_9bdba57c=yes
CC_OUTPUT_9d218390_6a4fe7f5=yes
CC_OUTPUT_9d218390_6bcac02b=yes
CC_OUTPUT_9d218390_67d20829=yes
CC_OUTPUT_9d218390_bfa62e83=yes
CC_OUTPUT_9d218390_f0b4d593=yes
CC_OUTPUT_9d218390_308abb44=yes
CC_OUTPUT_9d218390_f00456e5=yes
CC_OUTPUT_9d218390_65ad290d=yes
CC_OUTPUT_9d218390_f2776b26=yes
CC_OUTPUT_9d218390_b2657cc3=yes
CC_OUTPUT_9d218390_380987f7=yes
CC_OUTPUT_9d218390_160933ec=yes
CC_OUTPUT_9d218390_fb62803b=yes
_OBJC_CCVERSION_9d218390=FreeBSD clang version 11.0.1 (git_at_github.com:llvm/llvm-project.git llvmorg-11.0.1-0-g43ff75f2c3fe) Target: armv6-unknown-freebsd13.0-gnueabihf Thread model: posix InstalledDir: /nxb-bin/usr/bin
_OBJC_ALTCCVERSION_9d218390=none
ARCH=armv6
OPSYS=FreeBSD
_OSRELEASE=13.0-RELEASE-p2
OSREL=13.0
OSVERSION=1300139
PYTHONBASE=/usr/local
CONFIGURE_MAX_CMD_LEN=524288
HAVE_PORTS_ENV=1
#### Misc Poudriere ####
GID=0
UID=0
DISABLE_MAKE_JOBS=poudriere
---End make.conf---
---Begin make.nxb.conf---
CC=/nxb-bin/usr/bin/cc
CPP=/nxb-bin/usr/bin/cpp
CXX=/nxb-bin/usr/bin/c++
NM=/nxb-bin/usr/bin/nm
LD=/nxb-bin/usr/bin/ld
OBJCOPY=/nxb-bin/usr/bin/objcopy
SIZE=/nxb-bin/usr/bin/size
STRIPBIN=/nxb-bin/usr/bin/strip
SED=/nxb-bin/usr/bin/sed
RANLIB=/nxb-bin/usr/bin/ranlib
YACC=/nxb-bin/usr/bin/yacc
MAKE=/nxb-bin/usr/bin/make
STRINGS=/nxb-bin/usr/bin/strings
AWK=/nxb-bin/usr/bin/awk
FLEX=/nxb-bin/usr/bin/flex
---End make.nxb.conf---
--Resource limits--
cpu time               (seconds, -t)  unlimited
file size           (512-blocks, -f)  unlimited
data seg size           (kbytes, -d)  33554432
stack size              (kbytes, -s)  524288
core file size      (512-blocks, -c)  unlimited
max memory size         (kbytes, -m)  unlimited
locked memory           (kbytes, -l)  unlimited
max user processes              (-u)  89999
open files                      (-n)  1024
virtual mem size        (kbytes, -v)  unlimited
swap limit              (kbytes, -w)  unlimited
socket buffer size       (bytes, -b)  unlimited
pseudo-terminals                (-p)  unlimited
kqueues                         (-k)  unlimited
umtx shared locks               (-o)  unlimited
--End resource limits--
=======================<phase: check-sanity   >============================
===>  License ZLIB accepted by the user
===========================================================================
=======================<phase: pkg-depends    >============================
===>   py37-bullet3-3.09 depends on file: /usr/local/sbin/pkg - not found
===>   Installing existing package /packages/All/pkg-1.16.3.txz
[130releng-armv6-quarterly-job-09] Installing pkg-1.16.3...
[130releng-armv6-quarterly-job-09] Extracting pkg-1.16.3: .......... done
===>   py37-bullet3-3.09 depends on file: /usr/local/sbin/pkg - found
===>   Returning to build of py37-bullet3-3.09
===========================================================================
=======================<phase: fetch-depends  >============================
===========================================================================
=======================<phase: fetch          >============================
===>  License ZLIB accepted by the user
===> Fetching all distfiles required by py37-bullet3-3.09 for building
===========================================================================
=======================<phase: checksum       >============================
===>  License ZLIB accepted by the user
===> Fetching all distfiles required by py37-bullet3-3.09 for building
<snip>
copying examples/pybullet/gym/pybullet_data/mjcf/inverted_pendulum.xml -> build/lib.freebsd-13.0-RELEASE-p2-arm-3.7/pybullet_data/mjcf
copying examples/pybullet/gym/pybullet_data/mjcf/swimmer.xml -> build/lib.freebsd-13.0-RELEASE-p2-arm-3.7/pybullet_data/mjcf
copying examples/pybullet/gym/pybullet_data/mjcf/humanoid_symmetric_no_ground.xml -> build/lib.freebsd-13.0-RELEASE-p2-arm-3.7/pybullet_data/mjcf
copying examples/pybullet/gym/pybullet_data/mjcf/humanoid_fixed.xml -> build/lib.freebsd-13.0-RELEASE-p2-arm-3.7/pybullet_data/mjcf
creating build/lib.freebsd-13.0-RELEASE-p2-arm-3.7/pybullet_data/kiva_shelf
copying examples/pybullet/gym/pybullet_data/kiva_shelf/model.sdf -> build/lib.freebsd-13.0-RELEASE-p2-arm-3.7/pybullet_data/kiva_shelf
creating build/lib.freebsd-13.0-RELEASE-p2-arm-3.7/pybullet_data/kiva_shelf/meshes
copying examples/pybullet/gym/pybullet_data/kiva_shelf/meshes/pod_lowres.stl -> build/lib.freebsd-13.0-RELEASE-p2-arm-3.7/pybullet_data/kiva_shelf/meshes
creating build/lib.freebsd-13.0-RELEASE-p2-arm-3.7/pybullet_data/table
copying examples/pybullet/gym/pybullet_data/table/table.mtl -> build/lib.freebsd-13.0-RELEASE-p2-arm-3.7/pybullet_data/table
copying examples/pybullet/gym/pybullet_data/table/table.obj -> build/lib.freebsd-13.0-RELEASE-p2-arm-3.7/pybullet_data/table
copying examples/pybullet/gym/pybullet_data/table/table.png -> build/lib.freebsd-13.0-RELEASE-p2-arm-3.7/pybullet_data/table
copying examples/pybullet/gym/pybullet_data/table/table.urdf -> build/lib.freebsd-13.0-RELEASE-p2-arm-3.7/pybullet_data/table
running build_ext
building 'pybullet' extension
creating build/temp.freebsd-13.0-RELEASE-p2-arm-3.7
creating build/temp.freebsd-13.0-RELEASE-p2-arm-3.7/examples
creating build/temp.freebsd-13.0-RELEASE-p2-arm-3.7/examples/ThirdPartyLibs
creating build/temp.freebsd-13.0-RELEASE-p2-arm-3.7/examples/ThirdPartyLibs/enet
creating build/temp.freebsd-13.0-RELEASE-p2-arm-3.7/examples/OpenGLWindow
creating build/temp.freebsd-13.0-RELEASE-p2-arm-3.7/examples/ThirdPartyLibs/glad
creating build/temp.freebsd-13.0-RELEASE-p2-arm-3.7/examples/pybullet
creating build/temp.freebsd-13.0-RELEASE-p2-arm-3.7/examples/ThirdPartyLibs/tinyxml2
creating build/temp.freebsd-13.0-RELEASE-p2-arm-3.7/examples/SharedMemory
creating build/temp.freebsd-13.0-RELEASE-p2-arm-3.7/examples/SharedMemory/plugins
creating build/temp.freebsd-13.0-RELEASE-p2-arm-3.7/examples/SharedMemory/plugins/stablePDPlugin
creating build/temp.freebsd-13.0-RELEASE-p2-arm-3.7/src
creating build/temp.freebsd-13.0-RELEASE-p2-arm-3.7/examples/ExampleBrowser
creating build/temp.freebsd-13.0-RELEASE-p2-arm-3.7/examples/TinyRenderer
creating build/temp.freebsd-13.0-RELEASE-p2-arm-3.7/examples/SharedMemory/plugins/pdControlPlugin
creating build/temp.freebsd-13.0-RELEASE-p2-arm-3.7/examples/SharedMemory/plugins/collisionFilterPlugin
creating build/temp.freebsd-13.0-RELEASE-p2-arm-3.7/examples/SharedMemory/plugins/fileIOPlugin
creating build/temp.freebsd-13.0-RELEASE-p2-arm-3.7/examples/SharedMemory/plugins/tinyRendererPlugin
creating build/temp.freebsd-13.0-RELEASE-p2-arm-3.7/examples/Utils
creating build/temp.freebsd-13.0-RELEASE-p2-arm-3.7/examples/ThirdPartyLibs/Wavefront
creating build/temp.freebsd-13.0-RELEASE-p2-arm-3.7/examples/ThirdPartyLibs/stb_image
creating build/temp.freebsd-13.0-RELEASE-p2-arm-3.7/examples/ThirdPartyLibs/minizip
creating build/temp.freebsd-13.0-RELEASE-p2-arm-3.7/examples/Importers
creating build/temp.freebsd-13.0-RELEASE-p2-arm-3.7/examples/Importers/ImportColladaDemo
creating build/temp.freebsd-13.0-RELEASE-p2-arm-3.7/examples/Importers/ImportObjDemo
creating build/temp.freebsd-13.0-RELEASE-p2-arm-3.7/examples/Importers/ImportMJCFDemo
creating build/temp.freebsd-13.0-RELEASE-p2-arm-3.7/examples/Importers/ImportURDFDemo
creating build/temp.freebsd-13.0-RELEASE-p2-arm-3.7/examples/Importers/ImportMeshUtility
creating build/temp.freebsd-13.0-RELEASE-p2-arm-3.7/examples/MultiThreading
creating build/temp.freebsd-13.0-RELEASE-p2-arm-3.7/examples/ExampleBrowser/GwenGUISupport
creating build/temp.freebsd-13.0-RELEASE-p2-arm-3.7/src/Bullet3Common
creating build/temp.freebsd-13.0-RELEASE-p2-arm-3.7/examples/ThirdPartyLibs/clsocket
creating build/temp.freebsd-13.0-RELEASE-p2-arm-3.7/examples/ThirdPartyLibs/clsocket/src
creating build/temp.freebsd-13.0-RELEASE-p2-arm-3.7/Extras
creating build/temp.freebsd-13.0-RELEASE-p2-arm-3.7/Extras/Serialize
creating build/temp.freebsd-13.0-RELEASE-p2-arm-3.7/Extras/Serialize/BulletFileLoader
creating build/temp.freebsd-13.0-RELEASE-p2-arm-3.7/Extras/Serialize/BulletWorldImporter
creating build/temp.freebsd-13.0-RELEASE-p2-arm-3.7/Extras/InverseDynamics
creating build/temp.freebsd-13.0-RELEASE-p2-arm-3.7/src/BulletSoftBody
creating build/temp.freebsd-13.0-RELEASE-p2-arm-3.7/src/BulletInverseDynamics
creating build/temp.freebsd-13.0-RELEASE-p2-arm-3.7/src/BulletInverseDynamics/details
creating build/temp.freebsd-13.0-RELEASE-p2-arm-3.7/examples/ThirdPartyLibs/BussIK
creating build/temp.freebsd-13.0-RELEASE-p2-arm-3.7/examples/ThirdPartyLibs/Gwen
creating build/temp.freebsd-13.0-RELEASE-p2-arm-3.7/examples/ThirdPartyLibs/Gwen/Controls
creating build/temp.freebsd-13.0-RELEASE-p2-arm-3.7/examples/ThirdPartyLibs/Gwen/Controls/Dialog
creating build/temp.freebsd-13.0-RELEASE-p2-arm-3.7/examples/ThirdPartyLibs/Gwen/Platforms
creating build/temp.freebsd-13.0-RELEASE-p2-arm-3.7/examples/ThirdPartyLibs/Gwen/Renderers
creating build/temp.freebsd-13.0-RELEASE-p2-arm-3.7/Extras/VHACD
creating build/temp.freebsd-13.0-RELEASE-p2-arm-3.7/Extras/VHACD/test
creating build/temp.freebsd-13.0-RELEASE-p2-arm-3.7/Extras/VHACD/test/src
creating build/temp.freebsd-13.0-RELEASE-p2-arm-3.7/Extras/VHACD/src
sem_wait: Invalid argument
sem_wait: Invalid argument
sem_wait: Invalid argument
sem_wait: Invalid argument
sem_wait: Invalid argument
sem_wait: Invalid argument
sem_wait: Invalid argument
sem_wait: Invalid argument
sem_wait: Invalid argument
sem_wait: Invalid argument
sem_wait: Invalid argument
sem_wait: Invalid argument
sem_wait: Invalid argument
Traceback (most recent call last):
  File "<string>", line 1, in <module>
  File "setup.py", line 518, in <module>
Exception in thread Thread-6:
Traceback (most recent call last):
  File "/usr/local/lib/python3.7/threading.py", line 926, in _bootstrap_inner
    self.run()
  File "/usr/local/lib/python3.7/threading.py", line 870, in run
    self._target(*self._args, **self._kwargs)
  File "/usr/local/lib/python3.7/multiprocessing/pool.py", line 422, in _handle_tasks
    for taskseq, set_length in iter(taskqueue.get, None):
_queue.Empty

Exception in thread Thread-3:
Traceback (most recent call last):
  File "/usr/local/lib/python3.7/threading.py", line 926, in _bootstrap_inner
    self.run()
  File "/usr/local/lib/python3.7/threading.py", line 870, in run
    self._target(*self._args, **self._kwargs)
  File "/usr/local/lib/python3.7/multiprocessing/pool.py", line 110, in worker
    task = get()
_queue.Empty

Exception in thread Thread-1:
Traceback (most recent call last):
  File "/usr/local/lib/python3.7/threading.py", line 926, in _bootstrap_inner
    self.run()
  File "/usr/local/lib/python3.7/threading.py", line 870, in run
    self._target(*self._args, **self._kwargs)
  File "/usr/local/lib/python3.7/multiprocessing/pool.py", line 110, in worker
    task = get()
_queue.Empty

Exception in thread Thread-4:
Traceback (most recent call last):
  File "/usr/local/lib/python3.7/threading.py", line 926, in _bootstrap_inner
    self.run()
  File "/usr/local/lib/python3.7/threading.py", line 870, in run
    self._target(*self._args, **self._kwargs)
  File "/usr/local/lib/python3.7/multiprocessing/pool.py", line 110, in worker
    task = get()
_queue.Empty

Exception in thread Thread-7:
Traceback (most recent call last):
  File "/usr/local/lib/python3.7/threading.py", line 926, in _bootstrap_inner
    self.run()
  File "/usr/local/lib/python3.7/threading.py", line 870, in run
    self._target(*self._args, **self._kwargs)
  File "/usr/local/lib/python3.7/multiprocessing/pool.py", line 470, in _handle_results
    task = get()
_queue.Empty

    package_data={'pybullet_data': need_files})
  File "/usr/local/lib/python3.7/distutils/core.py", line 148, in setup
    dist.run_commands()
  File "/usr/local/lib/python3.7/distutils/dist.py", line 966, in run_commands
    self.run_command(cmd)
  File "/usr/local/lib/python3.7/distutils/dist.py", line 985, in run_command
    cmd_obj.run()
  File "/usr/local/lib/python3.7/distutils/command/build.py", line 135, in run
    self.run_command(cmd_name)
  File "/usr/local/lib/python3.7/distutils/cmd.py", line 313, in run_command
    self.distribution.run_command(command)
  File "/usr/local/lib/python3.7/distutils/dist.py", line 985, in run_command
Exception in thread Thread-2:
Traceback (most recent call last):
  File "/usr/local/lib/python3.7/threading.py", line 926, in _bootstrap_inner
    self.run()
  File "/usr/local/lib/python3.7/threading.py", line 870, in run
    self._target(*self._args, **self._kwargs)
  File "/usr/local/lib/python3.7/multiprocessing/pool.py", line 110, in worker
    task = get()
_queue.Empty

Exception in thread Thread-5:
Traceback (most recent call last):
  File "/usr/local/lib/python3.7/threading.py", line 926, in _bootstrap_inner
    self.run()
  File "/usr/local/lib/python3.7/threading.py", line 870, in run
    self._target(*self._args, **self._kwargs)
  File "/usr/local/lib/python3.7/multiprocessing/pool.py", line 412, in _handle_workers
    pool._maintain_pool()
  File "/usr/local/lib/python3.7/multiprocessing/pool.py", line 247, in _maintain_pool
    if self._join_exited_workers():
  File "/usr/local/lib/python3.7/multiprocessing/pool.py", line 222, in _join_exited_workers
    worker.join()
  File "/usr/local/lib/python3.7/threading.py", line 1039, in join
    raise RuntimeError("cannot join thread before it is started")
RuntimeError: cannot join thread before it is started

    cmd_obj.run()
  File "/usr/local/lib/python3.7/site-packages/setuptools/command/build_ext.py", line 84, in run
    _build_ext.run(self)
  File "/usr/local/lib/python3.7/distutils/command/build_ext.py", line 340, in run
    self.build_extensions()
  File "/usr/local/lib/python3.7/distutils/command/build_ext.py", line 449, in build_extensions
    self._build_extensions_serial()
  File "/usr/local/lib/python3.7/distutils/command/build_ext.py", line 474, in _build_extensions_serial
    self.build_extension(ext)
  File "/usr/local/lib/python3.7/site-packages/setuptools/command/build_ext.py", line 205, in build_extension
    _build_ext.build_extension(self, ext)
  File "/usr/local/lib/python3.7/distutils/command/build_ext.py", line 534, in build_extension
    depends=ext.depends)
  File "setup.py", line 58, in parallelCCompile
    list(pool.imap(_single_compile, objects))
  File "/usr/local/lib/python3.7/multiprocessing/pool.py", line 743, in next
    raise TimeoutError from None
multiprocessing.context.TimeoutError
Traceback (most recent call last):
  File "/usr/local/lib/python3.7/multiprocessing/util.py", line 300, in _run_finalizers
    finalizer()
  File "/usr/local/lib/python3.7/multiprocessing/util.py", line 224, in __call__
    res = self._callback(*self._args, **self._kwargs)
  File "/usr/local/lib/python3.7/multiprocessing/pool.py", line 585, in _terminate_pool
    "Cannot have cache with result_hander not alive")
AssertionError: Cannot have cache with result_hander not alive
*** Error code 1

Stop.
make: stopped in /usr/ports/devel/py-bullet3
Received on Sat Jun 19 2021 - 18:12:02 UTC

Original text of this message