[package - 130amd64-default][devel/RStudio] Failed for RStudio-1.4.1717 in stage

From: <pkg-fallout_at_FreeBSD.org>
Date: Sat, 19 Jun 2021 16:12:42 GMT
You are receiving this mail as a port that you maintain
is failing to build on the FreeBSD package build server.
Please investigate the failure and submit a PR to fix
build.

Maintainer:     yuri_at_FreeBSD.org
Log URL:        http://beefy16.nyi.freebsd.org/data/130amd64-default/7e413d93a62b/logs/RStudio-1.4.1717.log
Build URL:      http://beefy16.nyi.freebsd.org/build.html?mastername=130amd64-default&build=7e413d93a62b
Log:

=>> Building devel/RStudio
build started at Sat Jun 19 14:59:20 UTC 2021
port directory: /usr/ports/devel/RStudio
package name: RStudio-1.4.1717
building for: FreeBSD 130amd64-default-job-08 13.0-RELEASE-p2 FreeBSD 13.0-RELEASE-p2 amd64
maintained by: yuri_at_FreeBSD.org
Makefile ident: 
Poudriere version: 3.2.8-8-gaf08dbda
Host OSVERSION: 1400008
Jail OSVERSION: 1300139
Job Id: 08

---Begin Environment---
SHELL=/bin/csh
OSVERSION=1300139
UNAME_v=FreeBSD 13.0-RELEASE-p2
UNAME_r=13.0-RELEASE-p2
BLOCKSIZE=K
MAIL=/var/mail/root
MM_CHARSET=UTF-8
LANG=C.UTF-8
STATUS=1
HOME=/root
PATH=/sbin:/bin:/usr/sbin:/usr/bin:/usr/local/sbin:/usr/local/bin:/root/bin
LOCALBASE=/usr/local
USER=root
LIBEXECPREFIX=/usr/local/libexec/poudriere
POUDRIERE_VERSION=3.2.8-8-gaf08dbda
MASTERMNT=/usr/local/poudriere/data/.m/130amd64-default/ref
POUDRIERE_BUILD_TYPE=bulk
PACKAGE_BUILDING=yes
SAVED_TERM=
PWD=/usr/local/poudriere/data/.m/130amd64-default/ref/.p/pool
P_PORTS_FEATURES=FLAVORS SELECTED_OPTIONS
MASTERNAME=130amd64-default
SCRIPTPREFIX=/usr/local/share/poudriere
OLDPWD=/usr/local/poudriere/data/.m/130amd64-default/ref/.p
SCRIPTPATH=/usr/local/share/poudriere/bulk.sh
POUDRIEREPATH=/usr/local/bin/poudriere
---End Environment---

---Begin Poudriere Port Flags/Env---
PORT_FLAGS=
PKGENV=
FLAVOR=desktop
DEPENDS_ARGS=
MAKE_ARGS= FLAVOR=desktop
---End Poudriere Port Flags/Env---

---Begin OPTIONS List---
---End OPTIONS List---

--MAINTAINER--
yuri_at_FreeBSD.org
--End MAINTAINER--

--CONFIGURE_ARGS--

--End CONFIGURE_ARGS--

--CONFIGURE_ENV--
F77="gfortran10" FC="gfortran10" FFLAGS="-O -Wl,-rpath=/usr/local/lib/gcc10" FCFLAGS="-Wl,-rpath=/usr/local/lib/gcc10" PKG_CONFIG=pkgconf QT_SELECT=qt5 QMAKEMODULES="/wrkdirs/usr/ports/devel/RStudio/work-desktop/rstudio-1.4.1717/mkspecs/modules:/usr/local/lib/qt5/mkspecs/modules" XDG_DATA_HOME=/wrkdirs/usr/ports/devel/RStudio/work-desktop  XDG_CONFIG_HOME=/wrkdirs/usr/ports/devel/RStudio/work-desktop  HOME=/wrkdirs/usr/ports/devel/RStudio/work-desktop TMPDIR="/tmp" SHELL=/bin/sh CONFIG_SHELL=/bin/sh CMAKE_PREFIX_PATH="/usr/local"
--End CONFIGURE_ENV--

--MAKE_ENV--
HOME=/wrkdirs/usr/ports/devel/RStudio/work-desktop  JAVA_HOME=/usr/local/openjdk8  PATH=/usr/local/openjdk8/bin:/wrkdirs/usr/ports/devel/RStudio/work-desktop/.bin:/sbin:/bin:/usr/sbin:/usr/bin:/usr/local/sbin:/usr/local/bin:/root/bin  ANT_OPTS="-Duser.home=/wrkdirs/usr/ports/devel/RStudio/work-desktop" F77="gfortran10" FC="gfortran10" FFLAGS="-O -Wl,-rpath=/usr/local/lib/gcc10" FCFLAGS="-Wl,-rpath=/usr/local/lib/gcc10" OPENSSLBASE=/usr OPENSSLDIR=/etc/ssl OPENSSLINC=/usr/include OPENSSLLIB=/usr/lib QT_SELECT=qt5 QMAKEMODULES="/wrkdirs/usr/ports/devel/RStudio/work-desktop/rstudio-1.4.1717/mkspecs/modules:/usr/local/lib/qt5/mkspecs/modules" XDG_DATA_HOME=/wrkdirs/usr/ports/devel/RStudio/work-desktop  XDG_CONFIG_HOME=/wrkdirs/usr/ports/devel/RStudio/work-desktop  HOME=/wrkdirs/usr/ports/devel/RStudio/work-desktop TMPDIR="/tmp" NO_PIE=yes MK_DEBUG_FILES=no MK_KERNEL_SYMBOLS=no SHELL=/bin/sh NO_LINT=YES ADDR2LINE="/usr/local/bin/addr2line" AR="/usr/local/bin/ar" AS="/usr/local/bin/as" CPP
 FILT="/usr/local/bin/c++filt" GPROF="/usr/local/bin/gprof" LD="/usr/local/bin/ld" NM="/usr/local/bin/nm" OBJCOPY="/usr/local/bin/objcopy" OBJDUMP="/usr/local/bin/objdump" RANLIB="/usr/local/bin/ranlib" READELF="/usr/local/bin/readelf" SIZE="/usr/local/bin/size" STRINGS="/usr/local/bin/strings" PREFIX=/usr/local  LOCALBASE=/usr/local  CC="cc" CFLAGS="-O2 -pipe  -fstack-protector-strong -isystem /usr/local/include -fno-strict-aliasing "  CPP="cpp" CPPFLAGS="-I/usr/local/include -isystem /usr/local/include"  LDFLAGS=" -Wl,-rpath=/usr/local/lib/gcc10  -L/usr/local/lib/gcc10 -B/usr/local/bin -L/usr/local/lib  -fstack-protector-strong -L/usr/local/lib " LIBS=""  CXX="c++" CXXFLAGS="-O2 -pipe -fstack-protector-strong -isystem /usr/local/include -fno-strict-aliasing  -isystem /usr/local/include "  MANPREFIX="/usr/local" BSD_INSTALL_PROGRAM="install  -s -m 555"  BSD_INSTALL_LIB="install  -s -m 0644"  BSD_INSTALL_SCRIPT="install  -m 555"  BSD_INSTALL_DATA="install  -m 0644"  BSD_INSTALL_MAN="
 install  -m 444"
--End MAKE_ENV--

--PLIST_SUB--
JAVASHAREDIR="share/java"  JAVAJARDIR="share/java/classes" CMAKE_BUILD_TYPE="release" QT_BINDIR="lib/qt5/bin" QT_INCDIR="include/qt5" QT_LIBDIR="lib/qt5" QT_ARCHDIR="lib/qt5" QT_PLUGINDIR="lib/qt5/plugins" QT_LIBEXECDIR="libexec/qt5" QT_IMPORTDIR="lib/qt5/imports" QT_QMLDIR="lib/qt5/qml" QT_DATADIR="share/qt5" QT_DOCDIR="share/doc/qt5" QT_L10NDIR="share/qt5/translations" QT_EXAMPLEDIR="share/examples/qt5" QT_TESTDIR="share/qt5/tests" QT_MKSPECDIR="lib/qt5/mkspecs" QT_QTCHOOSERDIR="etc/xdg/qtchooser" OSREL=13.0 PREFIX=%D LOCALBASE=/usr/local  RESETPREFIX=/usr/local LIB32DIR=lib DOCSDIR="share/doc/RStudio"  EXAMPLESDIR="share/examples/RStudio"  DATADIR="share/RStudio"  WWWDIR="www/RStudio"  ETCDIR="etc/RStudio"
--End PLIST_SUB--

--SUB_LIST--
JAVASHAREDIR="/usr/local/share/java"  JAVAJARDIR="/usr/local/share/java/classes"  JAVALIBDIR="/usr/local/share/java/classes" JAVA_VERSION="8" PREFIX=/usr/local LOCALBASE=/usr/local  DATADIR=/usr/local/share/RStudio DOCSDIR=/usr/local/share/doc/RStudio EXAMPLESDIR=/usr/local/share/examples/RStudio  WWWDIR=/usr/local/www/RStudio ETCDIR=/usr/local/etc/RStudio
--End SUB_LIST--

---Begin make.conf---
USE_PACKAGE_DEPENDS=yes
BATCH=yes
WRKDIRPREFIX=/wrkdirs
PORTSDIR=/usr/ports
PACKAGES=/packages
DISTDIR=/distfiles
PACKAGE_BUILDING=yes
PACKAGE_BUILDING_FLAVORS=yes
#### /usr/local/etc/poudriere.d/make.conf ####
# XXX: We really need this but cannot use it while 'make checksum' does not
# try the next mirror on checksum failure.  It currently retries the same
# failed mirror and then fails rather then trying another.  It *does*
# try the next if the size is mismatched though.
#MASTER_SITE_FREEBSD=yes
# Build ALLOW_MAKE_JOBS_PACKAGES with 2 jobs
MAKE_JOBS_NUMBER=2
#### /usr/ports/Mk/Scripts/ports_env.sh ####
_CCVERSION_921dbbb2=FreeBSD clang version 11.0.1 (git_at_github.com:llvm/llvm-project.git llvmorg-11.0.1-0-g43ff75f2c3fe) Target: x86_64-unknown-freebsd13.0 Thread model: posix InstalledDir: /usr/bin
_ALTCCVERSION_921dbbb2=none
_CXXINTERNAL_acaad9ca=FreeBSD clang version 11.0.1 (git_at_github.com:llvm/llvm-project.git llvmorg-11.0.1-0-g43ff75f2c3fe) Target: x86_64-unknown-freebsd13.0 Thread model: posix InstalledDir: /usr/bin "/usr/bin/ld" "--eh-frame-hdr" "-dynamic-linker" "/libexec/ld-elf.so.1" "--hash-style=both" "--enable-new-dtags" "-o" "a.out" "/usr/lib/crt1.o" "/usr/lib/crti.o" "/usr/lib/crtbegin.o" "-L/usr/lib" "/dev/null" "-lc++" "-lm" "-lgcc" "--as-needed" "-lgcc_s" "--no-as-needed" "-lc" "-lgcc" "--as-needed" "-lgcc_s" "--no-as-needed" "/usr/lib/crtend.o" "/usr/lib/crtn.o"
CC_OUTPUT_921dbbb2_58173849=yes
CC_OUTPUT_921dbbb2_9bdba57c=yes
CC_OUTPUT_921dbbb2_6a4fe7f5=yes
CC_OUTPUT_921dbbb2_6bcac02b=yes
CC_OUTPUT_921dbbb2_67d20829=yes
CC_OUTPUT_921dbbb2_bfa62e83=yes
CC_OUTPUT_921dbbb2_f0b4d593=yes
CC_OUTPUT_921dbbb2_308abb44=yes
CC_OUTPUT_921dbbb2_f00456e5=yes
CC_OUTPUT_921dbbb2_65ad290d=yes
CC_OUTPUT_921dbbb2_f2776b26=yes
CC_OUTPUT_921dbbb2_b2657cc3=yes
CC_OUTPUT_921dbbb2_380987f7=yes
CC_OUTPUT_921dbbb2_160933ec=yes
CC_OUTPUT_921dbbb2_fb62803b=yes
_OBJC_CCVERSION_921dbbb2=FreeBSD clang version 11.0.1 (git_at_github.com:llvm/llvm-project.git llvmorg-11.0.1-0-g43ff75f2c3fe) Target: x86_64-unknown-freebsd13.0 Thread model: posix InstalledDir: /usr/bin
_OBJC_ALTCCVERSION_921dbbb2=none
ARCH=amd64
OPSYS=FreeBSD
_OSRELEASE=13.0-RELEASE-p2
OSREL=13.0
OSVERSION=1300139
PYTHONBASE=/usr/local
HAVE_COMPAT_IA32_KERN=YES
CONFIGURE_MAX_CMD_LEN=524288
HAVE_PORTS_ENV=1
#### Misc Poudriere ####
GID=0
UID=0
DISABLE_MAKE_JOBS=poudriere
---End make.conf---
--Resource limits--
cpu time               (seconds, -t)  unlimited
file size           (512-blocks, -f)  unlimited
data seg size           (kbytes, -d)  33554432
stack size              (kbytes, -s)  524288
core file size      (512-blocks, -c)  unlimited
max memory size         (kbytes, -m)  unlimited
locked memory           (kbytes, -l)  unlimited
max user processes              (-u)  89999
open files                      (-n)  2048
virtual mem size        (kbytes, -v)  unlimited
swap limit              (kbytes, -w)  unlimited
socket buffer size       (bytes, -b)  unlimited
pseudo-terminals                (-p)  unlimited
kqueues                         (-k)  unlimited
umtx shared locks               (-o)  unlimited
--End resource limits--
=======================<phase: check-sanity   >============================
===>   NOTICE:

This port is deprecated; you may wish to reconsider installing it:

Uses EOL Python 2.7 via www/qt5-webengine.

It is scheduled to be removed on or after 2021-06-23.

===>  License GPLv3 accepted by the user
===========================================================================
=======================<phase: pkg-depends    >============================
===>   RStudio-1.4.1717 depends on file: /usr/local/sbin/pkg - not found
===>   Installing existing package /packages/All/pkg-1.16.3.txz
[130amd64-default-job-08] Installing pkg-1.16.3...
[130amd64-default-job-08] Extracting pkg-1.16.3: .......... done
===>   RStudio-1.4.1717 depends on file: /usr/local/sbin/pkg - found
===>   Returning to build of RStudio-1.4.1717
===========================================================================
=======================<phase: fetch-depends  >============================
===========================================================================
=======================<phase: fetch          >============================
===>   NOTICE:

This port is deprecated; you may wish to reconsider installing it:

Uses EOL Python 2.7 via www/qt5-webengine.

It is scheduled to be removed on or after 2021-06-23.

===>  License GPLv3 accepted by the user
===> Fetching all distfiles required by RStudio-1.4.1717 for building
===========================================================================
=======================<phase: checksum       >============================
===>   NOTICE:

This port is deprecated; you may wish to reconsider installing it:

Uses EOL Python 2.7 via www/qt5-webengine.

It is scheduled to be removed on or after 2021-06-23.

===>  License GPLv3 accepted by the user
===> Fetching all distfiles required by RStudio-1.4.1717 for building
=> SHA256 Checksum OK for core-dictionaries.zip.
=> SHA256 Checksum OK for gin-2.1.2.zip.
=> SHA256 Checksum OK for gwt-2.8.1.zip.
=> SHA256 Checksum OK for mathjax-27.zip.
=> SHA256 Checksum OK for RStudio-rstudio-v1.4.1717_GH0.tar.gz.
=> SHA256 Checksum OK for rstudio-r2d3-v0.2.0_GH0.tar.gz.
=> SHA256 Checksum OK for rstudio-rmarkdown-aed26ac_GH0.tar.gz.
=> SHA256 Checksum OK for rstudio-rsconnect-03c379b_GH0.tar.gz.
=> SHA256 Checksum OK for trestletech-plumber-v0.4.6_GH0.tar.gz.
===========================================================================
<snip>
[ 92%] Building CXX object src/cpp/session/CMakeFiles/rsession.dir/modules/tex/SessionCompilePdfSupervisor.cpp.o
cd /wrkdirs/usr/ports/devel/RStudio/work-desktop/.build/src/cpp/session && /usr/bin/c++ -DBOOST_ASIO_DISABLE_KQUEUE -DBOOST_ENABLE_ASSERT_HANDLER -DBOOST_SIGNALS_NO_DEPRECATION_WARNING -DRSTUDIO_BOOST_NAMESPACE=boost -DRSTUDIO_BOOST_SIGNALS_VERSION=2 -DRSTUDIO_UNIT_TESTS_ENABLED -DWEBSOCKETPP_STRICT_MASKING -D_FORTIFY_SOURCE=2 -D_WEBSOCKETPP_NO_CPP11_MEMORY_=1 -DSTRIPPED_FILENAME=\"src/cpp/session/modules/tex/SessionCompilePdfSupervisor.cpp\" -I/wrkdirs/usr/ports/devel/RStudio/work-desktop/rstudio-1.4.1717/src/cpp/session/include -I/usr/local/lib/R/include -I/wrkdirs/usr/ports/devel/RStudio/work-desktop/rstudio-1.4.1717/src/cpp/core/include -I/include -I/wrkdirs/usr/ports/devel/RStudio/work-desktop/rstudio-1.4.1717/src/cpp/shared_core/include -I/wrkdirs/usr/ports/devel/RStudio/work-desktop/rstudio-1.4.1717/src/cpp/ext -I/wrkdirs/usr/ports/devel/RStudio/work-desktop/rstudio-1.4.1717/src/cpp/monitor/include -I/wrkdirs/usr/ports/devel/RStudio/work-desktop/rstudio-1.4.1717/src/cpp/r/incl
 ude -I/wrkdirs/usr/ports/devel/RStudio/work-desktop/.build/src/cpp/session -I/wrkdirs/usr/ports/devel/RStudio/work-desktop/rstudio-1.4.1717/src/cpp/tests/cpp -isystem /opt/rstudio-tools/amd64/crashpad -isystem /opt/rstudio-tools/amd64/crashpad/crashpad -isystem /opt/rstudio-tools/amd64/crashpad/crashpad/third_party/mini_chromium/mini_chromium -isystem /usr/include/postgresql -isystem /usr/include/pgsql -O2 -pipe -fstack-protector-strong -isystem /usr/local/include -fno-strict-aliasing  -isystem /usr/local/include -std=c++0x -std=c++11 -O2 -pipe -fstack-protector-strong -isystem /usr/local/include -fno-strict-aliasing  -isystem /usr/local/include -fPIE   -Wall -pthread -Werror=return-type -Wformat -Wformat-security -fstack-protector --param ssp-buffer-size=4 -fPIC -MD -MT src/cpp/session/CMakeFiles/rsession.dir/modules/tex/SessionCompilePdfSupervisor.cpp.o -MF CMakeFiles/rsession.dir/modules/tex/SessionCompilePdfSupervisor.cpp.o.d -o CMakeFiles/rsession.dir/modules/tex/SessionCompile
 PdfSupervisor.cpp.o -c /wrkdirs/usr/ports/de!
 vel/RStudio/work-desktop/rstudio-1.4.1717/src/cpp/session/modules/tex/SessionCompilePdfSupervisor.cpp
[ 92%] Building CXX object src/cpp/session/CMakeFiles/rsession.dir/modules/tex/SessionPdfLatex.cpp.o
cd /wrkdirs/usr/ports/devel/RStudio/work-desktop/.build/src/cpp/session && /usr/bin/c++ -DBOOST_ASIO_DISABLE_KQUEUE -DBOOST_ENABLE_ASSERT_HANDLER -DBOOST_SIGNALS_NO_DEPRECATION_WARNING -DRSTUDIO_BOOST_NAMESPACE=boost -DRSTUDIO_BOOST_SIGNALS_VERSION=2 -DRSTUDIO_UNIT_TESTS_ENABLED -DWEBSOCKETPP_STRICT_MASKING -D_FORTIFY_SOURCE=2 -D_WEBSOCKETPP_NO_CPP11_MEMORY_=1 -DSTRIPPED_FILENAME=\"src/cpp/session/modules/tex/SessionPdfLatex.cpp\" -I/wrkdirs/usr/ports/devel/RStudio/work-desktop/rstudio-1.4.1717/src/cpp/session/include -I/usr/local/lib/R/include -I/wrkdirs/usr/ports/devel/RStudio/work-desktop/rstudio-1.4.1717/src/cpp/core/include -I/include -I/wrkdirs/usr/ports/devel/RStudio/work-desktop/rstudio-1.4.1717/src/cpp/shared_core/include -I/wrkdirs/usr/ports/devel/RStudio/work-desktop/rstudio-1.4.1717/src/cpp/ext -I/wrkdirs/usr/ports/devel/RStudio/work-desktop/rstudio-1.4.1717/src/cpp/monitor/include -I/wrkdirs/usr/ports/devel/RStudio/work-desktop/rstudio-1.4.1717/src/cpp/r/include -I/wrkdi
 rs/usr/ports/devel/RStudio/work-desktop/.build/src/cpp/session -I/wrkdirs/usr/ports/devel/RStudio/work-desktop/rstudio-1.4.1717/src/cpp/tests/cpp -isystem /opt/rstudio-tools/amd64/crashpad -isystem /opt/rstudio-tools/amd64/crashpad/crashpad -isystem /opt/rstudio-tools/amd64/crashpad/crashpad/third_party/mini_chromium/mini_chromium -isystem /usr/include/postgresql -isystem /usr/include/pgsql -O2 -pipe -fstack-protector-strong -isystem /usr/local/include -fno-strict-aliasing  -isystem /usr/local/include -std=c++0x -std=c++11 -O2 -pipe -fstack-protector-strong -isystem /usr/local/include -fno-strict-aliasing  -isystem /usr/local/include -fPIE   -Wall -pthread -Werror=return-type -Wformat -Wformat-security -fstack-protector --param ssp-buffer-size=4 -fPIC -MD -MT src/cpp/session/CMakeFiles/rsession.dir/modules/tex/SessionPdfLatex.cpp.o -MF CMakeFiles/rsession.dir/modules/tex/SessionPdfLatex.cpp.o.d -o CMakeFiles/rsession.dir/modules/tex/SessionPdfLatex.cpp.o -c /wrkdirs/usr/ports/devel/
 RStudio/work-desktop/rstudio-1.4.1717/src/cp!
 p/session/modules/tex/SessionPdfLatex.cpp
[ 92%] Building CXX object src/cpp/session/CMakeFiles/rsession.dir/modules/tex/SessionRnwConcordance.cpp.o
cd /wrkdirs/usr/ports/devel/RStudio/work-desktop/.build/src/cpp/session && /usr/bin/c++ -DBOOST_ASIO_DISABLE_KQUEUE -DBOOST_ENABLE_ASSERT_HANDLER -DBOOST_SIGNALS_NO_DEPRECATION_WARNING -DRSTUDIO_BOOST_NAMESPACE=boost -DRSTUDIO_BOOST_SIGNALS_VERSION=2 -DRSTUDIO_UNIT_TESTS_ENABLED -DWEBSOCKETPP_STRICT_MASKING -D_FORTIFY_SOURCE=2 -D_WEBSOCKETPP_NO_CPP11_MEMORY_=1 -DSTRIPPED_FILENAME=\"src/cpp/session/modules/tex/SessionRnwConcordance.cpp\" -I/wrkdirs/usr/ports/devel/RStudio/work-desktop/rstudio-1.4.1717/src/cpp/session/include -I/usr/local/lib/R/include -I/wrkdirs/usr/ports/devel/RStudio/work-desktop/rstudio-1.4.1717/src/cpp/core/include -I/include -I/wrkdirs/usr/ports/devel/RStudio/work-desktop/rstudio-1.4.1717/src/cpp/shared_core/include -I/wrkdirs/usr/ports/devel/RStudio/work-desktop/rstudio-1.4.1717/src/cpp/ext -I/wrkdirs/usr/ports/devel/RStudio/work-desktop/rstudio-1.4.1717/src/cpp/monitor/include -I/wrkdirs/usr/ports/devel/RStudio/work-desktop/rstudio-1.4.1717/src/cpp/r/include -I
 /wrkdirs/usr/ports/devel/RStudio/work-desktop/.build/src/cpp/session -I/wrkdirs/usr/ports/devel/RStudio/work-desktop/rstudio-1.4.1717/src/cpp/tests/cpp -isystem /opt/rstudio-tools/amd64/crashpad -isystem /opt/rstudio-tools/amd64/crashpad/crashpad -isystem /opt/rstudio-tools/amd64/crashpad/crashpad/third_party/mini_chromium/mini_chromium -isystem /usr/include/postgresql -isystem /usr/include/pgsql -O2 -pipe -fstack-protector-strong -isystem /usr/local/include -fno-strict-aliasing  -isystem /usr/local/include -std=c++0x -std=c++11 -O2 -pipe -fstack-protector-strong -isystem /usr/local/include -fno-strict-aliasing  -isystem /usr/local/include -fPIE   -Wall -pthread -Werror=return-type -Wformat -Wformat-security -fstack-protector --param ssp-buffer-size=4 -fPIC -MD -MT src/cpp/session/CMakeFiles/rsession.dir/modules/tex/SessionRnwConcordance.cpp.o -MF CMakeFiles/rsession.dir/modules/tex/SessionRnwConcordance.cpp.o.d -o CMakeFiles/rsession.dir/modules/tex/SessionRnwConcordance.cpp.o -c /
 wrkdirs/usr/ports/devel/RStudio/work-desktop!
 /rstudio-1.4.1717/src/cpp/session/modules/tex/SessionRnwConcordance.cpp
[ 92%] Building CXX object src/cpp/session/CMakeFiles/rsession.dir/modules/tex/SessionRnwWeave.cpp.o
cd /wrkdirs/usr/ports/devel/RStudio/work-desktop/.build/src/cpp/session && /usr/bin/c++ -DBOOST_ASIO_DISABLE_KQUEUE -DBOOST_ENABLE_ASSERT_HANDLER -DBOOST_SIGNALS_NO_DEPRECATION_WARNING -DRSTUDIO_BOOST_NAMESPACE=boost -DRSTUDIO_BOOST_SIGNALS_VERSION=2 -DRSTUDIO_UNIT_TESTS_ENABLED -DWEBSOCKETPP_STRICT_MASKING -D_FORTIFY_SOURCE=2 -D_WEBSOCKETPP_NO_CPP11_MEMORY_=1 -DSTRIPPED_FILENAME=\"src/cpp/session/modules/tex/SessionRnwWeave.cpp\" -I/wrkdirs/usr/ports/devel/RStudio/work-desktop/rstudio-1.4.1717/src/cpp/session/include -I/usr/local/lib/R/include -I/wrkdirs/usr/ports/devel/RStudio/work-desktop/rstudio-1.4.1717/src/cpp/core/include -I/include -I/wrkdirs/usr/ports/devel/RStudio/work-desktop/rstudio-1.4.1717/src/cpp/shared_core/include -I/wrkdirs/usr/ports/devel/RStudio/work-desktop/rstudio-1.4.1717/src/cpp/ext -I/wrkdirs/usr/ports/devel/RStudio/work-desktop/rstudio-1.4.1717/src/cpp/monitor/include -I/wrkdirs/usr/ports/devel/RStudio/work-desktop/rstudio-1.4.1717/src/cpp/r/include -I/wrkdi
 rs/usr/ports/devel/RStudio/work-desktop/.build/src/cpp/session -I/wrkdirs/usr/ports/devel/RStudio/work-desktop/rstudio-1.4.1717/src/cpp/tests/cpp -isystem /opt/rstudio-tools/amd64/crashpad -isystem /opt/rstudio-tools/amd64/crashpad/crashpad -isystem /opt/rstudio-tools/amd64/crashpad/crashpad/third_party/mini_chromium/mini_chromium -isystem /usr/include/postgresql -isystem /usr/include/pgsql -O2 -pipe -fstack-protector-strong -isystem /usr/local/include -fno-strict-aliasing  -isystem /usr/local/include -std=c++0x -std=c++11 -O2 -pipe -fstack-protector-strong -isystem /usr/local/include -fno-strict-aliasing  -isystem /usr/local/include -fPIE   -Wall -pthread -Werror=return-type -Wformat -Wformat-security -fstack-protector --param ssp-buffer-size=4 -fPIC -MD -MT src/cpp/session/CMakeFiles/rsession.dir/modules/tex/SessionRnwWeave.cpp.o -MF CMakeFiles/rsession.dir/modules/tex/SessionRnwWeave.cpp.o.d -o CMakeFiles/rsession.dir/modules/tex/SessionRnwWeave.cpp.o -c /wrkdirs/usr/ports/devel/
 RStudio/work-desktop/rstudio-1.4.1717/src/cp!
 p/session/modules/tex/SessionRnwWeave.cpp
[ 92%] Building CXX object src/cpp/session/CMakeFiles/rsession.dir/modules/tex/SessionSynctex.cpp.o
cd /wrkdirs/usr/ports/devel/RStudio/work-desktop/.build/src/cpp/session && /usr/bin/c++ -DBOOST_ASIO_DISABLE_KQUEUE -DBOOST_ENABLE_ASSERT_HANDLER -DBOOST_SIGNALS_NO_DEPRECATION_WARNING -DRSTUDIO_BOOST_NAMESPACE=boost -DRSTUDIO_BOOST_SIGNALS_VERSION=2 -DRSTUDIO_UNIT_TESTS_ENABLED -DWEBSOCKETPP_STRICT_MASKING -D_FORTIFY_SOURCE=2 -D_WEBSOCKETPP_NO_CPP11_MEMORY_=1 -DSTRIPPED_FILENAME=\"src/cpp/session/modules/tex/SessionSynctex.cpp\" -I/wrkdirs/usr/ports/devel/RStudio/work-desktop/rstudio-1.4.1717/src/cpp/session/include -I/usr/local/lib/R/include -I/wrkdirs/usr/ports/devel/RStudio/work-desktop/rstudio-1.4.1717/src/cpp/core/include -I/include -I/wrkdirs/usr/ports/devel/RStudio/work-desktop/rstudio-1.4.1717/src/cpp/shared_core/include -I/wrkdirs/usr/ports/devel/RStudio/work-desktop/rstudio-1.4.1717/src/cpp/ext -I/wrkdirs/usr/ports/devel/RStudio/work-desktop/rstudio-1.4.1717/src/cpp/monitor/include -I/wrkdirs/usr/ports/devel/RStudio/work-desktop/rstudio-1.4.1717/src/cpp/r/include -I/wrkdir
 s/usr/ports/devel/RStudio/work-desktop/.build/src/cpp/session -I/wrkdirs/usr/ports/devel/RStudio/work-desktop/rstudio-1.4.1717/src/cpp/tests/cpp -isystem /opt/rstudio-tools/amd64/crashpad -isystem /opt/rstudio-tools/amd64/crashpad/crashpad -isystem /opt/rstudio-tools/amd64/crashpad/crashpad/third_party/mini_chromium/mini_chromium -isystem /usr/include/postgresql -isystem /usr/include/pgsql -O2 -pipe -fstack-protector-strong -isystem /usr/local/include -fno-strict-aliasing  -isystem /usr/local/include -std=c++0x -std=c++11 -O2 -pipe -fstack-protector-strong -isystem /usr/local/include -fno-strict-aliasing  -isystem /usr/local/include -fPIE   -Wall -pthread -Werror=return-type -Wformat -Wformat-security -fstack-protector --param ssp-buffer-size=4 -fPIC -MD -MT src/cpp/session/CMakeFiles/rsession.dir/modules/tex/SessionSynctex.cpp.o -MF CMakeFiles/rsession.dir/modules/tex/SessionSynctex.cpp.o.d -o CMakeFiles/rsession.dir/modules/tex/SessionSynctex.cpp.o -c /wrkdirs/usr/ports/devel/RStu
 dio/work-desktop/rstudio-1.4.1717/src/cpp/se!
 ssion/modules/tex/SessionSynctex.cpp
[ 92%] Building CXX object src/cpp/session/CMakeFiles/rsession.dir/modules/tex/SessionTexUtils.cpp.o
cd /wrkdirs/usr/ports/devel/RStudio/work-desktop/.build/src/cpp/session && /usr/bin/c++ -DBOOST_ASIO_DISABLE_KQUEUE -DBOOST_ENABLE_ASSERT_HANDLER -DBOOST_SIGNALS_NO_DEPRECATION_WARNING -DRSTUDIO_BOOST_NAMESPACE=boost -DRSTUDIO_BOOST_SIGNALS_VERSION=2 -DRSTUDIO_UNIT_TESTS_ENABLED -DWEBSOCKETPP_STRICT_MASKING -D_FORTIFY_SOURCE=2 -D_WEBSOCKETPP_NO_CPP11_MEMORY_=1 -DSTRIPPED_FILENAME=\"src/cpp/session/modules/tex/SessionTexUtils.cpp\" -I/wrkdirs/usr/ports/devel/RStudio/work-desktop/rstudio-1.4.1717/src/cpp/session/include -I/usr/local/lib/R/include -I/wrkdirs/usr/ports/devel/RStudio/work-desktop/rstudio-1.4.1717/src/cpp/core/include -I/include -I/wrkdirs/usr/ports/devel/RStudio/work-desktop/rstudio-1.4.1717/src/cpp/shared_core/include -I/wrkdirs/usr/ports/devel/RStudio/work-desktop/rstudio-1.4.1717/src/cpp/ext -I/wrkdirs/usr/ports/devel/RStudio/work-desktop/rstudio-1.4.1717/src/cpp/monitor/include -I/wrkdirs/usr/ports/devel/RStudio/work-desktop/rstudio-1.4.1717/src/cpp/r/include -I/wrkdi
 rs/usr/ports/devel/RStudio/work-desktop/.build/src/cpp/session -I/wrkdirs/usr/ports/devel/RStudio/work-desktop/rstudio-1.4.1717/src/cpp/tests/cpp -isystem /opt/rstudio-tools/amd64/crashpad -isystem /opt/rstudio-tools/amd64/crashpad/crashpad -isystem /opt/rstudio-tools/amd64/crashpad/crashpad/third_party/mini_chromium/mini_chromium -isystem /usr/include/postgresql -isystem /usr/include/pgsql -O2 -pipe -fstack-protector-strong -isystem /usr/local/include -fno-strict-aliasing  -isystem /usr/local/include -std=c++0x -std=c++11 -O2 -pipe -fstack-protector-strong -isystem /usr/local/include -fno-strict-aliasing  -isystem /usr/local/include -fPIE   -Wall -pthread -Werror=return-type -Wformat -Wformat-security -fstack-protector --param ssp-buffer-size=4 -fPIC -MD -MT src/cpp/session/CMakeFiles/rsession.dir/modules/tex/SessionTexUtils.cpp.o -MF CMakeFiles/rsession.dir/modules/tex/SessionTexUtils.cpp.o.d -o CMakeFiles/rsession.dir/modules/tex/SessionTexUtils.cpp.o -c /wrkdirs/usr/ports/devel/
 RStudio/work-desktop/rstudio-1.4.1717/src/cp!
 p/session/modules/tex/SessionTexUtils.cpp
[ 93%] Building CXX object src/cpp/session/CMakeFiles/rsession.dir/modules/tex/SessionViewPdf.cpp.o
cd /wrkdirs/usr/ports/devel/RStudio/work-desktop/.build/src/cpp/session && /usr/bin/c++ -DBOOST_ASIO_DISABLE_KQUEUE -DBOOST_ENABLE_ASSERT_HANDLER -DBOOST_SIGNALS_NO_DEPRECATION_WARNING -DRSTUDIO_BOOST_NAMESPACE=boost -DRSTUDIO_BOOST_SIGNALS_VERSION=2 -DRSTUDIO_UNIT_TESTS_ENABLED -DWEBSOCKETPP_STRICT_MASKING -D_FORTIFY_SOURCE=2 -D_WEBSOCKETPP_NO_CPP11_MEMORY_=1 -DSTRIPPED_FILENAME=\"src/cpp/session/modules/tex/SessionViewPdf.cpp\" -I/wrkdirs/usr/ports/devel/RStudio/work-desktop/rstudio-1.4.1717/src/cpp/session/include -I/usr/local/lib/R/include -I/wrkdirs/usr/ports/devel/RStudio/work-desktop/rstudio-1.4.1717/src/cpp/core/include -I/include -I/wrkdirs/usr/ports/devel/RStudio/work-desktop/rstudio-1.4.1717/src/cpp/shared_core/include -I/wrkdirs/usr/ports/devel/RStudio/work-desktop/rstudio-1.4.1717/src/cpp/ext -I/wrkdirs/usr/ports/devel/RStudio/work-desktop/rstudio-1.4.1717/src/cpp/monitor/include -I/wrkdirs/usr/ports/devel/RStudio/work-desktop/rstudio-1.4.1717/src/cpp/r/include -I/wrkdir
 s/usr/ports/devel/RStudio/work-desktop/.build/src/cpp/session -I/wrkdirs/usr/ports/devel/RStudio/work-desktop/rstudio-1.4.1717/src/cpp/tests/cpp -isystem /opt/rstudio-tools/amd64/crashpad -isystem /opt/rstudio-tools/amd64/crashpad/crashpad -isystem /opt/rstudio-tools/amd64/crashpad/crashpad/third_party/mini_chromium/mini_chromium -isystem /usr/include/postgresql -isystem /usr/include/pgsql -O2 -pipe -fstack-protector-strong -isystem /usr/local/include -fno-strict-aliasing  -isystem /usr/local/include -std=c++0x -std=c++11 -O2 -pipe -fstack-protector-strong -isystem /usr/local/include -fno-strict-aliasing  -isystem /usr/local/include -fPIE   -Wall -pthread -Werror=return-type -Wformat -Wformat-security -fstack-protector --param ssp-buffer-size=4 -fPIC -MD -MT src/cpp/session/CMakeFiles/rsession.dir/modules/tex/SessionViewPdf.cpp.o -MF CMakeFiles/rsession.dir/modules/tex/SessionViewPdf.cpp.o.d -o CMakeFiles/rsession.dir/modules/tex/SessionViewPdf.cpp.o -c /wrkdirs/usr/ports/devel/RStu
 dio/work-desktop/rstudio-1.4.1717/src/cpp/se!
 ssion/modules/tex/SessionViewPdf.cpp
[ 93%] Building CXX object src/cpp/session/CMakeFiles/rsession.dir/modules/vcs/SessionVCSCore.cpp.o
cd /wrkdirs/usr/ports/devel/RStudio/work-desktop/.build/src/cpp/session && /usr/bin/c++ -DBOOST_ASIO_DISABLE_KQUEUE -DBOOST_ENABLE_ASSERT_HANDLER -DBOOST_SIGNALS_NO_DEPRECATION_WARNING -DRSTUDIO_BOOST_NAMESPACE=boost -DRSTUDIO_BOOST_SIGNALS_VERSION=2 -DRSTUDIO_UNIT_TESTS_ENABLED -DWEBSOCKETPP_STRICT_MASKING -D_FORTIFY_SOURCE=2 -D_WEBSOCKETPP_NO_CPP11_MEMORY_=1 -DSTRIPPED_FILENAME=\"src/cpp/session/modules/vcs/SessionVCSCore.cpp\" -I/wrkdirs/usr/ports/devel/RStudio/work-desktop/rstudio-1.4.1717/src/cpp/session/include -I/usr/local/lib/R/include -I/wrkdirs/usr/ports/devel/RStudio/work-desktop/rstudio-1.4.1717/src/cpp/core/include -I/include -I/wrkdirs/usr/ports/devel/RStudio/work-desktop/rstudio-1.4.1717/src/cpp/shared_core/include -I/wrkdirs/usr/ports/devel/RStudio/work-desktop/rstudio-1.4.1717/src/cpp/ext -I/wrkdirs/usr/ports/devel/RStudio/work-desktop/rstudio-1.4.1717/src/cpp/monitor/include -I/wrkdirs/usr/ports/devel/RStudio/work-desktop/rstudio-1.4.1717/src/cpp/r/include -I/wrkdir
 s/usr/ports/devel/RStudio/work-desktop/.build/src/cpp/session -I/wrkdirs/usr/ports/devel/RStudio/work-desktop/rstudio-1.4.1717/src/cpp/tests/cpp -isystem /opt/rstudio-tools/amd64/crashpad -isystem /opt/rstudio-tools/amd64/crashpad/crashpad -isystem /opt/rstudio-tools/amd64/crashpad/crashpad/third_party/mini_chromium/mini_chromium -isystem /usr/include/postgresql -isystem /usr/include/pgsql -O2 -pipe -fstack-protector-strong -isystem /usr/local/include -fno-strict-aliasing  -isystem /usr/local/include -std=c++0x -std=c++11 -O2 -pipe -fstack-protector-strong -isystem /usr/local/include -fno-strict-aliasing  -isystem /usr/local/include -fPIE   -Wall -pthread -Werror=return-type -Wformat -Wformat-security -fstack-protector --param ssp-buffer-size=4 -fPIC -MD -MT src/cpp/session/CMakeFiles/rsession.dir/modules/vcs/SessionVCSCore.cpp.o -MF CMakeFiles/rsession.dir/modules/vcs/SessionVCSCore.cpp.o.d -o CMakeFiles/rsession.dir/modules/vcs/SessionVCSCore.cpp.o -c /wrkdirs/usr/ports/devel/RStu
 dio/work-desktop/rstudio-1.4.1717/src/cpp/se!
 ssion/modules/vcs/SessionVCSCore.cpp
[ 93%] Building CXX object src/cpp/session/CMakeFiles/rsession.dir/modules/vcs/SessionVCSUtils.cpp.o
cd /wrkdirs/usr/ports/devel/RStudio/work-desktop/.build/src/cpp/session && /usr/bin/c++ -DBOOST_ASIO_DISABLE_KQUEUE -DBOOST_ENABLE_ASSERT_HANDLER -DBOOST_SIGNALS_NO_DEPRECATION_WARNING -DRSTUDIO_BOOST_NAMESPACE=boost -DRSTUDIO_BOOST_SIGNALS_VERSION=2 -DRSTUDIO_UNIT_TESTS_ENABLED -DWEBSOCKETPP_STRICT_MASKING -D_FORTIFY_SOURCE=2 -D_WEBSOCKETPP_NO_CPP11_MEMORY_=1 -DSTRIPPED_FILENAME=\"src/cpp/session/modules/vcs/SessionVCSUtils.cpp\" -I/wrkdirs/usr/ports/devel/RStudio/work-desktop/rstudio-1.4.1717/src/cpp/session/include -I/usr/local/lib/R/include -I/wrkdirs/usr/ports/devel/RStudio/work-desktop/rstudio-1.4.1717/src/cpp/core/include -I/include -I/wrkdirs/usr/ports/devel/RStudio/work-desktop/rstudio-1.4.1717/src/cpp/shared_core/include -I/wrkdirs/usr/ports/devel/RStudio/work-desktop/rstudio-1.4.1717/src/cpp/ext -I/wrkdirs/usr/ports/devel/RStudio/work-desktop/rstudio-1.4.1717/src/cpp/monitor/include -I/wrkdirs/usr/ports/devel/RStudio/work-desktop/rstudio-1.4.1717/src/cpp/r/include -I/wrkdi
 rs/usr/ports/devel/RStudio/work-desktop/.build/src/cpp/session -I/wrkdirs/usr/ports/devel/RStudio/work-desktop/rstudio-1.4.1717/src/cpp/tests/cpp -isystem /opt/rstudio-tools/amd64/crashpad -isystem /opt/rstudio-tools/amd64/crashpad/crashpad -isystem /opt/rstudio-tools/amd64/crashpad/crashpad/third_party/mini_chromium/mini_chromium -isystem /usr/include/postgresql -isystem /usr/include/pgsql -O2 -pipe -fstack-protector-strong -isystem /usr/local/include -fno-strict-aliasing  -isystem /usr/local/include -std=c++0x -std=c++11 -O2 -pipe -fstack-protector-strong -isystem /usr/local/include -fno-strict-aliasing  -isystem /usr/local/include -fPIE   -Wall -pthread -Werror=return-type -Wformat -Wformat-security -fstack-protector --param ssp-buffer-size=4 -fPIC -MD -MT src/cpp/session/CMakeFiles/rsession.dir/modules/vcs/SessionVCSUtils.cpp.o -MF CMakeFiles/rsession.dir/modules/vcs/SessionVCSUtils.cpp.o.d -o CMakeFiles/rsession.dir/modules/vcs/SessionVCSUtils.cpp.o -c /wrkdirs/usr/ports/devel/
 RStudio/work-desktop/rstudio-1.4.1717/src/cp!
 p/session/modules/vcs/SessionVCSUtils.cpp
[ 93%] Building CXX object src/cpp/session/CMakeFiles/rsession.dir/modules/viewer/SessionViewer.cpp.o
cd /wrkdirs/usr/ports/devel/RStudio/work-desktop/.build/src/cpp/session && /usr/bin/c++ -DBOOST_ASIO_DISABLE_KQUEUE -DBOOST_ENABLE_ASSERT_HANDLER -DBOOST_SIGNALS_NO_DEPRECATION_WARNING -DRSTUDIO_BOOST_NAMESPACE=boost -DRSTUDIO_BOOST_SIGNALS_VERSION=2 -DRSTUDIO_UNIT_TESTS_ENABLED -DWEBSOCKETPP_STRICT_MASKING -D_FORTIFY_SOURCE=2 -D_WEBSOCKETPP_NO_CPP11_MEMORY_=1 -DSTRIPPED_FILENAME=\"src/cpp/session/modules/viewer/SessionViewer.cpp\" -I/wrkdirs/usr/ports/devel/RStudio/work-desktop/rstudio-1.4.1717/src/cpp/session/include -I/usr/local/lib/R/include -I/wrkdirs/usr/ports/devel/RStudio/work-desktop/rstudio-1.4.1717/src/cpp/core/include -I/include -I/wrkdirs/usr/ports/devel/RStudio/work-desktop/rstudio-1.4.1717/src/cpp/shared_core/include -I/wrkdirs/usr/ports/devel/RStudio/work-desktop/rstudio-1.4.1717/src/cpp/ext -I/wrkdirs/usr/ports/devel/RStudio/work-desktop/rstudio-1.4.1717/src/cpp/monitor/include -I/wrkdirs/usr/ports/devel/RStudio/work-desktop/rstudio-1.4.1717/src/cpp/r/include -I/wrkd
 irs/usr/ports/devel/RStudio/work-desktop/.build/src/cpp/session -I/wrkdirs/usr/ports/devel/RStudio/work-desktop/rstudio-1.4.1717/src/cpp/tests/cpp -isystem /opt/rstudio-tools/amd64/crashpad -isystem /opt/rstudio-tools/amd64/crashpad/crashpad -isystem /opt/rstudio-tools/amd64/crashpad/crashpad/third_party/mini_chromium/mini_chromium -isystem /usr/include/postgresql -isystem /usr/include/pgsql -O2 -pipe -fstack-protector-strong -isystem /usr/local/include -fno-strict-aliasing  -isystem /usr/local/include -std=c++0x -std=c++11 -O2 -pipe -fstack-protector-strong -isystem /usr/local/include -fno-strict-aliasing  -isystem /usr/local/include -fPIE   -Wall -pthread -Werror=return-type -Wformat -Wformat-security -fstack-protector --param ssp-buffer-size=4 -fPIC -MD -MT src/cpp/session/CMakeFiles/rsession.dir/modules/viewer/SessionViewer.cpp.o -MF CMakeFiles/rsession.dir/modules/viewer/SessionViewer.cpp.o.d -o CMakeFiles/rsession.dir/modules/viewer/SessionViewer.cpp.o -c /wrkdirs/usr/ports/de
 vel/RStudio/work-desktop/rstudio-1.4.1717/sr!
 c/cpp/session/modules/viewer/SessionViewer.cpp
[ 93%] Building CXX object src/cpp/session/CMakeFiles/rsession.dir/modules/viewer/ViewerHistory.cpp.o
cd /wrkdirs/usr/ports/devel/RStudio/work-desktop/.build/src/cpp/session && /usr/bin/c++ -DBOOST_ASIO_DISABLE_KQUEUE -DBOOST_ENABLE_ASSERT_HANDLER -DBOOST_SIGNALS_NO_DEPRECATION_WARNING -DRSTUDIO_BOOST_NAMESPACE=boost -DRSTUDIO_BOOST_SIGNALS_VERSION=2 -DRSTUDIO_UNIT_TESTS_ENABLED -DWEBSOCKETPP_STRICT_MASKING -D_FORTIFY_SOURCE=2 -D_WEBSOCKETPP_NO_CPP11_MEMORY_=1 -DSTRIPPED_FILENAME=\"src/cpp/session/modules/viewer/ViewerHistory.cpp\" -I/wrkdirs/usr/ports/devel/RStudio/work-desktop/rstudio-1.4.1717/src/cpp/session/include -I/usr/local/lib/R/include -I/wrkdirs/usr/ports/devel/RStudio/work-desktop/rstudio-1.4.1717/src/cpp/core/include -I/include -I/wrkdirs/usr/ports/devel/RStudio/work-desktop/rstudio-1.4.1717/src/cpp/shared_core/include -I/wrkdirs/usr/ports/devel/RStudio/work-desktop/rstudio-1.4.1717/src/cpp/ext -I/wrkdirs/usr/ports/devel/RStudio/work-desktop/rstudio-1.4.1717/src/cpp/monitor/include -I/wrkdirs/usr/ports/devel/RStudio/work-desktop/rstudio-1.4.1717/src/cpp/r/include -I/wrkd
 irs/usr/ports/devel/RStudio/work-desktop/.build/src/cpp/session -I/wrkdirs/usr/ports/devel/RStudio/work-desktop/rstudio-1.4.1717/src/cpp/tests/cpp -isystem /opt/rstudio-tools/amd64/crashpad -isystem /opt/rstudio-tools/amd64/crashpad/crashpad -isystem /opt/rstudio-tools/amd64/crashpad/crashpad/third_party/mini_chromium/mini_chromium -isystem /usr/include/postgresql -isystem /usr/include/pgsql -O2 -pipe -fstack-protector-strong -isystem /usr/local/include -fno-strict-aliasing  -isystem /usr/local/include -std=c++0x -std=c++11 -O2 -pipe -fstack-protector-strong -isystem /usr/local/include -fno-strict-aliasing  -isystem /usr/local/include -fPIE   -Wall -pthread -Werror=return-type -Wformat -Wformat-security -fstack-protector --param ssp-buffer-size=4 -fPIC -MD -MT src/cpp/session/CMakeFiles/rsession.dir/modules/viewer/ViewerHistory.cpp.o -MF CMakeFiles/rsession.dir/modules/viewer/ViewerHistory.cpp.o.d -o CMakeFiles/rsession.dir/modules/viewer/ViewerHistory.cpp.o -c /wrkdirs/usr/ports/de
 vel/RStudio/work-desktop/rstudio-1.4.1717/sr!
 c/cpp/session/modules/viewer/ViewerHistory.cpp
[ 93%] Building CXX object src/cpp/session/CMakeFiles/rsession.dir/modules/zotero/ZoteroBetterBibTeX.cpp.o
cd /wrkdirs/usr/ports/devel/RStudio/work-desktop/.build/src/cpp/session && /usr/bin/c++ -DBOOST_ASIO_DISABLE_KQUEUE -DBOOST_ENABLE_ASSERT_HANDLER -DBOOST_SIGNALS_NO_DEPRECATION_WARNING -DRSTUDIO_BOOST_NAMESPACE=boost -DRSTUDIO_BOOST_SIGNALS_VERSION=2 -DRSTUDIO_UNIT_TESTS_ENABLED -DWEBSOCKETPP_STRICT_MASKING -D_FORTIFY_SOURCE=2 -D_WEBSOCKETPP_NO_CPP11_MEMORY_=1 -DSTRIPPED_FILENAME=\"src/cpp/session/modules/zotero/ZoteroBetterBibTeX.cpp\" -I/wrkdirs/usr/ports/devel/RStudio/work-desktop/rstudio-1.4.1717/src/cpp/session/include -I/usr/local/lib/R/include -I/wrkdirs/usr/ports/devel/RStudio/work-desktop/rstudio-1.4.1717/src/cpp/core/include -I/include -I/wrkdirs/usr/ports/devel/RStudio/work-desktop/rstudio-1.4.1717/src/cpp/shared_core/include -I/wrkdirs/usr/ports/devel/RStudio/work-desktop/rstudio-1.4.1717/src/cpp/ext -I/wrkdirs/usr/ports/devel/RStudio/work-desktop/rstudio-1.4.1717/src/cpp/monitor/include -I/wrkdirs/usr/ports/devel/RStudio/work-desktop/rstudio-1.4.1717/src/cpp/r/include -I
 /wrkdirs/usr/ports/devel/RStudio/work-desktop/.build/src/cpp/session -I/wrkdirs/usr/ports/devel/RStudio/work-desktop/rstudio-1.4.1717/src/cpp/tests/cpp -isystem /opt/rstudio-tools/amd64/crashpad -isystem /opt/rstudio-tools/amd64/crashpad/crashpad -isystem /opt/rstudio-tools/amd64/crashpad/crashpad/third_party/mini_chromium/mini_chromium -isystem /usr/include/postgresql -isystem /usr/include/pgsql -O2 -pipe -fstack-protector-strong -isystem /usr/local/include -fno-strict-aliasing  -isystem /usr/local/include -std=c++0x -std=c++11 -O2 -pipe -fstack-protector-strong -isystem /usr/local/include -fno-strict-aliasing  -isystem /usr/local/include -fPIE   -Wall -pthread -Werror=return-type -Wformat -Wformat-security -fstack-protector --param ssp-buffer-size=4 -fPIC -MD -MT src/cpp/session/CMakeFiles/rsession.dir/modules/zotero/ZoteroBetterBibTeX.cpp.o -MF CMakeFiles/rsession.dir/modules/zotero/ZoteroBetterBibTeX.cpp.o.d -o CMakeFiles/rsession.dir/modules/zotero/ZoteroBetterBibTeX.cpp.o -c /
 wrkdirs/usr/ports/devel/RStudio/work-desktop!
 /rstudio-1.4.1717/src/cpp/session/modules/zotero/ZoteroBetterBibTeX.cpp
[ 94%] Building CXX object src/cpp/session/CMakeFiles/rsession.dir/modules/zotero/ZoteroCollections.cpp.o
cd /wrkdirs/usr/ports/devel/RStudio/work-desktop/.build/src/cpp/session && /usr/bin/c++ -DBOOST_ASIO_DISABLE_KQUEUE -DBOOST_ENABLE_ASSERT_HANDLER -DBOOST_SIGNALS_NO_DEPRECATION_WARNING -DRSTUDIO_BOOST_NAMESPACE=boost -DRSTUDIO_BOOST_SIGNALS_VERSION=2 -DRSTUDIO_UNIT_TESTS_ENABLED -DWEBSOCKETPP_STRICT_MASKING -D_FORTIFY_SOURCE=2 -D_WEBSOCKETPP_NO_CPP11_MEMORY_=1 -DSTRIPPED_FILENAME=\"src/cpp/session/modules/zotero/ZoteroCollections.cpp\" -I/wrkdirs/usr/ports/devel/RStudio/work-desktop/rstudio-1.4.1717/src/cpp/session/include -I/usr/local/lib/R/include -I/wrkdirs/usr/ports/devel/RStudio/work-desktop/rstudio-1.4.1717/src/cpp/core/include -I/include -I/wrkdirs/usr/ports/devel/RStudio/work-desktop/rstudio-1.4.1717/src/cpp/shared_core/include -I/wrkdirs/usr/ports/devel/RStudio/work-desktop/rstudio-1.4.1717/src/cpp/ext -I/wrkdirs/usr/ports/devel/RStudio/work-desktop/rstudio-1.4.1717/src/cpp/monitor/include -I/wrkdirs/usr/ports/devel/RStudio/work-desktop/rstudio-1.4.1717/src/cpp/r/include -I/
 wrkdirs/usr/ports/devel/RStudio/work-desktop/.build/src/cpp/session -I/wrkdirs/usr/ports/devel/RStudio/work-desktop/rstudio-1.4.1717/src/cpp/tests/cpp -isystem /opt/rstudio-tools/amd64/crashpad -isystem /opt/rstudio-tools/amd64/crashpad/crashpad -isystem /opt/rstudio-tools/amd64/crashpad/crashpad/third_party/mini_chromium/mini_chromium -isystem /usr/include/postgresql -isystem /usr/include/pgsql -O2 -pipe -fstack-protector-strong -isystem /usr/local/include -fno-strict-aliasing  -isystem /usr/local/include -std=c++0x -std=c++11 -O2 -pipe -fstack-protector-strong -isystem /usr/local/include -fno-strict-aliasing  -isystem /usr/local/include -fPIE   -Wall -pthread -Werror=return-type -Wformat -Wformat-security -fstack-protector --param ssp-buffer-size=4 -fPIC -MD -MT src/cpp/session/CMakeFiles/rsession.dir/modules/zotero/ZoteroCollections.cpp.o -MF CMakeFiles/rsession.dir/modules/zotero/ZoteroCollections.cpp.o.d -o CMakeFiles/rsession.dir/modules/zotero/ZoteroCollections.cpp.o -c /wrkd
 irs/usr/ports/devel/RStudio/work-desktop/rst!
 udio-1.4.1717/src/cpp/session/modules/zotero/ZoteroCollections.cpp
[ 94%] Building CXX object src/cpp/session/CMakeFiles/rsession.dir/modules/zotero/ZoteroCollectionsWeb.cpp.o
cd /wrkdirs/usr/ports/devel/RStudio/work-desktop/.build/src/cpp/session && /usr/bin/c++ -DBOOST_ASIO_DISABLE_KQUEUE -DBOOST_ENABLE_ASSERT_HANDLER -DBOOST_SIGNALS_NO_DEPRECATION_WARNING -DRSTUDIO_BOOST_NAMESPACE=boost -DRSTUDIO_BOOST_SIGNALS_VERSION=2 -DRSTUDIO_UNIT_TESTS_ENABLED -DWEBSOCKETPP_STRICT_MASKING -D_FORTIFY_SOURCE=2 -D_WEBSOCKETPP_NO_CPP11_MEMORY_=1 -DSTRIPPED_FILENAME=\"src/cpp/session/modules/zotero/ZoteroCollectionsWeb.cpp\" -I/wrkdirs/usr/ports/devel/RStudio/work-desktop/rstudio-1.4.1717/src/cpp/session/include -I/usr/local/lib/R/include -I/wrkdirs/usr/ports/devel/RStudio/work-desktop/rstudio-1.4.1717/src/cpp/core/include -I/include -I/wrkdirs/usr/ports/devel/RStudio/work-desktop/rstudio-1.4.1717/src/cpp/shared_core/include -I/wrkdirs/usr/ports/devel/RStudio/work-desktop/rstudio-1.4.1717/src/cpp/ext -I/wrkdirs/usr/ports/devel/RStudio/work-desktop/rstudio-1.4.1717/src/cpp/monitor/include -I/wrkdirs/usr/ports/devel/RStudio/work-desktop/rstudio-1.4.1717/src/cpp/r/include 
 -I/wrkdirs/usr/ports/devel/RStudio/work-desktop/.build/src/cpp/session -I/wrkdirs/usr/ports/devel/RStudio/work-desktop/rstudio-1.4.1717/src/cpp/tests/cpp -isystem /opt/rstudio-tools/amd64/crashpad -isystem /opt/rstudio-tools/amd64/crashpad/crashpad -isystem /opt/rstudio-tools/amd64/crashpad/crashpad/third_party/mini_chromium/mini_chromium -isystem /usr/include/postgresql -isystem /usr/include/pgsql -O2 -pipe -fstack-protector-strong -isystem /usr/local/include -fno-strict-aliasing  -isystem /usr/local/include -std=c++0x -std=c++11 -O2 -pipe -fstack-protector-strong -isystem /usr/local/include -fno-strict-aliasing  -isystem /usr/local/include -fPIE   -Wall -pthread -Werror=return-type -Wformat -Wformat-security -fstack-protector --param ssp-buffer-size=4 -fPIC -MD -MT src/cpp/session/CMakeFiles/rsession.dir/modules/zotero/ZoteroCollectionsWeb.cpp.o -MF CMakeFiles/rsession.dir/modules/zotero/ZoteroCollectionsWeb.cpp.o.d -o CMakeFiles/rsession.dir/modules/zotero/ZoteroCollectionsWeb.cp
 p.o -c /wrkdirs/usr/ports/devel/RStudio/work!
 -desktop/rstudio-1.4.1717/src/cpp/session/modules/zotero/ZoteroCollectionsWeb.cpp
[ 94%] Building CXX object src/cpp/session/CMakeFiles/rsession.dir/modules/zotero/ZoteroCollectionsLocal.cpp.o
cd /wrkdirs/usr/ports/devel/RStudio/work-desktop/.build/src/cpp/session && /usr/bin/c++ -DBOOST_ASIO_DISABLE_KQUEUE -DBOOST_ENABLE_ASSERT_HANDLER -DBOOST_SIGNALS_NO_DEPRECATION_WARNING -DRSTUDIO_BOOST_NAMESPACE=boost -DRSTUDIO_BOOST_SIGNALS_VERSION=2 -DRSTUDIO_UNIT_TESTS_ENABLED -DWEBSOCKETPP_STRICT_MASKING -D_FORTIFY_SOURCE=2 -D_WEBSOCKETPP_NO_CPP11_MEMORY_=1 -DSTRIPPED_FILENAME=\"src/cpp/session/modules/zotero/ZoteroCollectionsLocal.cpp\" -I/wrkdirs/usr/ports/devel/RStudio/work-desktop/rstudio-1.4.1717/src/cpp/session/include -I/usr/local/lib/R/include -I/wrkdirs/usr/ports/devel/RStudio/work-desktop/rstudio-1.4.1717/src/cpp/core/include -I/include -I/wrkdirs/usr/ports/devel/RStudio/work-desktop/rstudio-1.4.1717/src/cpp/shared_core/include -I/wrkdirs/usr/ports/devel/RStudio/work-desktop/rstudio-1.4.1717/src/cpp/ext -I/wrkdirs/usr/ports/devel/RStudio/work-desktop/rstudio-1.4.1717/src/cpp/monitor/include -I/wrkdirs/usr/ports/devel/RStudio/work-desktop/rstudio-1.4.1717/src/cpp/r/includ
 e -I/wrkdirs/usr/ports/devel/RStudio/work-desktop/.build/src/cpp/session -I/wrkdirs/usr/ports/devel/RStudio/work-desktop/rstudio-1.4.1717/src/cpp/tests/cpp -isystem /opt/rstudio-tools/amd64/crashpad -isystem /opt/rstudio-tools/amd64/crashpad/crashpad -isystem /opt/rstudio-tools/amd64/crashpad/crashpad/third_party/mini_chromium/mini_chromium -isystem /usr/include/postgresql -isystem /usr/include/pgsql -O2 -pipe -fstack-protector-strong -isystem /usr/local/include -fno-strict-aliasing  -isystem /usr/local/include -std=c++0x -std=c++11 -O2 -pipe -fstack-protector-strong -isystem /usr/local/include -fno-strict-aliasing  -isystem /usr/local/include -fPIE   -Wall -pthread -Werror=return-type -Wformat -Wformat-security -fstack-protector --param ssp-buffer-size=4 -fPIC -MD -MT src/cpp/session/CMakeFiles/rsession.dir/modules/zotero/ZoteroCollectionsLocal.cpp.o -MF CMakeFiles/rsession.dir/modules/zotero/ZoteroCollectionsLocal.cpp.o.d -o CMakeFiles/rsession.dir/modules/zotero/ZoteroCollections
 Local.cpp.o -c /wrkdirs/usr/ports/devel/RStu!
 dio/work-desktop/rstudio-1.4.1717/src/cpp/session/modules/zotero/ZoteroCollectionsLocal.cpp
[ 94%] Building CXX object src/cpp/session/CMakeFiles/rsession.dir/modules/zotero/ZoteroCSL.cpp.o
cd /wrkdirs/usr/ports/devel/RStudio/work-desktop/.build/src/cpp/session && /usr/bin/c++ -DBOOST_ASIO_DISABLE_KQUEUE -DBOOST_ENABLE_ASSERT_HANDLER -DBOOST_SIGNALS_NO_DEPRECATION_WARNING -DRSTUDIO_BOOST_NAMESPACE=boost -DRSTUDIO_BOOST_SIGNALS_VERSION=2 -DRSTUDIO_UNIT_TESTS_ENABLED -DWEBSOCKETPP_STRICT_MASKING -D_FORTIFY_SOURCE=2 -D_WEBSOCKETPP_NO_CPP11_MEMORY_=1 -DSTRIPPED_FILENAME=\"src/cpp/session/modules/zotero/ZoteroCSL.cpp\" -I/wrkdirs/usr/ports/devel/RStudio/work-desktop/rstudio-1.4.1717/src/cpp/session/include -I/usr/local/lib/R/include -I/wrkdirs/usr/ports/devel/RStudio/work-desktop/rstudio-1.4.1717/src/cpp/core/include -I/include -I/wrkdirs/usr/ports/devel/RStudio/work-desktop/rstudio-1.4.1717/src/cpp/shared_core/include -I/wrkdirs/usr/ports/devel/RStudio/work-desktop/rstudio-1.4.1717/src/cpp/ext -I/wrkdirs/usr/ports/devel/RStudio/work-desktop/rstudio-1.4.1717/src/cpp/monitor/include -I/wrkdirs/usr/ports/devel/RStudio/work-desktop/rstudio-1.4.1717/src/cpp/r/include -I/wrkdirs/
 usr/ports/devel/RStudio/work-desktop/.build/src/cpp/session -I/wrkdirs/usr/ports/devel/RStudio/work-desktop/rstudio-1.4.1717/src/cpp/tests/cpp -isystem /opt/rstudio-tools/amd64/crashpad -isystem /opt/rstudio-tools/amd64/crashpad/crashpad -isystem /opt/rstudio-tools/amd64/crashpad/crashpad/third_party/mini_chromium/mini_chromium -isystem /usr/include/postgresql -isystem /usr/include/pgsql -O2 -pipe -fstack-protector-strong -isystem /usr/local/include -fno-strict-aliasing  -isystem /usr/local/include -std=c++0x -std=c++11 -O2 -pipe -fstack-protector-strong -isystem /usr/local/include -fno-strict-aliasing  -isystem /usr/local/include -fPIE   -Wall -pthread -Werror=return-type -Wformat -Wformat-security -fstack-protector --param ssp-buffer-size=4 -fPIC -MD -MT src/cpp/session/CMakeFiles/rsession.dir/modules/zotero/ZoteroCSL.cpp.o -MF CMakeFiles/rsession.dir/modules/zotero/ZoteroCSL.cpp.o.d -o CMakeFiles/rsession.dir/modules/zotero/ZoteroCSL.cpp.o -c /wrkdirs/usr/ports/devel/RStudio/work
 -desktop/rstudio-1.4.1717/src/cpp/session/mo!
 dules/zotero/ZoteroCSL.cpp
[ 94%] Building CXX object src/cpp/session/CMakeFiles/rsession.dir/modules/zotero/ZoteroUtil.cpp.o
cd /wrkdirs/usr/ports/devel/RStudio/work-desktop/.build/src/cpp/session && /usr/bin/c++ -DBOOST_ASIO_DISABLE_KQUEUE -DBOOST_ENABLE_ASSERT_HANDLER -DBOOST_SIGNALS_NO_DEPRECATION_WARNING -DRSTUDIO_BOOST_NAMESPACE=boost -DRSTUDIO_BOOST_SIGNALS_VERSION=2 -DRSTUDIO_UNIT_TESTS_ENABLED -DWEBSOCKETPP_STRICT_MASKING -D_FORTIFY_SOURCE=2 -D_WEBSOCKETPP_NO_CPP11_MEMORY_=1 -DSTRIPPED_FILENAME=\"src/cpp/session/modules/zotero/ZoteroUtil.cpp\" -I/wrkdirs/usr/ports/devel/RStudio/work-desktop/rstudio-1.4.1717/src/cpp/session/include -I/usr/local/lib/R/include -I/wrkdirs/usr/ports/devel/RStudio/work-desktop/rstudio-1.4.1717/src/cpp/core/include -I/include -I/wrkdirs/usr/ports/devel/RStudio/work-desktop/rstudio-1.4.1717/src/cpp/shared_core/include -I/wrkdirs/usr/ports/devel/RStudio/work-desktop/rstudio-1.4.1717/src/cpp/ext -I/wrkdirs/usr/ports/devel/RStudio/work-desktop/rstudio-1.4.1717/src/cpp/monitor/include -I/wrkdirs/usr/ports/devel/RStudio/work-desktop/rstudio-1.4.1717/src/cpp/r/include -I/wrkdirs
 /usr/ports/devel/RStudio/work-desktop/.build/src/cpp/session -I/wrkdirs/usr/ports/devel/RStudio/work-desktop/rstudio-1.4.1717/src/cpp/tests/cpp -isystem /opt/rstudio-tools/amd64/crashpad -isystem /opt/rstudio-tools/amd64/crashpad/crashpad -isystem /opt/rstudio-tools/amd64/crashpad/crashpad/third_party/mini_chromium/mini_chromium -isystem /usr/include/postgresql -isystem /usr/include/pgsql -O2 -pipe -fstack-protector-strong -isystem /usr/local/include -fno-strict-aliasing  -isystem /usr/local/include -std=c++0x -std=c++11 -O2 -pipe -fstack-protector-strong -isystem /usr/local/include -fno-strict-aliasing  -isystem /usr/local/include -fPIE   -Wall -pthread -Werror=return-type -Wformat -Wformat-security -fstack-protector --param ssp-buffer-size=4 -fPIC -MD -MT src/cpp/session/CMakeFiles/rsession.dir/modules/zotero/ZoteroUtil.cpp.o -MF CMakeFiles/rsession.dir/modules/zotero/ZoteroUtil.cpp.o.d -o CMakeFiles/rsession.dir/modules/zotero/ZoteroUtil.cpp.o -c /wrkdirs/usr/ports/devel/RStudio/
 work-desktop/rstudio-1.4.1717/src/cpp/sessio!
 n/modules/zotero/ZoteroUtil.cpp
[ 94%] Building CXX object src/cpp/session/CMakeFiles/rsession.dir/modules/zotero/SessionZotero.cpp.o
cd /wrkdirs/usr/ports/devel/RStudio/work-desktop/.build/src/cpp/session && /usr/bin/c++ -DBOOST_ASIO_DISABLE_KQUEUE -DBOOST_ENABLE_ASSERT_HANDLER -DBOOST_SIGNALS_NO_DEPRECATION_WARNING -DRSTUDIO_BOOST_NAMESPACE=boost -DRSTUDIO_BOOST_SIGNALS_VERSION=2 -DRSTUDIO_UNIT_TESTS_ENABLED -DWEBSOCKETPP_STRICT_MASKING -D_FORTIFY_SOURCE=2 -D_WEBSOCKETPP_NO_CPP11_MEMORY_=1 -DSTRIPPED_FILENAME=\"src/cpp/session/modules/zotero/SessionZotero.cpp\" -I/wrkdirs/usr/ports/devel/RStudio/work-desktop/rstudio-1.4.1717/src/cpp/session/include -I/usr/local/lib/R/include -I/wrkdirs/usr/ports/devel/RStudio/work-desktop/rstudio-1.4.1717/src/cpp/core/include -I/include -I/wrkdirs/usr/ports/devel/RStudio/work-desktop/rstudio-1.4.1717/src/cpp/shared_core/include -I/wrkdirs/usr/ports/devel/RStudio/work-desktop/rstudio-1.4.1717/src/cpp/ext -I/wrkdirs/usr/ports/devel/RStudio/work-desktop/rstudio-1.4.1717/src/cpp/monitor/include -I/wrkdirs/usr/ports/devel/RStudio/work-desktop/rstudio-1.4.1717/src/cpp/r/include -I/wrkd
 irs/usr/ports/devel/RStudio/work-desktop/.build/src/cpp/session -I/wrkdirs/usr/ports/devel/RStudio/work-desktop/rstudio-1.4.1717/src/cpp/tests/cpp -isystem /opt/rstudio-tools/amd64/crashpad -isystem /opt/rstudio-tools/amd64/crashpad/crashpad -isystem /opt/rstudio-tools/amd64/crashpad/crashpad/third_party/mini_chromium/mini_chromium -isystem /usr/include/postgresql -isystem /usr/include/pgsql -O2 -pipe -fstack-protector-strong -isystem /usr/local/include -fno-strict-aliasing  -isystem /usr/local/include -std=c++0x -std=c++11 -O2 -pipe -fstack-protector-strong -isystem /usr/local/include -fno-strict-aliasing  -isystem /usr/local/include -fPIE   -Wall -pthread -Werror=return-type -Wformat -Wformat-security -fstack-protector --param ssp-buffer-size=4 -fPIC -MD -MT src/cpp/session/CMakeFiles/rsession.dir/modules/zotero/SessionZotero.cpp.o -MF CMakeFiles/rsession.dir/modules/zotero/SessionZotero.cpp.o.d -o CMakeFiles/rsession.dir/modules/zotero/SessionZotero.cpp.o -c /wrkdirs/usr/ports/de
 vel/RStudio/work-desktop/rstudio-1.4.1717/sr!
 c/cpp/session/modules/zotero/SessionZotero.cpp
[ 95%] Building CXX object src/cpp/session/CMakeFiles/rsession.dir/prefs/PrefLayer.cpp.o
cd /wrkdirs/usr/ports/devel/RStudio/work-desktop/.build/src/cpp/session && /usr/bin/c++ -DBOOST_ASIO_DISABLE_KQUEUE -DBOOST_ENABLE_ASSERT_HANDLER -DBOOST_SIGNALS_NO_DEPRECATION_WARNING -DRSTUDIO_BOOST_NAMESPACE=boost -DRSTUDIO_BOOST_SIGNALS_VERSION=2 -DRSTUDIO_UNIT_TESTS_ENABLED -DWEBSOCKETPP_STRICT_MASKING -D_FORTIFY_SOURCE=2 -D_WEBSOCKETPP_NO_CPP11_MEMORY_=1 -DSTRIPPED_FILENAME=\"src/cpp/session/prefs/PrefLayer.cpp\" -I/wrkdirs/usr/ports/devel/RStudio/work-desktop/rstudio-1.4.1717/src/cpp/session/include -I/usr/local/lib/R/include -I/wrkdirs/usr/ports/devel/RStudio/work-desktop/rstudio-1.4.1717/src/cpp/core/include -I/include -I/wrkdirs/usr/ports/devel/RStudio/work-desktop/rstudio-1.4.1717/src/cpp/shared_core/include -I/wrkdirs/usr/ports/devel/RStudio/work-desktop/rstudio-1.4.1717/src/cpp/ext -I/wrkdirs/usr/ports/devel/RStudio/work-desktop/rstudio-1.4.1717/src/cpp/monitor/include -I/wrkdirs/usr/ports/devel/RStudio/work-desktop/rstudio-1.4.1717/src/cpp/r/include -I/wrkdirs/usr/ports
 /devel/RStudio/work-desktop/.build/src/cpp/session -I/wrkdirs/usr/ports/devel/RStudio/work-desktop/rstudio-1.4.1717/src/cpp/tests/cpp -isystem /opt/rstudio-tools/amd64/crashpad -isystem /opt/rstudio-tools/amd64/crashpad/crashpad -isystem /opt/rstudio-tools/amd64/crashpad/crashpad/third_party/mini_chromium/mini_chromium -isystem /usr/include/postgresql -isystem /usr/include/pgsql -O2 -pipe -fstack-protector-strong -isystem /usr/local/include -fno-strict-aliasing  -isystem /usr/local/include -std=c++0x -std=c++11 -O2 -pipe -fstack-protector-strong -isystem /usr/local/include -fno-strict-aliasing  -isystem /usr/local/include -fPIE   -Wall -pthread -Werror=return-type -Wformat -Wformat-security -fstack-protector --param ssp-buffer-size=4 -fPIC -MD -MT src/cpp/session/CMakeFiles/rsession.dir/prefs/PrefLayer.cpp.o -MF CMakeFiles/rsession.dir/prefs/PrefLayer.cpp.o.d -o CMakeFiles/rsession.dir/prefs/PrefLayer.cpp.o -c /wrkdirs/usr/ports/devel/RStudio/work-desktop/rstudio-1.4.1717/src/cpp/se
 ssion/prefs/PrefLayer.cpp
[ 95%] Building CXX object src/cpp/session/CMakeFiles/rsession.dir/prefs/Preferences.cpp.o
cd /wrkdirs/usr/ports/devel/RStudio/work-desktop/.build/src/cpp/session && /usr/bin/c++ -DBOOST_ASIO_DISABLE_KQUEUE -DBOOST_ENABLE_ASSERT_HANDLER -DBOOST_SIGNALS_NO_DEPRECATION_WARNING -DRSTUDIO_BOOST_NAMESPACE=boost -DRSTUDIO_BOOST_SIGNALS_VERSION=2 -DRSTUDIO_UNIT_TESTS_ENABLED -DWEBSOCKETPP_STRICT_MASKING -D_FORTIFY_SOURCE=2 -D_WEBSOCKETPP_NO_CPP11_MEMORY_=1 -DSTRIPPED_FILENAME=\"src/cpp/session/prefs/Preferences.cpp\" -I/wrkdirs/usr/ports/devel/RStudio/work-desktop/rstudio-1.4.1717/src/cpp/session/include -I/usr/local/lib/R/include -I/wrkdirs/usr/ports/devel/RStudio/work-desktop/rstudio-1.4.1717/src/cpp/core/include -I/include -I/wrkdirs/usr/ports/devel/RStudio/work-desktop/rstudio-1.4.1717/src/cpp/shared_core/include -I/wrkdirs/usr/ports/devel/RStudio/work-desktop/rstudio-1.4.1717/src/cpp/ext -I/wrkdirs/usr/ports/devel/RStudio/work-desktop/rstudio-1.4.1717/src/cpp/monitor/include -I/wrkdirs/usr/ports/devel/RStudio/work-desktop/rstudio-1.4.1717/src/cpp/r/include -I/wrkdirs/usr/por
 ts/devel/RStudio/work-desktop/.build/src/cpp/session -I/wrkdirs/usr/ports/devel/RStudio/work-desktop/rstudio-1.4.1717/src/cpp/tests/cpp -isystem /opt/rstudio-tools/amd64/crashpad -isystem /opt/rstudio-tools/amd64/crashpad/crashpad -isystem /opt/rstudio-tools/amd64/crashpad/crashpad/third_party/mini_chromium/mini_chromium -isystem /usr/include/postgresql -isystem /usr/include/pgsql -O2 -pipe -fstack-protector-strong -isystem /usr/local/include -fno-strict-aliasing  -isystem /usr/local/include -std=c++0x -std=c++11 -O2 -pipe -fstack-protector-strong -isystem /usr/local/include -fno-strict-aliasing  -isystem /usr/local/include -fPIE   -Wall -pthread -Werror=return-type -Wformat -Wformat-security -fstack-protector --param ssp-buffer-size=4 -fPIC -MD -MT src/cpp/session/CMakeFiles/rsession.dir/prefs/Preferences.cpp.o -MF CMakeFiles/rsession.dir/prefs/Preferences.cpp.o.d -o CMakeFiles/rsession.dir/prefs/Preferences.cpp.o -c /wrkdirs/usr/ports/devel/RStudio/work-desktop/rstudio-1.4.1717/sr
 c/cpp/session/prefs/Preferences.cpp
[ 95%] Building CXX object src/cpp/session/CMakeFiles/rsession.dir/prefs/UserPrefValues.cpp.o
cd /wrkdirs/usr/ports/devel/RStudio/work-desktop/.build/src/cpp/session && /usr/bin/c++ -DBOOST_ASIO_DISABLE_KQUEUE -DBOOST_ENABLE_ASSERT_HANDLER -DBOOST_SIGNALS_NO_DEPRECATION_WARNING -DRSTUDIO_BOOST_NAMESPACE=boost -DRSTUDIO_BOOST_SIGNALS_VERSION=2 -DRSTUDIO_UNIT_TESTS_ENABLED -DWEBSOCKETPP_STRICT_MASKING -D_FORTIFY_SOURCE=2 -D_WEBSOCKETPP_NO_CPP11_MEMORY_=1 -DSTRIPPED_FILENAME=\"src/cpp/session/prefs/UserPrefValues.cpp\" -I/wrkdirs/usr/ports/devel/RStudio/work-desktop/rstudio-1.4.1717/src/cpp/session/include -I/usr/local/lib/R/include -I/wrkdirs/usr/ports/devel/RStudio/work-desktop/rstudio-1.4.1717/src/cpp/core/include -I/include -I/wrkdirs/usr/ports/devel/RStudio/work-desktop/rstudio-1.4.1717/src/cpp/shared_core/include -I/wrkdirs/usr/ports/devel/RStudio/work-desktop/rstudio-1.4.1717/src/cpp/ext -I/wrkdirs/usr/ports/devel/RStudio/work-desktop/rstudio-1.4.1717/src/cpp/monitor/include -I/wrkdirs/usr/ports/devel/RStudio/work-desktop/rstudio-1.4.1717/src/cpp/r/include -I/wrkdirs/usr/
 ports/devel/RStudio/work-desktop/.build/src/cpp/session -I/wrkdirs/usr/ports/devel/RStudio/work-desktop/rstudio-1.4.1717/src/cpp/tests/cpp -isystem /opt/rstudio-tools/amd64/crashpad -isystem /opt/rstudio-tools/amd64/crashpad/crashpad -isystem /opt/rstudio-tools/amd64/crashpad/crashpad/third_party/mini_chromium/mini_chromium -isystem /usr/include/postgresql -isystem /usr/include/pgsql -O2 -pipe -fstack-protector-strong -isystem /usr/local/include -fno-strict-aliasing  -isystem /usr/local/include -std=c++0x -std=c++11 -O2 -pipe -fstack-protector-strong -isystem /usr/local/include -fno-strict-aliasing  -isystem /usr/local/include -fPIE   -Wall -pthread -Werror=return-type -Wformat -Wformat-security -fstack-protector --param ssp-buffer-size=4 -fPIC -MD -MT src/cpp/session/CMakeFiles/rsession.dir/prefs/UserPrefValues.cpp.o -MF CMakeFiles/rsession.dir/prefs/UserPrefValues.cpp.o.d -o CMakeFiles/rsession.dir/prefs/UserPrefValues.cpp.o -c /wrkdirs/usr/ports/devel/RStudio/work-desktop/rstudio
 -1.4.1717/src/cpp/session/prefs/UserPrefValu!
 es.cpp
[ 95%] Building CXX object src/cpp/session/CMakeFiles/rsession.dir/prefs/UserPrefValuesNative.cpp.o
cd /wrkdirs/usr/ports/devel/RStudio/work-desktop/.build/src/cpp/session && /usr/bin/c++ -DBOOST_ASIO_DISABLE_KQUEUE -DBOOST_ENABLE_ASSERT_HANDLER -DBOOST_SIGNALS_NO_DEPRECATION_WARNING -DRSTUDIO_BOOST_NAMESPACE=boost -DRSTUDIO_BOOST_SIGNALS_VERSION=2 -DRSTUDIO_UNIT_TESTS_ENABLED -DWEBSOCKETPP_STRICT_MASKING -D_FORTIFY_SOURCE=2 -D_WEBSOCKETPP_NO_CPP11_MEMORY_=1 -DSTRIPPED_FILENAME=\"src/cpp/session/prefs/UserPrefValuesNative.cpp\" -I/wrkdirs/usr/ports/devel/RStudio/work-desktop/rstudio-1.4.1717/src/cpp/session/include -I/usr/local/lib/R/include -I/wrkdirs/usr/ports/devel/RStudio/work-desktop/rstudio-1.4.1717/src/cpp/core/include -I/include -I/wrkdirs/usr/ports/devel/RStudio/work-desktop/rstudio-1.4.1717/src/cpp/shared_core/include -I/wrkdirs/usr/ports/devel/RStudio/work-desktop/rstudio-1.4.1717/src/cpp/ext -I/wrkdirs/usr/ports/devel/RStudio/work-desktop/rstudio-1.4.1717/src/cpp/monitor/include -I/wrkdirs/usr/ports/devel/RStudio/work-desktop/rstudio-1.4.1717/src/cpp/r/include -I/wrkdir
 s/usr/ports/devel/RStudio/work-desktop/.build/src/cpp/session -I/wrkdirs/usr/ports/devel/RStudio/work-desktop/rstudio-1.4.1717/src/cpp/tests/cpp -isystem /opt/rstudio-tools/amd64/crashpad -isystem /opt/rstudio-tools/amd64/crashpad/crashpad -isystem /opt/rstudio-tools/amd64/crashpad/crashpad/third_party/mini_chromium/mini_chromium -isystem /usr/include/postgresql -isystem /usr/include/pgsql -O2 -pipe -fstack-protector-strong -isystem /usr/local/include -fno-strict-aliasing  -isystem /usr/local/include -std=c++0x -std=c++11 -O2 -pipe -fstack-protector-strong -isystem /usr/local/include -fno-strict-aliasing  -isystem /usr/local/include -fPIE   -Wall -pthread -Werror=return-type -Wformat -Wformat-security -fstack-protector --param ssp-buffer-size=4 -fPIC -MD -MT src/cpp/session/CMakeFiles/rsession.dir/prefs/UserPrefValuesNative.cpp.o -MF CMakeFiles/rsession.dir/prefs/UserPrefValuesNative.cpp.o.d -o CMakeFiles/rsession.dir/prefs/UserPrefValuesNative.cpp.o -c /wrkdirs/usr/ports/devel/RStu
 dio/work-desktop/rstudio-1.4.1717/src/cpp/se!
 ssion/prefs/UserPrefValuesNative.cpp
[ 95%] Building CXX object src/cpp/session/CMakeFiles/rsession.dir/prefs/UserPrefs.cpp.o
cd /wrkdirs/usr/ports/devel/RStudio/work-desktop/.build/src/cpp/session && /usr/bin/c++ -DBOOST_ASIO_DISABLE_KQUEUE -DBOOST_ENABLE_ASSERT_HANDLER -DBOOST_SIGNALS_NO_DEPRECATION_WARNING -DRSTUDIO_BOOST_NAMESPACE=boost -DRSTUDIO_BOOST_SIGNALS_VERSION=2 -DRSTUDIO_UNIT_TESTS_ENABLED -DWEBSOCKETPP_STRICT_MASKING -D_FORTIFY_SOURCE=2 -D_WEBSOCKETPP_NO_CPP11_MEMORY_=1 -DSTRIPPED_FILENAME=\"src/cpp/session/prefs/UserPrefs.cpp\" -I/wrkdirs/usr/ports/devel/RStudio/work-desktop/rstudio-1.4.1717/src/cpp/session/include -I/usr/local/lib/R/include -I/wrkdirs/usr/ports/devel/RStudio/work-desktop/rstudio-1.4.1717/src/cpp/core/include -I/include -I/wrkdirs/usr/ports/devel/RStudio/work-desktop/rstudio-1.4.1717/src/cpp/shared_core/include -I/wrkdirs/usr/ports/devel/RStudio/work-desktop/rstudio-1.4.1717/src/cpp/ext -I/wrkdirs/usr/ports/devel/RStudio/work-desktop/rstudio-1.4.1717/src/cpp/monitor/include -I/wrkdirs/usr/ports/devel/RStudio/work-desktop/rstudio-1.4.1717/src/cpp/r/include -I/wrkdirs/usr/ports
 /devel/RStudio/work-desktop/.build/src/cpp/session -I/wrkdirs/usr/ports/devel/RStudio/work-desktop/rstudio-1.4.1717/src/cpp/tests/cpp -isystem /opt/rstudio-tools/amd64/crashpad -isystem /opt/rstudio-tools/amd64/crashpad/crashpad -isystem /opt/rstudio-tools/amd64/crashpad/crashpad/third_party/mini_chromium/mini_chromium -isystem /usr/include/postgresql -isystem /usr/include/pgsql -O2 -pipe -fstack-protector-strong -isystem /usr/local/include -fno-strict-aliasing  -isystem /usr/local/include -std=c++0x -std=c++11 -O2 -pipe -fstack-protector-strong -isystem /usr/local/include -fno-strict-aliasing  -isystem /usr/local/include -fPIE   -Wall -pthread -Werror=return-type -Wformat -Wformat-security -fstack-protector --param ssp-buffer-size=4 -fPIC -MD -MT src/cpp/session/CMakeFiles/rsession.dir/prefs/UserPrefs.cpp.o -MF CMakeFiles/rsession.dir/prefs/UserPrefs.cpp.o.d -o CMakeFiles/rsession.dir/prefs/UserPrefs.cpp.o -c /wrkdirs/usr/ports/devel/RStudio/work-desktop/rstudio-1.4.1717/src/cpp/se
 ssion/prefs/UserPrefs.cpp
[ 95%] Building CXX object src/cpp/session/CMakeFiles/rsession.dir/prefs/UserPrefsComputedLayer.cpp.o
cd /wrkdirs/usr/ports/devel/RStudio/work-desktop/.build/src/cpp/session && /usr/bin/c++ -DBOOST_ASIO_DISABLE_KQUEUE -DBOOST_ENABLE_ASSERT_HANDLER -DBOOST_SIGNALS_NO_DEPRECATION_WARNING -DRSTUDIO_BOOST_NAMESPACE=boost -DRSTUDIO_BOOST_SIGNALS_VERSION=2 -DRSTUDIO_UNIT_TESTS_ENABLED -DWEBSOCKETPP_STRICT_MASKING -D_FORTIFY_SOURCE=2 -D_WEBSOCKETPP_NO_CPP11_MEMORY_=1 -DSTRIPPED_FILENAME=\"src/cpp/session/prefs/UserPrefsComputedLayer.cpp\" -I/wrkdirs/usr/ports/devel/RStudio/work-desktop/rstudio-1.4.1717/src/cpp/session/include -I/usr/local/lib/R/include -I/wrkdirs/usr/ports/devel/RStudio/work-desktop/rstudio-1.4.1717/src/cpp/core/include -I/include -I/wrkdirs/usr/ports/devel/RStudio/work-desktop/rstudio-1.4.1717/src/cpp/shared_core/include -I/wrkdirs/usr/ports/devel/RStudio/work-desktop/rstudio-1.4.1717/src/cpp/ext -I/wrkdirs/usr/ports/devel/RStudio/work-desktop/rstudio-1.4.1717/src/cpp/monitor/include -I/wrkdirs/usr/ports/devel/RStudio/work-desktop/rstudio-1.4.1717/src/cpp/r/include -I/wrkd
 irs/usr/ports/devel/RStudio/work-desktop/.build/src/cpp/session -I/wrkdirs/usr/ports/devel/RStudio/work-desktop/rstudio-1.4.1717/src/cpp/tests/cpp -isystem /opt/rstudio-tools/amd64/crashpad -isystem /opt/rstudio-tools/amd64/crashpad/crashpad -isystem /opt/rstudio-tools/amd64/crashpad/crashpad/third_party/mini_chromium/mini_chromium -isystem /usr/include/postgresql -isystem /usr/include/pgsql -O2 -pipe -fstack-protector-strong -isystem /usr/local/include -fno-strict-aliasing  -isystem /usr/local/include -std=c++0x -std=c++11 -O2 -pipe -fstack-protector-strong -isystem /usr/local/include -fno-strict-aliasing  -isystem /usr/local/include -fPIE   -Wall -pthread -Werror=return-type -Wformat -Wformat-security -fstack-protector --param ssp-buffer-size=4 -fPIC -MD -MT src/cpp/session/CMakeFiles/rsession.dir/prefs/UserPrefsComputedLayer.cpp.o -MF CMakeFiles/rsession.dir/prefs/UserPrefsComputedLayer.cpp.o.d -o CMakeFiles/rsession.dir/prefs/UserPrefsComputedLayer.cpp.o -c /wrkdirs/usr/ports/de
 vel/RStudio/work-desktop/rstudio-1.4.1717/sr!
 c/cpp/session/prefs/UserPrefsComputedLayer.cpp
[ 96%] Building CXX object src/cpp/session/CMakeFiles/rsession.dir/prefs/UserPrefsDefaultLayer.cpp.o
cd /wrkdirs/usr/ports/devel/RStudio/work-desktop/.build/src/cpp/session && /usr/bin/c++ -DBOOST_ASIO_DISABLE_KQUEUE -DBOOST_ENABLE_ASSERT_HANDLER -DBOOST_SIGNALS_NO_DEPRECATION_WARNING -DRSTUDIO_BOOST_NAMESPACE=boost -DRSTUDIO_BOOST_SIGNALS_VERSION=2 -DRSTUDIO_UNIT_TESTS_ENABLED -DWEBSOCKETPP_STRICT_MASKING -D_FORTIFY_SOURCE=2 -D_WEBSOCKETPP_NO_CPP11_MEMORY_=1 -DSTRIPPED_FILENAME=\"src/cpp/session/prefs/UserPrefsDefaultLayer.cpp\" -I/wrkdirs/usr/ports/devel/RStudio/work-desktop/rstudio-1.4.1717/src/cpp/session/include -I/usr/local/lib/R/include -I/wrkdirs/usr/ports/devel/RStudio/work-desktop/rstudio-1.4.1717/src/cpp/core/include -I/include -I/wrkdirs/usr/ports/devel/RStudio/work-desktop/rstudio-1.4.1717/src/cpp/shared_core/include -I/wrkdirs/usr/ports/devel/RStudio/work-desktop/rstudio-1.4.1717/src/cpp/ext -I/wrkdirs/usr/ports/devel/RStudio/work-desktop/rstudio-1.4.1717/src/cpp/monitor/include -I/wrkdirs/usr/ports/devel/RStudio/work-desktop/rstudio-1.4.1717/src/cpp/r/include -I/wrkdi
 rs/usr/ports/devel/RStudio/work-desktop/.build/src/cpp/session -I/wrkdirs/usr/ports/devel/RStudio/work-desktop/rstudio-1.4.1717/src/cpp/tests/cpp -isystem /opt/rstudio-tools/amd64/crashpad -isystem /opt/rstudio-tools/amd64/crashpad/crashpad -isystem /opt/rstudio-tools/amd64/crashpad/crashpad/third_party/mini_chromium/mini_chromium -isystem /usr/include/postgresql -isystem /usr/include/pgsql -O2 -pipe -fstack-protector-strong -isystem /usr/local/include -fno-strict-aliasing  -isystem /usr/local/include -std=c++0x -std=c++11 -O2 -pipe -fstack-protector-strong -isystem /usr/local/include -fno-strict-aliasing  -isystem /usr/local/include -fPIE   -Wall -pthread -Werror=return-type -Wformat -Wformat-security -fstack-protector --param ssp-buffer-size=4 -fPIC -MD -MT src/cpp/session/CMakeFiles/rsession.dir/prefs/UserPrefsDefaultLayer.cpp.o -MF CMakeFiles/rsession.dir/prefs/UserPrefsDefaultLayer.cpp.o.d -o CMakeFiles/rsession.dir/prefs/UserPrefsDefaultLayer.cpp.o -c /wrkdirs/usr/ports/devel/
 RStudio/work-desktop/rstudio-1.4.1717/src/cp!
 p/session/prefs/UserPrefsDefaultLayer.cpp
[ 96%] Building CXX object src/cpp/session/CMakeFiles/rsession.dir/prefs/UserPrefsLayer.cpp.o
cd /wrkdirs/usr/ports/devel/RStudio/work-desktop/.build/src/cpp/session && /usr/bin/c++ -DBOOST_ASIO_DISABLE_KQUEUE -DBOOST_ENABLE_ASSERT_HANDLER -DBOOST_SIGNALS_NO_DEPRECATION_WARNING -DRSTUDIO_BOOST_NAMESPACE=boost -DRSTUDIO_BOOST_SIGNALS_VERSION=2 -DRSTUDIO_UNIT_TESTS_ENABLED -DWEBSOCKETPP_STRICT_MASKING -D_FORTIFY_SOURCE=2 -D_WEBSOCKETPP_NO_CPP11_MEMORY_=1 -DSTRIPPED_FILENAME=\"src/cpp/session/prefs/UserPrefsLayer.cpp\" -I/wrkdirs/usr/ports/devel/RStudio/work-desktop/rstudio-1.4.1717/src/cpp/session/include -I/usr/local/lib/R/include -I/wrkdirs/usr/ports/devel/RStudio/work-desktop/rstudio-1.4.1717/src/cpp/core/include -I/include -I/wrkdirs/usr/ports/devel/RStudio/work-desktop/rstudio-1.4.1717/src/cpp/shared_core/include -I/wrkdirs/usr/ports/devel/RStudio/work-desktop/rstudio-1.4.1717/src/cpp/ext -I/wrkdirs/usr/ports/devel/RStudio/work-desktop/rstudio-1.4.1717/src/cpp/monitor/include -I/wrkdirs/usr/ports/devel/RStudio/work-desktop/rstudio-1.4.1717/src/cpp/r/include -I/wrkdirs/usr/
 ports/devel/RStudio/work-desktop/.build/src/cpp/session -I/wrkdirs/usr/ports/devel/RStudio/work-desktop/rstudio-1.4.1717/src/cpp/tests/cpp -isystem /opt/rstudio-tools/amd64/crashpad -isystem /opt/rstudio-tools/amd64/crashpad/crashpad -isystem /opt/rstudio-tools/amd64/crashpad/crashpad/third_party/mini_chromium/mini_chromium -isystem /usr/include/postgresql -isystem /usr/include/pgsql -O2 -pipe -fstack-protector-strong -isystem /usr/local/include -fno-strict-aliasing  -isystem /usr/local/include -std=c++0x -std=c++11 -O2 -pipe -fstack-protector-strong -isystem /usr/local/include -fno-strict-aliasing  -isystem /usr/local/include -fPIE   -Wall -pthread -Werror=return-type -Wformat -Wformat-security -fstack-protector --param ssp-buffer-size=4 -fPIC -MD -MT src/cpp/session/CMakeFiles/rsession.dir/prefs/UserPrefsLayer.cpp.o -MF CMakeFiles/rsession.dir/prefs/UserPrefsLayer.cpp.o.d -o CMakeFiles/rsession.dir/prefs/UserPrefsLayer.cpp.o -c /wrkdirs/usr/ports/devel/RStudio/work-desktop/rstudio
 -1.4.1717/src/cpp/session/prefs/UserPrefsLay!
 er.cpp
[ 96%] Building CXX object src/cpp/session/CMakeFiles/rsession.dir/prefs/UserPrefsProjectLayer.cpp.o
cd /wrkdirs/usr/ports/devel/RStudio/work-desktop/.build/src/cpp/session && /usr/bin/c++ -DBOOST_ASIO_DISABLE_KQUEUE -DBOOST_ENABLE_ASSERT_HANDLER -DBOOST_SIGNALS_NO_DEPRECATION_WARNING -DRSTUDIO_BOOST_NAMESPACE=boost -DRSTUDIO_BOOST_SIGNALS_VERSION=2 -DRSTUDIO_UNIT_TESTS_ENABLED -DWEBSOCKETPP_STRICT_MASKING -D_FORTIFY_SOURCE=2 -D_WEBSOCKETPP_NO_CPP11_MEMORY_=1 -DSTRIPPED_FILENAME=\"src/cpp/session/prefs/UserPrefsProjectLayer.cpp\" -I/wrkdirs/usr/ports/devel/RStudio/work-desktop/rstudio-1.4.1717/src/cpp/session/include -I/usr/local/lib/R/include -I/wrkdirs/usr/ports/devel/RStudio/work-desktop/rstudio-1.4.1717/src/cpp/core/include -I/include -I/wrkdirs/usr/ports/devel/RStudio/work-desktop/rstudio-1.4.1717/src/cpp/shared_core/include -I/wrkdirs/usr/ports/devel/RStudio/work-desktop/rstudio-1.4.1717/src/cpp/ext -I/wrkdirs/usr/ports/devel/RStudio/work-desktop/rstudio-1.4.1717/src/cpp/monitor/include -I/wrkdirs/usr/ports/devel/RStudio/work-desktop/rstudio-1.4.1717/src/cpp/r/include -I/wrkdi
 rs/usr/ports/devel/RStudio/work-desktop/.build/src/cpp/session -I/wrkdirs/usr/ports/devel/RStudio/work-desktop/rstudio-1.4.1717/src/cpp/tests/cpp -isystem /opt/rstudio-tools/amd64/crashpad -isystem /opt/rstudio-tools/amd64/crashpad/crashpad -isystem /opt/rstudio-tools/amd64/crashpad/crashpad/third_party/mini_chromium/mini_chromium -isystem /usr/include/postgresql -isystem /usr/include/pgsql -O2 -pipe -fstack-protector-strong -isystem /usr/local/include -fno-strict-aliasing  -isystem /usr/local/include -std=c++0x -std=c++11 -O2 -pipe -fstack-protector-strong -isystem /usr/local/include -fno-strict-aliasing  -isystem /usr/local/include -fPIE   -Wall -pthread -Werror=return-type -Wformat -Wformat-security -fstack-protector --param ssp-buffer-size=4 -fPIC -MD -MT src/cpp/session/CMakeFiles/rsession.dir/prefs/UserPrefsProjectLayer.cpp.o -MF CMakeFiles/rsession.dir/prefs/UserPrefsProjectLayer.cpp.o.d -o CMakeFiles/rsession.dir/prefs/UserPrefsProjectLayer.cpp.o -c /wrkdirs/usr/ports/devel/
 RStudio/work-desktop/rstudio-1.4.1717/src/cp!
 p/session/prefs/UserPrefsProjectLayer.cpp
[ 96%] Building CXX object src/cpp/session/CMakeFiles/rsession.dir/prefs/UserPrefsSystemLayer.cpp.o
cd /wrkdirs/usr/ports/devel/RStudio/work-desktop/.build/src/cpp/session && /usr/bin/c++ -DBOOST_ASIO_DISABLE_KQUEUE -DBOOST_ENABLE_ASSERT_HANDLER -DBOOST_SIGNALS_NO_DEPRECATION_WARNING -DRSTUDIO_BOOST_NAMESPACE=boost -DRSTUDIO_BOOST_SIGNALS_VERSION=2 -DRSTUDIO_UNIT_TESTS_ENABLED -DWEBSOCKETPP_STRICT_MASKING -D_FORTIFY_SOURCE=2 -D_WEBSOCKETPP_NO_CPP11_MEMORY_=1 -DSTRIPPED_FILENAME=\"src/cpp/session/prefs/UserPrefsSystemLayer.cpp\" -I/wrkdirs/usr/ports/devel/RStudio/work-desktop/rstudio-1.4.1717/src/cpp/session/include -I/usr/local/lib/R/include -I/wrkdirs/usr/ports/devel/RStudio/work-desktop/rstudio-1.4.1717/src/cpp/core/include -I/include -I/wrkdirs/usr/ports/devel/RStudio/work-desktop/rstudio-1.4.1717/src/cpp/shared_core/include -I/wrkdirs/usr/ports/devel/RStudio/work-desktop/rstudio-1.4.1717/src/cpp/ext -I/wrkdirs/usr/ports/devel/RStudio/work-desktop/rstudio-1.4.1717/src/cpp/monitor/include -I/wrkdirs/usr/ports/devel/RStudio/work-desktop/rstudio-1.4.1717/src/cpp/r/include -I/wrkdir
 s/usr/ports/devel/RStudio/work-desktop/.build/src/cpp/session -I/wrkdirs/usr/ports/devel/RStudio/work-desktop/rstudio-1.4.1717/src/cpp/tests/cpp -isystem /opt/rstudio-tools/amd64/crashpad -isystem /opt/rstudio-tools/amd64/crashpad/crashpad -isystem /opt/rstudio-tools/amd64/crashpad/crashpad/third_party/mini_chromium/mini_chromium -isystem /usr/include/postgresql -isystem /usr/include/pgsql -O2 -pipe -fstack-protector-strong -isystem /usr/local/include -fno-strict-aliasing  -isystem /usr/local/include -std=c++0x -std=c++11 -O2 -pipe -fstack-protector-strong -isystem /usr/local/include -fno-strict-aliasing  -isystem /usr/local/include -fPIE   -Wall -pthread -Werror=return-type -Wformat -Wformat-security -fstack-protector --param ssp-buffer-size=4 -fPIC -MD -MT src/cpp/session/CMakeFiles/rsession.dir/prefs/UserPrefsSystemLayer.cpp.o -MF CMakeFiles/rsession.dir/prefs/UserPrefsSystemLayer.cpp.o.d -o CMakeFiles/rsession.dir/prefs/UserPrefsSystemLayer.cpp.o -c /wrkdirs/usr/ports/devel/RStu
 dio/work-desktop/rstudio-1.4.1717/src/cpp/se!
 ssion/prefs/UserPrefsSystemLayer.cpp
[ 96%] Building CXX object src/cpp/session/CMakeFiles/rsession.dir/prefs/UserState.cpp.o
cd /wrkdirs/usr/ports/devel/RStudio/work-desktop/.build/src/cpp/session && /usr/bin/c++ -DBOOST_ASIO_DISABLE_KQUEUE -DBOOST_ENABLE_ASSERT_HANDLER -DBOOST_SIGNALS_NO_DEPRECATION_WARNING -DRSTUDIO_BOOST_NAMESPACE=boost -DRSTUDIO_BOOST_SIGNALS_VERSION=2 -DRSTUDIO_UNIT_TESTS_ENABLED -DWEBSOCKETPP_STRICT_MASKING -D_FORTIFY_SOURCE=2 -D_WEBSOCKETPP_NO_CPP11_MEMORY_=1 -DSTRIPPED_FILENAME=\"src/cpp/session/prefs/UserState.cpp\" -I/wrkdirs/usr/ports/devel/RStudio/work-desktop/rstudio-1.4.1717/src/cpp/session/include -I/usr/local/lib/R/include -I/wrkdirs/usr/ports/devel/RStudio/work-desktop/rstudio-1.4.1717/src/cpp/core/include -I/include -I/wrkdirs/usr/ports/devel/RStudio/work-desktop/rstudio-1.4.1717/src/cpp/shared_core/include -I/wrkdirs/usr/ports/devel/RStudio/work-desktop/rstudio-1.4.1717/src/cpp/ext -I/wrkdirs/usr/ports/devel/RStudio/work-desktop/rstudio-1.4.1717/src/cpp/monitor/include -I/wrkdirs/usr/ports/devel/RStudio/work-desktop/rstudio-1.4.1717/src/cpp/r/include -I/wrkdirs/usr/ports
 /devel/RStudio/work-desktop/.build/src/cpp/session -I/wrkdirs/usr/ports/devel/RStudio/work-desktop/rstudio-1.4.1717/src/cpp/tests/cpp -isystem /opt/rstudio-tools/amd64/crashpad -isystem /opt/rstudio-tools/amd64/crashpad/crashpad -isystem /opt/rstudio-tools/amd64/crashpad/crashpad/third_party/mini_chromium/mini_chromium -isystem /usr/include/postgresql -isystem /usr/include/pgsql -O2 -pipe -fstack-protector-strong -isystem /usr/local/include -fno-strict-aliasing  -isystem /usr/local/include -std=c++0x -std=c++11 -O2 -pipe -fstack-protector-strong -isystem /usr/local/include -fno-strict-aliasing  -isystem /usr/local/include -fPIE   -Wall -pthread -Werror=return-type -Wformat -Wformat-security -fstack-protector --param ssp-buffer-size=4 -fPIC -MD -MT src/cpp/session/CMakeFiles/rsession.dir/prefs/UserState.cpp.o -MF CMakeFiles/rsession.dir/prefs/UserState.cpp.o.d -o CMakeFiles/rsession.dir/prefs/UserState.cpp.o -c /wrkdirs/usr/ports/devel/RStudio/work-desktop/rstudio-1.4.1717/src/cpp/se
 ssion/prefs/UserState.cpp
[ 96%] Building CXX object src/cpp/session/CMakeFiles/rsession.dir/prefs/UserStateComputedLayer.cpp.o
cd /wrkdirs/usr/ports/devel/RStudio/work-desktop/.build/src/cpp/session && /usr/bin/c++ -DBOOST_ASIO_DISABLE_KQUEUE -DBOOST_ENABLE_ASSERT_HANDLER -DBOOST_SIGNALS_NO_DEPRECATION_WARNING -DRSTUDIO_BOOST_NAMESPACE=boost -DRSTUDIO_BOOST_SIGNALS_VERSION=2 -DRSTUDIO_UNIT_TESTS_ENABLED -DWEBSOCKETPP_STRICT_MASKING -D_FORTIFY_SOURCE=2 -D_WEBSOCKETPP_NO_CPP11_MEMORY_=1 -DSTRIPPED_FILENAME=\"src/cpp/session/prefs/UserStateComputedLayer.cpp\" -I/wrkdirs/usr/ports/devel/RStudio/work-desktop/rstudio-1.4.1717/src/cpp/session/include -I/usr/local/lib/R/include -I/wrkdirs/usr/ports/devel/RStudio/work-desktop/rstudio-1.4.1717/src/cpp/core/include -I/include -I/wrkdirs/usr/ports/devel/RStudio/work-desktop/rstudio-1.4.1717/src/cpp/shared_core/include -I/wrkdirs/usr/ports/devel/RStudio/work-desktop/rstudio-1.4.1717/src/cpp/ext -I/wrkdirs/usr/ports/devel/RStudio/work-desktop/rstudio-1.4.1717/src/cpp/monitor/include -I/wrkdirs/usr/ports/devel/RStudio/work-desktop/rstudio-1.4.1717/src/cpp/r/include -I/wrkd
 irs/usr/ports/devel/RStudio/work-desktop/.build/src/cpp/session -I/wrkdirs/usr/ports/devel/RStudio/work-desktop/rstudio-1.4.1717/src/cpp/tests/cpp -isystem /opt/rstudio-tools/amd64/crashpad -isystem /opt/rstudio-tools/amd64/crashpad/crashpad -isystem /opt/rstudio-tools/amd64/crashpad/crashpad/third_party/mini_chromium/mini_chromium -isystem /usr/include/postgresql -isystem /usr/include/pgsql -O2 -pipe -fstack-protector-strong -isystem /usr/local/include -fno-strict-aliasing  -isystem /usr/local/include -std=c++0x -std=c++11 -O2 -pipe -fstack-protector-strong -isystem /usr/local/include -fno-strict-aliasing  -isystem /usr/local/include -fPIE   -Wall -pthread -Werror=return-type -Wformat -Wformat-security -fstack-protector --param ssp-buffer-size=4 -fPIC -MD -MT src/cpp/session/CMakeFiles/rsession.dir/prefs/UserStateComputedLayer.cpp.o -MF CMakeFiles/rsession.dir/prefs/UserStateComputedLayer.cpp.o.d -o CMakeFiles/rsession.dir/prefs/UserStateComputedLayer.cpp.o -c /wrkdirs/usr/ports/de
 vel/RStudio/work-desktop/rstudio-1.4.1717/sr!
 c/cpp/session/prefs/UserStateComputedLayer.cpp
[ 97%] Building CXX object src/cpp/session/CMakeFiles/rsession.dir/prefs/UserStateDefaultLayer.cpp.o
cd /wrkdirs/usr/ports/devel/RStudio/work-desktop/.build/src/cpp/session && /usr/bin/c++ -DBOOST_ASIO_DISABLE_KQUEUE -DBOOST_ENABLE_ASSERT_HANDLER -DBOOST_SIGNALS_NO_DEPRECATION_WARNING -DRSTUDIO_BOOST_NAMESPACE=boost -DRSTUDIO_BOOST_SIGNALS_VERSION=2 -DRSTUDIO_UNIT_TESTS_ENABLED -DWEBSOCKETPP_STRICT_MASKING -D_FORTIFY_SOURCE=2 -D_WEBSOCKETPP_NO_CPP11_MEMORY_=1 -DSTRIPPED_FILENAME=\"src/cpp/session/prefs/UserStateDefaultLayer.cpp\" -I/wrkdirs/usr/ports/devel/RStudio/work-desktop/rstudio-1.4.1717/src/cpp/session/include -I/usr/local/lib/R/include -I/wrkdirs/usr/ports/devel/RStudio/work-desktop/rstudio-1.4.1717/src/cpp/core/include -I/include -I/wrkdirs/usr/ports/devel/RStudio/work-desktop/rstudio-1.4.1717/src/cpp/shared_core/include -I/wrkdirs/usr/ports/devel/RStudio/work-desktop/rstudio-1.4.1717/src/cpp/ext -I/wrkdirs/usr/ports/devel/RStudio/work-desktop/rstudio-1.4.1717/src/cpp/monitor/include -I/wrkdirs/usr/ports/devel/RStudio/work-desktop/rstudio-1.4.1717/src/cpp/r/include -I/wrkdi
 rs/usr/ports/devel/RStudio/work-desktop/.build/src/cpp/session -I/wrkdirs/usr/ports/devel/RStudio/work-desktop/rstudio-1.4.1717/src/cpp/tests/cpp -isystem /opt/rstudio-tools/amd64/crashpad -isystem /opt/rstudio-tools/amd64/crashpad/crashpad -isystem /opt/rstudio-tools/amd64/crashpad/crashpad/third_party/mini_chromium/mini_chromium -isystem /usr/include/postgresql -isystem /usr/include/pgsql -O2 -pipe -fstack-protector-strong -isystem /usr/local/include -fno-strict-aliasing  -isystem /usr/local/include -std=c++0x -std=c++11 -O2 -pipe -fstack-protector-strong -isystem /usr/local/include -fno-strict-aliasing  -isystem /usr/local/include -fPIE   -Wall -pthread -Werror=return-type -Wformat -Wformat-security -fstack-protector --param ssp-buffer-size=4 -fPIC -MD -MT src/cpp/session/CMakeFiles/rsession.dir/prefs/UserStateDefaultLayer.cpp.o -MF CMakeFiles/rsession.dir/prefs/UserStateDefaultLayer.cpp.o.d -o CMakeFiles/rsession.dir/prefs/UserStateDefaultLayer.cpp.o -c /wrkdirs/usr/ports/devel/
 RStudio/work-desktop/rstudio-1.4.1717/src/cp!
 p/session/prefs/UserStateDefaultLayer.cpp
[ 97%] Building CXX object src/cpp/session/CMakeFiles/rsession.dir/prefs/UserStateLayer.cpp.o
cd /wrkdirs/usr/ports/devel/RStudio/work-desktop/.build/src/cpp/session && /usr/bin/c++ -DBOOST_ASIO_DISABLE_KQUEUE -DBOOST_ENABLE_ASSERT_HANDLER -DBOOST_SIGNALS_NO_DEPRECATION_WARNING -DRSTUDIO_BOOST_NAMESPACE=boost -DRSTUDIO_BOOST_SIGNALS_VERSION=2 -DRSTUDIO_UNIT_TESTS_ENABLED -DWEBSOCKETPP_STRICT_MASKING -D_FORTIFY_SOURCE=2 -D_WEBSOCKETPP_NO_CPP11_MEMORY_=1 -DSTRIPPED_FILENAME=\"src/cpp/session/prefs/UserStateLayer.cpp\" -I/wrkdirs/usr/ports/devel/RStudio/work-desktop/rstudio-1.4.1717/src/cpp/session/include -I/usr/local/lib/R/include -I/wrkdirs/usr/ports/devel/RStudio/work-desktop/rstudio-1.4.1717/src/cpp/core/include -I/include -I/wrkdirs/usr/ports/devel/RStudio/work-desktop/rstudio-1.4.1717/src/cpp/shared_core/include -I/wrkdirs/usr/ports/devel/RStudio/work-desktop/rstudio-1.4.1717/src/cpp/ext -I/wrkdirs/usr/ports/devel/RStudio/work-desktop/rstudio-1.4.1717/src/cpp/monitor/include -I/wrkdirs/usr/ports/devel/RStudio/work-desktop/rstudio-1.4.1717/src/cpp/r/include -I/wrkdirs/usr/
 ports/devel/RStudio/work-desktop/.build/src/cpp/session -I/wrkdirs/usr/ports/devel/RStudio/work-desktop/rstudio-1.4.1717/src/cpp/tests/cpp -isystem /opt/rstudio-tools/amd64/crashpad -isystem /opt/rstudio-tools/amd64/crashpad/crashpad -isystem /opt/rstudio-tools/amd64/crashpad/crashpad/third_party/mini_chromium/mini_chromium -isystem /usr/include/postgresql -isystem /usr/include/pgsql -O2 -pipe -fstack-protector-strong -isystem /usr/local/include -fno-strict-aliasing  -isystem /usr/local/include -std=c++0x -std=c++11 -O2 -pipe -fstack-protector-strong -isystem /usr/local/include -fno-strict-aliasing  -isystem /usr/local/include -fPIE   -Wall -pthread -Werror=return-type -Wformat -Wformat-security -fstack-protector --param ssp-buffer-size=4 -fPIC -MD -MT src/cpp/session/CMakeFiles/rsession.dir/prefs/UserStateLayer.cpp.o -MF CMakeFiles/rsession.dir/prefs/UserStateLayer.cpp.o.d -o CMakeFiles/rsession.dir/prefs/UserStateLayer.cpp.o -c /wrkdirs/usr/ports/devel/RStudio/work-desktop/rstudio
 -1.4.1717/src/cpp/session/prefs/UserStateLay!
 er.cpp
[ 97%] Building CXX object src/cpp/session/CMakeFiles/rsession.dir/prefs/UserStateValues.cpp.o
cd /wrkdirs/usr/ports/devel/RStudio/work-desktop/.build/src/cpp/session && /usr/bin/c++ -DBOOST_ASIO_DISABLE_KQUEUE -DBOOST_ENABLE_ASSERT_HANDLER -DBOOST_SIGNALS_NO_DEPRECATION_WARNING -DRSTUDIO_BOOST_NAMESPACE=boost -DRSTUDIO_BOOST_SIGNALS_VERSION=2 -DRSTUDIO_UNIT_TESTS_ENABLED -DWEBSOCKETPP_STRICT_MASKING -D_FORTIFY_SOURCE=2 -D_WEBSOCKETPP_NO_CPP11_MEMORY_=1 -DSTRIPPED_FILENAME=\"src/cpp/session/prefs/UserStateValues.cpp\" -I/wrkdirs/usr/ports/devel/RStudio/work-desktop/rstudio-1.4.1717/src/cpp/session/include -I/usr/local/lib/R/include -I/wrkdirs/usr/ports/devel/RStudio/work-desktop/rstudio-1.4.1717/src/cpp/core/include -I/include -I/wrkdirs/usr/ports/devel/RStudio/work-desktop/rstudio-1.4.1717/src/cpp/shared_core/include -I/wrkdirs/usr/ports/devel/RStudio/work-desktop/rstudio-1.4.1717/src/cpp/ext -I/wrkdirs/usr/ports/devel/RStudio/work-desktop/rstudio-1.4.1717/src/cpp/monitor/include -I/wrkdirs/usr/ports/devel/RStudio/work-desktop/rstudio-1.4.1717/src/cpp/r/include -I/wrkdirs/usr
 /ports/devel/RStudio/work-desktop/.build/src/cpp/session -I/wrkdirs/usr/ports/devel/RStudio/work-desktop/rstudio-1.4.1717/src/cpp/tests/cpp -isystem /opt/rstudio-tools/amd64/crashpad -isystem /opt/rstudio-tools/amd64/crashpad/crashpad -isystem /opt/rstudio-tools/amd64/crashpad/crashpad/third_party/mini_chromium/mini_chromium -isystem /usr/include/postgresql -isystem /usr/include/pgsql -O2 -pipe -fstack-protector-strong -isystem /usr/local/include -fno-strict-aliasing  -isystem /usr/local/include -std=c++0x -std=c++11 -O2 -pipe -fstack-protector-strong -isystem /usr/local/include -fno-strict-aliasing  -isystem /usr/local/include -fPIE   -Wall -pthread -Werror=return-type -Wformat -Wformat-security -fstack-protector --param ssp-buffer-size=4 -fPIC -MD -MT src/cpp/session/CMakeFiles/rsession.dir/prefs/UserStateValues.cpp.o -MF CMakeFiles/rsession.dir/prefs/UserStateValues.cpp.o.d -o CMakeFiles/rsession.dir/prefs/UserStateValues.cpp.o -c /wrkdirs/usr/ports/devel/RStudio/work-desktop/rst
 udio-1.4.1717/src/cpp/session/prefs/UserStat!
 eValues.cpp
[ 97%] Building CXX object src/cpp/session/CMakeFiles/rsession.dir/projects/SessionProjects.cpp.o
cd /wrkdirs/usr/ports/devel/RStudio/work-desktop/.build/src/cpp/session && /usr/bin/c++ -DBOOST_ASIO_DISABLE_KQUEUE -DBOOST_ENABLE_ASSERT_HANDLER -DBOOST_SIGNALS_NO_DEPRECATION_WARNING -DRSTUDIO_BOOST_NAMESPACE=boost -DRSTUDIO_BOOST_SIGNALS_VERSION=2 -DRSTUDIO_UNIT_TESTS_ENABLED -DWEBSOCKETPP_STRICT_MASKING -D_FORTIFY_SOURCE=2 -D_WEBSOCKETPP_NO_CPP11_MEMORY_=1 -DSTRIPPED_FILENAME=\"src/cpp/session/projects/SessionProjects.cpp\" -I/wrkdirs/usr/ports/devel/RStudio/work-desktop/rstudio-1.4.1717/src/cpp/session/include -I/usr/local/lib/R/include -I/wrkdirs/usr/ports/devel/RStudio/work-desktop/rstudio-1.4.1717/src/cpp/core/include -I/include -I/wrkdirs/usr/ports/devel/RStudio/work-desktop/rstudio-1.4.1717/src/cpp/shared_core/include -I/wrkdirs/usr/ports/devel/RStudio/work-desktop/rstudio-1.4.1717/src/cpp/ext -I/wrkdirs/usr/ports/devel/RStudio/work-desktop/rstudio-1.4.1717/src/cpp/monitor/include -I/wrkdirs/usr/ports/devel/RStudio/work-desktop/rstudio-1.4.1717/src/cpp/r/include -I/wrkdirs/
 usr/ports/devel/RStudio/work-desktop/.build/src/cpp/session -I/wrkdirs/usr/ports/devel/RStudio/work-desktop/rstudio-1.4.1717/src/cpp/tests/cpp -isystem /opt/rstudio-tools/amd64/crashpad -isystem /opt/rstudio-tools/amd64/crashpad/crashpad -isystem /opt/rstudio-tools/amd64/crashpad/crashpad/third_party/mini_chromium/mini_chromium -isystem /usr/include/postgresql -isystem /usr/include/pgsql -O2 -pipe -fstack-protector-strong -isystem /usr/local/include -fno-strict-aliasing  -isystem /usr/local/include -std=c++0x -std=c++11 -O2 -pipe -fstack-protector-strong -isystem /usr/local/include -fno-strict-aliasing  -isystem /usr/local/include -fPIE   -Wall -pthread -Werror=return-type -Wformat -Wformat-security -fstack-protector --param ssp-buffer-size=4 -fPIC -MD -MT src/cpp/session/CMakeFiles/rsession.dir/projects/SessionProjects.cpp.o -MF CMakeFiles/rsession.dir/projects/SessionProjects.cpp.o.d -o CMakeFiles/rsession.dir/projects/SessionProjects.cpp.o -c /wrkdirs/usr/ports/devel/RStudio/work
 -desktop/rstudio-1.4.1717/src/cpp/session/pr!
 ojects/SessionProjects.cpp
[ 97%] Building CXX object src/cpp/session/CMakeFiles/rsession.dir/projects/SessionProjectContext.cpp.o
cd /wrkdirs/usr/ports/devel/RStudio/work-desktop/.build/src/cpp/session && /usr/bin/c++ -DBOOST_ASIO_DISABLE_KQUEUE -DBOOST_ENABLE_ASSERT_HANDLER -DBOOST_SIGNALS_NO_DEPRECATION_WARNING -DRSTUDIO_BOOST_NAMESPACE=boost -DRSTUDIO_BOOST_SIGNALS_VERSION=2 -DRSTUDIO_UNIT_TESTS_ENABLED -DWEBSOCKETPP_STRICT_MASKING -D_FORTIFY_SOURCE=2 -D_WEBSOCKETPP_NO_CPP11_MEMORY_=1 -DSTRIPPED_FILENAME=\"src/cpp/session/projects/SessionProjectContext.cpp\" -I/wrkdirs/usr/ports/devel/RStudio/work-desktop/rstudio-1.4.1717/src/cpp/session/include -I/usr/local/lib/R/include -I/wrkdirs/usr/ports/devel/RStudio/work-desktop/rstudio-1.4.1717/src/cpp/core/include -I/include -I/wrkdirs/usr/ports/devel/RStudio/work-desktop/rstudio-1.4.1717/src/cpp/shared_core/include -I/wrkdirs/usr/ports/devel/RStudio/work-desktop/rstudio-1.4.1717/src/cpp/ext -I/wrkdirs/usr/ports/devel/RStudio/work-desktop/rstudio-1.4.1717/src/cpp/monitor/include -I/wrkdirs/usr/ports/devel/RStudio/work-desktop/rstudio-1.4.1717/src/cpp/r/include -I/wr
 kdirs/usr/ports/devel/RStudio/work-desktop/.build/src/cpp/session -I/wrkdirs/usr/ports/devel/RStudio/work-desktop/rstudio-1.4.1717/src/cpp/tests/cpp -isystem /opt/rstudio-tools/amd64/crashpad -isystem /opt/rstudio-tools/amd64/crashpad/crashpad -isystem /opt/rstudio-tools/amd64/crashpad/crashpad/third_party/mini_chromium/mini_chromium -isystem /usr/include/postgresql -isystem /usr/include/pgsql -O2 -pipe -fstack-protector-strong -isystem /usr/local/include -fno-strict-aliasing  -isystem /usr/local/include -std=c++0x -std=c++11 -O2 -pipe -fstack-protector-strong -isystem /usr/local/include -fno-strict-aliasing  -isystem /usr/local/include -fPIE   -Wall -pthread -Werror=return-type -Wformat -Wformat-security -fstack-protector --param ssp-buffer-size=4 -fPIC -MD -MT src/cpp/session/CMakeFiles/rsession.dir/projects/SessionProjectContext.cpp.o -MF CMakeFiles/rsession.dir/projects/SessionProjectContext.cpp.o.d -o CMakeFiles/rsession.dir/projects/SessionProjectContext.cpp.o -c /wrkdirs/usr/
 ports/devel/RStudio/work-desktop/rstudio-1.4!
 .1717/src/cpp/session/projects/SessionProjectContext.cpp
[ 97%] Building CXX object src/cpp/session/CMakeFiles/rsession.dir/projects/SessionProjectFirstRun.cpp.o
cd /wrkdirs/usr/ports/devel/RStudio/work-desktop/.build/src/cpp/session && /usr/bin/c++ -DBOOST_ASIO_DISABLE_KQUEUE -DBOOST_ENABLE_ASSERT_HANDLER -DBOOST_SIGNALS_NO_DEPRECATION_WARNING -DRSTUDIO_BOOST_NAMESPACE=boost -DRSTUDIO_BOOST_SIGNALS_VERSION=2 -DRSTUDIO_UNIT_TESTS_ENABLED -DWEBSOCKETPP_STRICT_MASKING -D_FORTIFY_SOURCE=2 -D_WEBSOCKETPP_NO_CPP11_MEMORY_=1 -DSTRIPPED_FILENAME=\"src/cpp/session/projects/SessionProjectFirstRun.cpp\" -I/wrkdirs/usr/ports/devel/RStudio/work-desktop/rstudio-1.4.1717/src/cpp/session/include -I/usr/local/lib/R/include -I/wrkdirs/usr/ports/devel/RStudio/work-desktop/rstudio-1.4.1717/src/cpp/core/include -I/include -I/wrkdirs/usr/ports/devel/RStudio/work-desktop/rstudio-1.4.1717/src/cpp/shared_core/include -I/wrkdirs/usr/ports/devel/RStudio/work-desktop/rstudio-1.4.1717/src/cpp/ext -I/wrkdirs/usr/ports/devel/RStudio/work-desktop/rstudio-1.4.1717/src/cpp/monitor/include -I/wrkdirs/usr/ports/devel/RStudio/work-desktop/rstudio-1.4.1717/src/cpp/r/include -I/w
 rkdirs/usr/ports/devel/RStudio/work-desktop/.build/src/cpp/session -I/wrkdirs/usr/ports/devel/RStudio/work-desktop/rstudio-1.4.1717/src/cpp/tests/cpp -isystem /opt/rstudio-tools/amd64/crashpad -isystem /opt/rstudio-tools/amd64/crashpad/crashpad -isystem /opt/rstudio-tools/amd64/crashpad/crashpad/third_party/mini_chromium/mini_chromium -isystem /usr/include/postgresql -isystem /usr/include/pgsql -O2 -pipe -fstack-protector-strong -isystem /usr/local/include -fno-strict-aliasing  -isystem /usr/local/include -std=c++0x -std=c++11 -O2 -pipe -fstack-protector-strong -isystem /usr/local/include -fno-strict-aliasing  -isystem /usr/local/include -fPIE   -Wall -pthread -Werror=return-type -Wformat -Wformat-security -fstack-protector --param ssp-buffer-size=4 -fPIC -MD -MT src/cpp/session/CMakeFiles/rsession.dir/projects/SessionProjectFirstRun.cpp.o -MF CMakeFiles/rsession.dir/projects/SessionProjectFirstRun.cpp.o.d -o CMakeFiles/rsession.dir/projects/SessionProjectFirstRun.cpp.o -c /wrkdirs/
 usr/ports/devel/RStudio/work-desktop/rstudio!
 -1.4.1717/src/cpp/session/projects/SessionProjectFirstRun.cpp
[ 98%] Building CXX object src/cpp/session/CMakeFiles/rsession.dir/SessionAddins.cpp.o
cd /wrkdirs/usr/ports/devel/RStudio/work-desktop/.build/src/cpp/session && /usr/bin/c++ -DBOOST_ASIO_DISABLE_KQUEUE -DBOOST_ENABLE_ASSERT_HANDLER -DBOOST_SIGNALS_NO_DEPRECATION_WARNING -DRSTUDIO_BOOST_NAMESPACE=boost -DRSTUDIO_BOOST_SIGNALS_VERSION=2 -DRSTUDIO_UNIT_TESTS_ENABLED -DWEBSOCKETPP_STRICT_MASKING -D_FORTIFY_SOURCE=2 -D_WEBSOCKETPP_NO_CPP11_MEMORY_=1 -DSTRIPPED_FILENAME=\"src/cpp/session/SessionAddins.cpp\" -I/wrkdirs/usr/ports/devel/RStudio/work-desktop/rstudio-1.4.1717/src/cpp/session/include -I/usr/local/lib/R/include -I/wrkdirs/usr/ports/devel/RStudio/work-desktop/rstudio-1.4.1717/src/cpp/core/include -I/include -I/wrkdirs/usr/ports/devel/RStudio/work-desktop/rstudio-1.4.1717/src/cpp/shared_core/include -I/wrkdirs/usr/ports/devel/RStudio/work-desktop/rstudio-1.4.1717/src/cpp/ext -I/wrkdirs/usr/ports/devel/RStudio/work-desktop/rstudio-1.4.1717/src/cpp/monitor/include -I/wrkdirs/usr/ports/devel/RStudio/work-desktop/rstudio-1.4.1717/src/cpp/r/include -I/wrkdirs/usr/ports/d
 evel/RStudio/work-desktop/.build/src/cpp/session -I/wrkdirs/usr/ports/devel/RStudio/work-desktop/rstudio-1.4.1717/src/cpp/tests/cpp -isystem /opt/rstudio-tools/amd64/crashpad -isystem /opt/rstudio-tools/amd64/crashpad/crashpad -isystem /opt/rstudio-tools/amd64/crashpad/crashpad/third_party/mini_chromium/mini_chromium -isystem /usr/include/postgresql -isystem /usr/include/pgsql -O2 -pipe -fstack-protector-strong -isystem /usr/local/include -fno-strict-aliasing  -isystem /usr/local/include -std=c++0x -std=c++11 -O2 -pipe -fstack-protector-strong -isystem /usr/local/include -fno-strict-aliasing  -isystem /usr/local/include -fPIE   -Wall -pthread -Werror=return-type -Wformat -Wformat-security -fstack-protector --param ssp-buffer-size=4 -fPIC -MD -MT src/cpp/session/CMakeFiles/rsession.dir/SessionAddins.cpp.o -MF CMakeFiles/rsession.dir/SessionAddins.cpp.o.d -o CMakeFiles/rsession.dir/SessionAddins.cpp.o -c /wrkdirs/usr/ports/devel/RStudio/work-desktop/.build/src/cpp/session/SessionAddin
 s.cpp
[ 98%] Building CXX object src/cpp/session/CMakeFiles/rsession.dir/http/SessionPosixHttpConnectionListener.cpp.o
cd /wrkdirs/usr/ports/devel/RStudio/work-desktop/.build/src/cpp/session && /usr/bin/c++ -DBOOST_ASIO_DISABLE_KQUEUE -DBOOST_ENABLE_ASSERT_HANDLER -DBOOST_SIGNALS_NO_DEPRECATION_WARNING -DRSTUDIO_BOOST_NAMESPACE=boost -DRSTUDIO_BOOST_SIGNALS_VERSION=2 -DRSTUDIO_UNIT_TESTS_ENABLED -DWEBSOCKETPP_STRICT_MASKING -D_FORTIFY_SOURCE=2 -D_WEBSOCKETPP_NO_CPP11_MEMORY_=1 -DSTRIPPED_FILENAME=\"src/cpp/session/http/SessionPosixHttpConnectionListener.cpp\" -I/wrkdirs/usr/ports/devel/RStudio/work-desktop/rstudio-1.4.1717/src/cpp/session/include -I/usr/local/lib/R/include -I/wrkdirs/usr/ports/devel/RStudio/work-desktop/rstudio-1.4.1717/src/cpp/core/include -I/include -I/wrkdirs/usr/ports/devel/RStudio/work-desktop/rstudio-1.4.1717/src/cpp/shared_core/include -I/wrkdirs/usr/ports/devel/RStudio/work-desktop/rstudio-1.4.1717/src/cpp/ext -I/wrkdirs/usr/ports/devel/RStudio/work-desktop/rstudio-1.4.1717/src/cpp/monitor/include -I/wrkdirs/usr/ports/devel/RStudio/work-desktop/rstudio-1.4.1717/src/cpp/r/incl
 ude -I/wrkdirs/usr/ports/devel/RStudio/work-desktop/.build/src/cpp/session -I/wrkdirs/usr/ports/devel/RStudio/work-desktop/rstudio-1.4.1717/src/cpp/tests/cpp -isystem /opt/rstudio-tools/amd64/crashpad -isystem /opt/rstudio-tools/amd64/crashpad/crashpad -isystem /opt/rstudio-tools/amd64/crashpad/crashpad/third_party/mini_chromium/mini_chromium -isystem /usr/include/postgresql -isystem /usr/include/pgsql -O2 -pipe -fstack-protector-strong -isystem /usr/local/include -fno-strict-aliasing  -isystem /usr/local/include -std=c++0x -std=c++11 -O2 -pipe -fstack-protector-strong -isystem /usr/local/include -fno-strict-aliasing  -isystem /usr/local/include -fPIE   -Wall -pthread -Werror=return-type -Wformat -Wformat-security -fstack-protector --param ssp-buffer-size=4 -fPIC -MD -MT src/cpp/session/CMakeFiles/rsession.dir/http/SessionPosixHttpConnectionListener.cpp.o -MF CMakeFiles/rsession.dir/http/SessionPosixHttpConnectionListener.cpp.o.d -o CMakeFiles/rsession.dir/http/SessionPosixHttpConne
 ctionListener.cpp.o -c /wrkdirs/usr/ports/de!
 vel/RStudio/work-desktop/rstudio-1.4.1717/src/cpp/session/http/SessionPosixHttpConnectionListener.cpp
[ 98%] Building CXX object src/cpp/session/CMakeFiles/rsession.dir/SessionConsoleProcessInfoTests.cpp.o
cd /wrkdirs/usr/ports/devel/RStudio/work-desktop/.build/src/cpp/session && /usr/bin/c++ -DBOOST_ASIO_DISABLE_KQUEUE -DBOOST_ENABLE_ASSERT_HANDLER -DBOOST_SIGNALS_NO_DEPRECATION_WARNING -DRSTUDIO_BOOST_NAMESPACE=boost -DRSTUDIO_BOOST_SIGNALS_VERSION=2 -DRSTUDIO_UNIT_TESTS_ENABLED -DWEBSOCKETPP_STRICT_MASKING -D_FORTIFY_SOURCE=2 -D_WEBSOCKETPP_NO_CPP11_MEMORY_=1 -DSTRIPPED_FILENAME=\"src/cpp/session/SessionConsoleProcessInfoTests.cpp\" -I/wrkdirs/usr/ports/devel/RStudio/work-desktop/rstudio-1.4.1717/src/cpp/session/include -I/usr/local/lib/R/include -I/wrkdirs/usr/ports/devel/RStudio/work-desktop/rstudio-1.4.1717/src/cpp/core/include -I/include -I/wrkdirs/usr/ports/devel/RStudio/work-desktop/rstudio-1.4.1717/src/cpp/shared_core/include -I/wrkdirs/usr/ports/devel/RStudio/work-desktop/rstudio-1.4.1717/src/cpp/ext -I/wrkdirs/usr/ports/devel/RStudio/work-desktop/rstudio-1.4.1717/src/cpp/monitor/include -I/wrkdirs/usr/ports/devel/RStudio/work-desktop/rstudio-1.4.1717/src/cpp/r/include -I/wr
 kdirs/usr/ports/devel/RStudio/work-desktop/.build/src/cpp/session -I/wrkdirs/usr/ports/devel/RStudio/work-desktop/rstudio-1.4.1717/src/cpp/tests/cpp -isystem /opt/rstudio-tools/amd64/crashpad -isystem /opt/rstudio-tools/amd64/crashpad/crashpad -isystem /opt/rstudio-tools/amd64/crashpad/crashpad/third_party/mini_chromium/mini_chromium -isystem /usr/include/postgresql -isystem /usr/include/pgsql -O2 -pipe -fstack-protector-strong -isystem /usr/local/include -fno-strict-aliasing  -isystem /usr/local/include -std=c++0x -std=c++11 -O2 -pipe -fstack-protector-strong -isystem /usr/local/include -fno-strict-aliasing  -isystem /usr/local/include -fPIE   -Wall -pthread -Werror=return-type -Wformat -Wformat-security -fstack-protector --param ssp-buffer-size=4 -fPIC -MD -MT src/cpp/session/CMakeFiles/rsession.dir/SessionConsoleProcessInfoTests.cpp.o -MF CMakeFiles/rsession.dir/SessionConsoleProcessInfoTests.cpp.o.d -o CMakeFiles/rsession.dir/SessionConsoleProcessInfoTests.cpp.o -c /wrkdirs/usr/
 ports/devel/RStudio/work-desktop/rstudio-1.4!
 .1717/src/cpp/session/SessionConsoleProcessInfoTests.cpp
[ 98%] Building CXX object src/cpp/session/CMakeFiles/rsession.dir/SessionConsoleProcessPersistTests.cpp.o
cd /wrkdirs/usr/ports/devel/RStudio/work-desktop/.build/src/cpp/session && /usr/bin/c++ -DBOOST_ASIO_DISABLE_KQUEUE -DBOOST_ENABLE_ASSERT_HANDLER -DBOOST_SIGNALS_NO_DEPRECATION_WARNING -DRSTUDIO_BOOST_NAMESPACE=boost -DRSTUDIO_BOOST_SIGNALS_VERSION=2 -DRSTUDIO_UNIT_TESTS_ENABLED -DWEBSOCKETPP_STRICT_MASKING -D_FORTIFY_SOURCE=2 -D_WEBSOCKETPP_NO_CPP11_MEMORY_=1 -DSTRIPPED_FILENAME=\"src/cpp/session/SessionConsoleProcessPersistTests.cpp\" -I/wrkdirs/usr/ports/devel/RStudio/work-desktop/rstudio-1.4.1717/src/cpp/session/include -I/usr/local/lib/R/include -I/wrkdirs/usr/ports/devel/RStudio/work-desktop/rstudio-1.4.1717/src/cpp/core/include -I/include -I/wrkdirs/usr/ports/devel/RStudio/work-desktop/rstudio-1.4.1717/src/cpp/shared_core/include -I/wrkdirs/usr/ports/devel/RStudio/work-desktop/rstudio-1.4.1717/src/cpp/ext -I/wrkdirs/usr/ports/devel/RStudio/work-desktop/rstudio-1.4.1717/src/cpp/monitor/include -I/wrkdirs/usr/ports/devel/RStudio/work-desktop/rstudio-1.4.1717/src/cpp/r/include -I
 /wrkdirs/usr/ports/devel/RStudio/work-desktop/.build/src/cpp/session -I/wrkdirs/usr/ports/devel/RStudio/work-desktop/rstudio-1.4.1717/src/cpp/tests/cpp -isystem /opt/rstudio-tools/amd64/crashpad -isystem /opt/rstudio-tools/amd64/crashpad/crashpad -isystem /opt/rstudio-tools/amd64/crashpad/crashpad/third_party/mini_chromium/mini_chromium -isystem /usr/include/postgresql -isystem /usr/include/pgsql -O2 -pipe -fstack-protector-strong -isystem /usr/local/include -fno-strict-aliasing  -isystem /usr/local/include -std=c++0x -std=c++11 -O2 -pipe -fstack-protector-strong -isystem /usr/local/include -fno-strict-aliasing  -isystem /usr/local/include -fPIE   -Wall -pthread -Werror=return-type -Wformat -Wformat-security -fstack-protector --param ssp-buffer-size=4 -fPIC -MD -MT src/cpp/session/CMakeFiles/rsession.dir/SessionConsoleProcessPersistTests.cpp.o -MF CMakeFiles/rsession.dir/SessionConsoleProcessPersistTests.cpp.o.d -o CMakeFiles/rsession.dir/SessionConsoleProcessPersistTests.cpp.o -c /
 wrkdirs/usr/ports/devel/RStudio/work-desktop!
 /rstudio-1.4.1717/src/cpp/session/SessionConsoleProcessPersistTests.cpp
[ 98%] Building CXX object src/cpp/session/CMakeFiles/rsession.dir/SessionConsoleProcessSocketTests.cpp.o
cd /wrkdirs/usr/ports/devel/RStudio/work-desktop/.build/src/cpp/session && /usr/bin/c++ -DBOOST_ASIO_DISABLE_KQUEUE -DBOOST_ENABLE_ASSERT_HANDLER -DBOOST_SIGNALS_NO_DEPRECATION_WARNING -DRSTUDIO_BOOST_NAMESPACE=boost -DRSTUDIO_BOOST_SIGNALS_VERSION=2 -DRSTUDIO_UNIT_TESTS_ENABLED -DWEBSOCKETPP_STRICT_MASKING -D_FORTIFY_SOURCE=2 -D_WEBSOCKETPP_NO_CPP11_MEMORY_=1 -DSTRIPPED_FILENAME=\"src/cpp/session/SessionConsoleProcessSocketTests.cpp\" -I/wrkdirs/usr/ports/devel/RStudio/work-desktop/rstudio-1.4.1717/src/cpp/session/include -I/usr/local/lib/R/include -I/wrkdirs/usr/ports/devel/RStudio/work-desktop/rstudio-1.4.1717/src/cpp/core/include -I/include -I/wrkdirs/usr/ports/devel/RStudio/work-desktop/rstudio-1.4.1717/src/cpp/shared_core/include -I/wrkdirs/usr/ports/devel/RStudio/work-desktop/rstudio-1.4.1717/src/cpp/ext -I/wrkdirs/usr/ports/devel/RStudio/work-desktop/rstudio-1.4.1717/src/cpp/monitor/include -I/wrkdirs/usr/ports/devel/RStudio/work-desktop/rstudio-1.4.1717/src/cpp/r/include -I/
 wrkdirs/usr/ports/devel/RStudio/work-desktop/.build/src/cpp/session -I/wrkdirs/usr/ports/devel/RStudio/work-desktop/rstudio-1.4.1717/src/cpp/tests/cpp -isystem /opt/rstudio-tools/amd64/crashpad -isystem /opt/rstudio-tools/amd64/crashpad/crashpad -isystem /opt/rstudio-tools/amd64/crashpad/crashpad/third_party/mini_chromium/mini_chromium -isystem /usr/include/postgresql -isystem /usr/include/pgsql -O2 -pipe -fstack-protector-strong -isystem /usr/local/include -fno-strict-aliasing  -isystem /usr/local/include -std=c++0x -std=c++11 -O2 -pipe -fstack-protector-strong -isystem /usr/local/include -fno-strict-aliasing  -isystem /usr/local/include -fPIE   -Wall -pthread -Werror=return-type -Wformat -Wformat-security -fstack-protector --param ssp-buffer-size=4 -fPIC -MD -MT src/cpp/session/CMakeFiles/rsession.dir/SessionConsoleProcessSocketTests.cpp.o -MF CMakeFiles/rsession.dir/SessionConsoleProcessSocketTests.cpp.o.d -o CMakeFiles/rsession.dir/SessionConsoleProcessSocketTests.cpp.o -c /wrkd
 irs/usr/ports/devel/RStudio/work-desktop/rst!
 udio-1.4.1717/src/cpp/session/SessionConsoleProcessSocketTests.cpp
[ 99%] Building CXX object src/cpp/session/CMakeFiles/rsession.dir/SessionConsoleProcessTests.cpp.o
cd /wrkdirs/usr/ports/devel/RStudio/work-desktop/.build/src/cpp/session && /usr/bin/c++ -DBOOST_ASIO_DISABLE_KQUEUE -DBOOST_ENABLE_ASSERT_HANDLER -DBOOST_SIGNALS_NO_DEPRECATION_WARNING -DRSTUDIO_BOOST_NAMESPACE=boost -DRSTUDIO_BOOST_SIGNALS_VERSION=2 -DRSTUDIO_UNIT_TESTS_ENABLED -DWEBSOCKETPP_STRICT_MASKING -D_FORTIFY_SOURCE=2 -D_WEBSOCKETPP_NO_CPP11_MEMORY_=1 -DSTRIPPED_FILENAME=\"src/cpp/session/SessionConsoleProcessTests.cpp\" -I/wrkdirs/usr/ports/devel/RStudio/work-desktop/rstudio-1.4.1717/src/cpp/session/include -I/usr/local/lib/R/include -I/wrkdirs/usr/ports/devel/RStudio/work-desktop/rstudio-1.4.1717/src/cpp/core/include -I/include -I/wrkdirs/usr/ports/devel/RStudio/work-desktop/rstudio-1.4.1717/src/cpp/shared_core/include -I/wrkdirs/usr/ports/devel/RStudio/work-desktop/rstudio-1.4.1717/src/cpp/ext -I/wrkdirs/usr/ports/devel/RStudio/work-desktop/rstudio-1.4.1717/src/cpp/monitor/include -I/wrkdirs/usr/ports/devel/RStudio/work-desktop/rstudio-1.4.1717/src/cpp/r/include -I/wrkdir
 s/usr/ports/devel/RStudio/work-desktop/.build/src/cpp/session -I/wrkdirs/usr/ports/devel/RStudio/work-desktop/rstudio-1.4.1717/src/cpp/tests/cpp -isystem /opt/rstudio-tools/amd64/crashpad -isystem /opt/rstudio-tools/amd64/crashpad/crashpad -isystem /opt/rstudio-tools/amd64/crashpad/crashpad/third_party/mini_chromium/mini_chromium -isystem /usr/include/postgresql -isystem /usr/include/pgsql -O2 -pipe -fstack-protector-strong -isystem /usr/local/include -fno-strict-aliasing  -isystem /usr/local/include -std=c++0x -std=c++11 -O2 -pipe -fstack-protector-strong -isystem /usr/local/include -fno-strict-aliasing  -isystem /usr/local/include -fPIE   -Wall -pthread -Werror=return-type -Wformat -Wformat-security -fstack-protector --param ssp-buffer-size=4 -fPIC -MD -MT src/cpp/session/CMakeFiles/rsession.dir/SessionConsoleProcessTests.cpp.o -MF CMakeFiles/rsession.dir/SessionConsoleProcessTests.cpp.o.d -o CMakeFiles/rsession.dir/SessionConsoleProcessTests.cpp.o -c /wrkdirs/usr/ports/devel/RStu
 dio/work-desktop/rstudio-1.4.1717/src/cpp/se!
 ssion/SessionConsoleProcessTests.cpp
[ 99%] Building CXX object src/cpp/session/CMakeFiles/rsession.dir/modules/SessionDiagnosticsTests.cpp.o
cd /wrkdirs/usr/ports/devel/RStudio/work-desktop/.build/src/cpp/session && /usr/bin/c++ -DBOOST_ASIO_DISABLE_KQUEUE -DBOOST_ENABLE_ASSERT_HANDLER -DBOOST_SIGNALS_NO_DEPRECATION_WARNING -DRSTUDIO_BOOST_NAMESPACE=boost -DRSTUDIO_BOOST_SIGNALS_VERSION=2 -DRSTUDIO_UNIT_TESTS_ENABLED -DWEBSOCKETPP_STRICT_MASKING -D_FORTIFY_SOURCE=2 -D_WEBSOCKETPP_NO_CPP11_MEMORY_=1 -DSTRIPPED_FILENAME=\"src/cpp/session/modules/SessionDiagnosticsTests.cpp\" -I/wrkdirs/usr/ports/devel/RStudio/work-desktop/rstudio-1.4.1717/src/cpp/session/include -I/usr/local/lib/R/include -I/wrkdirs/usr/ports/devel/RStudio/work-desktop/rstudio-1.4.1717/src/cpp/core/include -I/include -I/wrkdirs/usr/ports/devel/RStudio/work-desktop/rstudio-1.4.1717/src/cpp/shared_core/include -I/wrkdirs/usr/ports/devel/RStudio/work-desktop/rstudio-1.4.1717/src/cpp/ext -I/wrkdirs/usr/ports/devel/RStudio/work-desktop/rstudio-1.4.1717/src/cpp/monitor/include -I/wrkdirs/usr/ports/devel/RStudio/work-desktop/rstudio-1.4.1717/src/cpp/r/include -I/w
 rkdirs/usr/ports/devel/RStudio/work-desktop/.build/src/cpp/session -I/wrkdirs/usr/ports/devel/RStudio/work-desktop/rstudio-1.4.1717/src/cpp/tests/cpp -isystem /opt/rstudio-tools/amd64/crashpad -isystem /opt/rstudio-tools/amd64/crashpad/crashpad -isystem /opt/rstudio-tools/amd64/crashpad/crashpad/third_party/mini_chromium/mini_chromium -isystem /usr/include/postgresql -isystem /usr/include/pgsql -O2 -pipe -fstack-protector-strong -isystem /usr/local/include -fno-strict-aliasing  -isystem /usr/local/include -std=c++0x -std=c++11 -O2 -pipe -fstack-protector-strong -isystem /usr/local/include -fno-strict-aliasing  -isystem /usr/local/include -fPIE   -Wall -pthread -Werror=return-type -Wformat -Wformat-security -fstack-protector --param ssp-buffer-size=4 -fPIC -MD -MT src/cpp/session/CMakeFiles/rsession.dir/modules/SessionDiagnosticsTests.cpp.o -MF CMakeFiles/rsession.dir/modules/SessionDiagnosticsTests.cpp.o.d -o CMakeFiles/rsession.dir/modules/SessionDiagnosticsTests.cpp.o -c /wrkdirs/
 usr/ports/devel/RStudio/work-desktop/rstudio!
 -1.4.1717/src/cpp/session/modules/SessionDiagnosticsTests.cpp
[ 99%] Building CXX object src/cpp/session/CMakeFiles/rsession.dir/modules/SessionFindTests.cpp.o
cd /wrkdirs/usr/ports/devel/RStudio/work-desktop/.build/src/cpp/session && /usr/bin/c++ -DBOOST_ASIO_DISABLE_KQUEUE -DBOOST_ENABLE_ASSERT_HANDLER -DBOOST_SIGNALS_NO_DEPRECATION_WARNING -DRSTUDIO_BOOST_NAMESPACE=boost -DRSTUDIO_BOOST_SIGNALS_VERSION=2 -DRSTUDIO_UNIT_TESTS_ENABLED -DWEBSOCKETPP_STRICT_MASKING -D_FORTIFY_SOURCE=2 -D_WEBSOCKETPP_NO_CPP11_MEMORY_=1 -DSTRIPPED_FILENAME=\"src/cpp/session/modules/SessionFindTests.cpp\" -I/wrkdirs/usr/ports/devel/RStudio/work-desktop/rstudio-1.4.1717/src/cpp/session/include -I/usr/local/lib/R/include -I/wrkdirs/usr/ports/devel/RStudio/work-desktop/rstudio-1.4.1717/src/cpp/core/include -I/include -I/wrkdirs/usr/ports/devel/RStudio/work-desktop/rstudio-1.4.1717/src/cpp/shared_core/include -I/wrkdirs/usr/ports/devel/RStudio/work-desktop/rstudio-1.4.1717/src/cpp/ext -I/wrkdirs/usr/ports/devel/RStudio/work-desktop/rstudio-1.4.1717/src/cpp/monitor/include -I/wrkdirs/usr/ports/devel/RStudio/work-desktop/rstudio-1.4.1717/src/cpp/r/include -I/wrkdirs/
 usr/ports/devel/RStudio/work-desktop/.build/src/cpp/session -I/wrkdirs/usr/ports/devel/RStudio/work-desktop/rstudio-1.4.1717/src/cpp/tests/cpp -isystem /opt/rstudio-tools/amd64/crashpad -isystem /opt/rstudio-tools/amd64/crashpad/crashpad -isystem /opt/rstudio-tools/amd64/crashpad/crashpad/third_party/mini_chromium/mini_chromium -isystem /usr/include/postgresql -isystem /usr/include/pgsql -O2 -pipe -fstack-protector-strong -isystem /usr/local/include -fno-strict-aliasing  -isystem /usr/local/include -std=c++0x -std=c++11 -O2 -pipe -fstack-protector-strong -isystem /usr/local/include -fno-strict-aliasing  -isystem /usr/local/include -fPIE   -Wall -pthread -Werror=return-type -Wformat -Wformat-security -fstack-protector --param ssp-buffer-size=4 -fPIC -MD -MT src/cpp/session/CMakeFiles/rsession.dir/modules/SessionFindTests.cpp.o -MF CMakeFiles/rsession.dir/modules/SessionFindTests.cpp.o.d -o CMakeFiles/rsession.dir/modules/SessionFindTests.cpp.o -c /wrkdirs/usr/ports/devel/RStudio/work
 -desktop/rstudio-1.4.1717/src/cpp/session/mo!
 dules/SessionFindTests.cpp
[ 99%] Building CXX object src/cpp/session/CMakeFiles/rsession.dir/modules/SessionRCompletionsTests.cpp.o
cd /wrkdirs/usr/ports/devel/RStudio/work-desktop/.build/src/cpp/session && /usr/bin/c++ -DBOOST_ASIO_DISABLE_KQUEUE -DBOOST_ENABLE_ASSERT_HANDLER -DBOOST_SIGNALS_NO_DEPRECATION_WARNING -DRSTUDIO_BOOST_NAMESPACE=boost -DRSTUDIO_BOOST_SIGNALS_VERSION=2 -DRSTUDIO_UNIT_TESTS_ENABLED -DWEBSOCKETPP_STRICT_MASKING -D_FORTIFY_SOURCE=2 -D_WEBSOCKETPP_NO_CPP11_MEMORY_=1 -DSTRIPPED_FILENAME=\"src/cpp/session/modules/SessionRCompletionsTests.cpp\" -I/wrkdirs/usr/ports/devel/RStudio/work-desktop/rstudio-1.4.1717/src/cpp/session/include -I/usr/local/lib/R/include -I/wrkdirs/usr/ports/devel/RStudio/work-desktop/rstudio-1.4.1717/src/cpp/core/include -I/include -I/wrkdirs/usr/ports/devel/RStudio/work-desktop/rstudio-1.4.1717/src/cpp/shared_core/include -I/wrkdirs/usr/ports/devel/RStudio/work-desktop/rstudio-1.4.1717/src/cpp/ext -I/wrkdirs/usr/ports/devel/RStudio/work-desktop/rstudio-1.4.1717/src/cpp/monitor/include -I/wrkdirs/usr/ports/devel/RStudio/work-desktop/rstudio-1.4.1717/src/cpp/r/include -I/
 wrkdirs/usr/ports/devel/RStudio/work-desktop/.build/src/cpp/session -I/wrkdirs/usr/ports/devel/RStudio/work-desktop/rstudio-1.4.1717/src/cpp/tests/cpp -isystem /opt/rstudio-tools/amd64/crashpad -isystem /opt/rstudio-tools/amd64/crashpad/crashpad -isystem /opt/rstudio-tools/amd64/crashpad/crashpad/third_party/mini_chromium/mini_chromium -isystem /usr/include/postgresql -isystem /usr/include/pgsql -O2 -pipe -fstack-protector-strong -isystem /usr/local/include -fno-strict-aliasing  -isystem /usr/local/include -std=c++0x -std=c++11 -O2 -pipe -fstack-protector-strong -isystem /usr/local/include -fno-strict-aliasing  -isystem /usr/local/include -fPIE   -Wall -pthread -Werror=return-type -Wformat -Wformat-security -fstack-protector --param ssp-buffer-size=4 -fPIC -MD -MT src/cpp/session/CMakeFiles/rsession.dir/modules/SessionRCompletionsTests.cpp.o -MF CMakeFiles/rsession.dir/modules/SessionRCompletionsTests.cpp.o.d -o CMakeFiles/rsession.dir/modules/SessionRCompletionsTests.cpp.o -c /wrkd
 irs/usr/ports/devel/RStudio/work-desktop/rst!
 udio-1.4.1717/src/cpp/session/modules/SessionRCompletionsTests.cpp
[ 99%] Building CXX object src/cpp/session/CMakeFiles/rsession.dir/modules/SessionRTests.cpp.o
cd /wrkdirs/usr/ports/devel/RStudio/work-desktop/.build/src/cpp/session && /usr/bin/c++ -DBOOST_ASIO_DISABLE_KQUEUE -DBOOST_ENABLE_ASSERT_HANDLER -DBOOST_SIGNALS_NO_DEPRECATION_WARNING -DRSTUDIO_BOOST_NAMESPACE=boost -DRSTUDIO_BOOST_SIGNALS_VERSION=2 -DRSTUDIO_UNIT_TESTS_ENABLED -DWEBSOCKETPP_STRICT_MASKING -D_FORTIFY_SOURCE=2 -D_WEBSOCKETPP_NO_CPP11_MEMORY_=1 -DSTRIPPED_FILENAME=\"src/cpp/session/modules/SessionRTests.cpp\" -I/wrkdirs/usr/ports/devel/RStudio/work-desktop/rstudio-1.4.1717/src/cpp/session/include -I/usr/local/lib/R/include -I/wrkdirs/usr/ports/devel/RStudio/work-desktop/rstudio-1.4.1717/src/cpp/core/include -I/include -I/wrkdirs/usr/ports/devel/RStudio/work-desktop/rstudio-1.4.1717/src/cpp/shared_core/include -I/wrkdirs/usr/ports/devel/RStudio/work-desktop/rstudio-1.4.1717/src/cpp/ext -I/wrkdirs/usr/ports/devel/RStudio/work-desktop/rstudio-1.4.1717/src/cpp/monitor/include -I/wrkdirs/usr/ports/devel/RStudio/work-desktop/rstudio-1.4.1717/src/cpp/r/include -I/wrkdirs/usr
 /ports/devel/RStudio/work-desktop/.build/src/cpp/session -I/wrkdirs/usr/ports/devel/RStudio/work-desktop/rstudio-1.4.1717/src/cpp/tests/cpp -isystem /opt/rstudio-tools/amd64/crashpad -isystem /opt/rstudio-tools/amd64/crashpad/crashpad -isystem /opt/rstudio-tools/amd64/crashpad/crashpad/third_party/mini_chromium/mini_chromium -isystem /usr/include/postgresql -isystem /usr/include/pgsql -O2 -pipe -fstack-protector-strong -isystem /usr/local/include -fno-strict-aliasing  -isystem /usr/local/include -std=c++0x -std=c++11 -O2 -pipe -fstack-protector-strong -isystem /usr/local/include -fno-strict-aliasing  -isystem /usr/local/include -fPIE   -Wall -pthread -Werror=return-type -Wformat -Wformat-security -fstack-protector --param ssp-buffer-size=4 -fPIC -MD -MT src/cpp/session/CMakeFiles/rsession.dir/modules/SessionRTests.cpp.o -MF CMakeFiles/rsession.dir/modules/SessionRTests.cpp.o.d -o CMakeFiles/rsession.dir/modules/SessionRTests.cpp.o -c /wrkdirs/usr/ports/devel/RStudio/work-desktop/rst
 udio-1.4.1717/src/cpp/session/modules/Sessio!
 nRTests.cpp
[ 99%] Building CXX object src/cpp/session/CMakeFiles/rsession.dir/modules/SessionTerminalShellTests.cpp.o
cd /wrkdirs/usr/ports/devel/RStudio/work-desktop/.build/src/cpp/session && /usr/bin/c++ -DBOOST_ASIO_DISABLE_KQUEUE -DBOOST_ENABLE_ASSERT_HANDLER -DBOOST_SIGNALS_NO_DEPRECATION_WARNING -DRSTUDIO_BOOST_NAMESPACE=boost -DRSTUDIO_BOOST_SIGNALS_VERSION=2 -DRSTUDIO_UNIT_TESTS_ENABLED -DWEBSOCKETPP_STRICT_MASKING -D_FORTIFY_SOURCE=2 -D_WEBSOCKETPP_NO_CPP11_MEMORY_=1 -DSTRIPPED_FILENAME=\"src/cpp/session/modules/SessionTerminalShellTests.cpp\" -I/wrkdirs/usr/ports/devel/RStudio/work-desktop/rstudio-1.4.1717/src/cpp/session/include -I/usr/local/lib/R/include -I/wrkdirs/usr/ports/devel/RStudio/work-desktop/rstudio-1.4.1717/src/cpp/core/include -I/include -I/wrkdirs/usr/ports/devel/RStudio/work-desktop/rstudio-1.4.1717/src/cpp/shared_core/include -I/wrkdirs/usr/ports/devel/RStudio/work-desktop/rstudio-1.4.1717/src/cpp/ext -I/wrkdirs/usr/ports/devel/RStudio/work-desktop/rstudio-1.4.1717/src/cpp/monitor/include -I/wrkdirs/usr/ports/devel/RStudio/work-desktop/rstudio-1.4.1717/src/cpp/r/include -I
 /wrkdirs/usr/ports/devel/RStudio/work-desktop/.build/src/cpp/session -I/wrkdirs/usr/ports/devel/RStudio/work-desktop/rstudio-1.4.1717/src/cpp/tests/cpp -isystem /opt/rstudio-tools/amd64/crashpad -isystem /opt/rstudio-tools/amd64/crashpad/crashpad -isystem /opt/rstudio-tools/amd64/crashpad/crashpad/third_party/mini_chromium/mini_chromium -isystem /usr/include/postgresql -isystem /usr/include/pgsql -O2 -pipe -fstack-protector-strong -isystem /usr/local/include -fno-strict-aliasing  -isystem /usr/local/include -std=c++0x -std=c++11 -O2 -pipe -fstack-protector-strong -isystem /usr/local/include -fno-strict-aliasing  -isystem /usr/local/include -fPIE   -Wall -pthread -Werror=return-type -Wformat -Wformat-security -fstack-protector --param ssp-buffer-size=4 -fPIC -MD -MT src/cpp/session/CMakeFiles/rsession.dir/modules/SessionTerminalShellTests.cpp.o -MF CMakeFiles/rsession.dir/modules/SessionTerminalShellTests.cpp.o.d -o CMakeFiles/rsession.dir/modules/SessionTerminalShellTests.cpp.o -c /
 wrkdirs/usr/ports/devel/RStudio/work-desktop!
 /rstudio-1.4.1717/src/cpp/session/modules/SessionTerminalShellTests.cpp
[100%] Building CXX object src/cpp/session/CMakeFiles/rsession.dir/prefs/PrefTests.cpp.o
cd /wrkdirs/usr/ports/devel/RStudio/work-desktop/.build/src/cpp/session && /usr/bin/c++ -DBOOST_ASIO_DISABLE_KQUEUE -DBOOST_ENABLE_ASSERT_HANDLER -DBOOST_SIGNALS_NO_DEPRECATION_WARNING -DRSTUDIO_BOOST_NAMESPACE=boost -DRSTUDIO_BOOST_SIGNALS_VERSION=2 -DRSTUDIO_UNIT_TESTS_ENABLED -DWEBSOCKETPP_STRICT_MASKING -D_FORTIFY_SOURCE=2 -D_WEBSOCKETPP_NO_CPP11_MEMORY_=1 -DSTRIPPED_FILENAME=\"src/cpp/session/prefs/PrefTests.cpp\" -I/wrkdirs/usr/ports/devel/RStudio/work-desktop/rstudio-1.4.1717/src/cpp/session/include -I/usr/local/lib/R/include -I/wrkdirs/usr/ports/devel/RStudio/work-desktop/rstudio-1.4.1717/src/cpp/core/include -I/include -I/wrkdirs/usr/ports/devel/RStudio/work-desktop/rstudio-1.4.1717/src/cpp/shared_core/include -I/wrkdirs/usr/ports/devel/RStudio/work-desktop/rstudio-1.4.1717/src/cpp/ext -I/wrkdirs/usr/ports/devel/RStudio/work-desktop/rstudio-1.4.1717/src/cpp/monitor/include -I/wrkdirs/usr/ports/devel/RStudio/work-desktop/rstudio-1.4.1717/src/cpp/r/include -I/wrkdirs/usr/ports
 /devel/RStudio/work-desktop/.build/src/cpp/session -I/wrkdirs/usr/ports/devel/RStudio/work-desktop/rstudio-1.4.1717/src/cpp/tests/cpp -isystem /opt/rstudio-tools/amd64/crashpad -isystem /opt/rstudio-tools/amd64/crashpad/crashpad -isystem /opt/rstudio-tools/amd64/crashpad/crashpad/third_party/mini_chromium/mini_chromium -isystem /usr/include/postgresql -isystem /usr/include/pgsql -O2 -pipe -fstack-protector-strong -isystem /usr/local/include -fno-strict-aliasing  -isystem /usr/local/include -std=c++0x -std=c++11 -O2 -pipe -fstack-protector-strong -isystem /usr/local/include -fno-strict-aliasing  -isystem /usr/local/include -fPIE   -Wall -pthread -Werror=return-type -Wformat -Wformat-security -fstack-protector --param ssp-buffer-size=4 -fPIC -MD -MT src/cpp/session/CMakeFiles/rsession.dir/prefs/PrefTests.cpp.o -MF CMakeFiles/rsession.dir/prefs/PrefTests.cpp.o.d -o CMakeFiles/rsession.dir/prefs/PrefTests.cpp.o -c /wrkdirs/usr/ports/devel/RStudio/work-desktop/rstudio-1.4.1717/src/cpp/se
 ssion/prefs/PrefTests.cpp
[100%] Linking CXX executable rsession
cd /wrkdirs/usr/ports/devel/RStudio/work-desktop/.build/src/cpp/session && /usr/local/bin/cmake -E cmake_link_script CMakeFiles/rsession.dir/link.txt --verbose=1
/usr/bin/c++ -O2 -pipe -fstack-protector-strong -isystem /usr/local/include -fno-strict-aliasing  -isystem /usr/local/include -std=c++0x -std=c++11 -O2 -pipe -fstack-protector-strong -isystem /usr/local/include -fno-strict-aliasing  -isystem /usr/local/include  -Wl,-rpath=/usr/local/lib/gcc10  -L/usr/local/lib/gcc10 -B/usr/local/bin -L/usr/local/lib  -fstack-protector-strong -L/usr/local/lib -pie -Wl,-z,relro,-z,now CMakeFiles/rsession.dir/SessionAsyncRProcess.cpp.o CMakeFiles/rsession.dir/SessionAsyncDownloadFile.cpp.o CMakeFiles/rsession.dir/SessionClientEvent.cpp.o CMakeFiles/rsession.dir/SessionClientEventQueue.cpp.o CMakeFiles/rsession.dir/SessionClientEventService.cpp.o CMakeFiles/rsession.dir/SessionClientInit.cpp.o CMakeFiles/rsession.dir/SessionConsoleInput.cpp.o CMakeFiles/rsession.dir/SessionConsoleProcess.cpp.o CMakeFiles/rsession.dir/SessionConsoleProcessApi.cpp.o CMakeFiles/rsession.dir/SessionConsoleProcessInfo.cpp.o CMakeFiles/rsession.dir/SessionConsoleProcessPersist
 .cpp.o CMakeFiles/rsession.dir/SessionConsoleProcessSocket.cpp.o CMakeFiles/rsession.dir/SessionConsoleProcessSocketPacket.cpp.o CMakeFiles/rsession.dir/SessionConsoleProcessTable.cpp.o CMakeFiles/rsession.dir/SessionContentUrls.cpp.o CMakeFiles/rsession.dir/SessionDirs.cpp.o CMakeFiles/rsession.dir/SessionRpc.cpp.o CMakeFiles/rsession.dir/SessionHttpMethods.cpp.o CMakeFiles/rsession.dir/SessionInit.cpp.o CMakeFiles/rsession.dir/SessionMain.cpp.o CMakeFiles/rsession.dir/SessionMainOverlay.cpp.o CMakeFiles/rsession.dir/SessionMainProcess.cpp.o CMakeFiles/rsession.dir/SessionModuleContext.cpp.o CMakeFiles/rsession.dir/SessionOptions.cpp.o CMakeFiles/rsession.dir/SessionOptionsOverlay.cpp.o CMakeFiles/rsession.dir/SessionPandoc.cpp.o CMakeFiles/rsession.dir/SessionPasswordManager.cpp.o CMakeFiles/rsession.dir/SessionPersistentState.cpp.o CMakeFiles/rsession.dir/SessionPostback.cpp.o CMakeFiles/rsession.dir/SessionSSH.cpp.o CMakeFiles/rsession.dir/SessionSourceDatabase.cpp.o CMakeFiles/
 rsession.dir/SessionSourceDatabaseSupervisor!
 .cpp.o CMakeFiles/rsession.dir/SessionSuspend.cpp.o CMakeFiles/rsession.dir/SessionUriHandlers.cpp.o CMakeFiles/rsession.dir/SessionUrlPorts.cpp.o CMakeFiles/rsession.dir/SessionWorkerContext.cpp.o CMakeFiles/rsession.dir/http/SessionHttpConnectionQueue.cpp.o CMakeFiles/rsession.dir/http/SessionHttpConnectionUtils.cpp.o CMakeFiles/rsession.dir/modules/RStudioAPI.cpp.o CMakeFiles/rsession.dir/modules/SessionAbout.cpp.o CMakeFiles/rsession.dir/modules/SessionApiPrefs.cpp.o CMakeFiles/rsession.dir/modules/SessionAskPass.cpp.o CMakeFiles/rsession.dir/modules/SessionAskSecret.cpp.o CMakeFiles/rsession.dir/modules/SessionAsyncPackageInformation.cpp.o CMakeFiles/rsession.dir/modules/SessionAuthoring.cpp.o CMakeFiles/rsession.dir/modules/SessionBreakpoints.cpp.o CMakeFiles/rsession.dir/modules/SessionCodeSearch.cpp.o CMakeFiles/rsession.dir/modules/SessionConfigFile.cpp.o CMakeFiles/rsession.dir/modules/SessionCRANMirrors.cpp.o CMakeFiles/rsession.dir/modules/SessionCrashHandler.cpp.o CMake
 Files/rsession.dir/modules/SessionUserCommands.cpp.o CMakeFiles/rsession.dir/modules/SessionConsole.cpp.o CMakeFiles/rsession.dir/modules/SessionDependencies.cpp.o CMakeFiles/rsession.dir/modules/SessionDependencyList.cpp.o CMakeFiles/rsession.dir/modules/SessionDiagnostics.cpp.o CMakeFiles/rsession.dir/modules/SessionDirty.cpp.o CMakeFiles/rsession.dir/modules/SessionErrors.cpp.o CMakeFiles/rsession.dir/modules/SessionFiles.cpp.o CMakeFiles/rsession.dir/modules/SessionFilesListingMonitor.cpp.o CMakeFiles/rsession.dir/modules/SessionFilesQuotas.cpp.o CMakeFiles/rsession.dir/modules/SessionFind.cpp.o CMakeFiles/rsession.dir/modules/SessionFonts.cpp.o CMakeFiles/rsession.dir/modules/SessionGit.cpp.o CMakeFiles/rsession.dir/modules/SessionGraphics.cpp.o CMakeFiles/rsession.dir/modules/SessionHelp.cpp.o CMakeFiles/rsession.dir/modules/SessionHelpHome.cpp.o CMakeFiles/rsession.dir/modules/SessionHistory.cpp.o CMakeFiles/rsession.dir/modules/SessionHistoryArchive.cpp.o CMakeFiles/rsession
 .dir/modules/SessionHTMLPreview.cpp.o CMakeF!
 iles/rses!
 sion.dir/modules/SessionLibPathsIndexer.cpp.o CMakeFiles/rsession.dir/modules/SessionLimits.cpp.o CMakeFiles/rsession.dir/modules/SessionLists.cpp.o CMakeFiles/rsession.dir/modules/SessionMarkers.cpp.o CMakeFiles/rsession.dir/modules/SessionObjectExplorer.cpp.o CMakeFiles/rsession.dir/modules/SessionPackageProvidedExtension.cpp.o CMakeFiles/rsession.dir/modules/SessionPackages.cpp.o CMakeFiles/rsession.dir/modules/SessionPackrat.cpp.o CMakeFiles/rsession.dir/modules/SessionPath.cpp.o CMakeFiles/rsession.dir/modules/SessionPlots.cpp.o CMakeFiles/rsession.dir/modules/SessionPlumberViewer.cpp.o CMakeFiles/rsession.dir/modules/SessionProfiler.cpp.o CMakeFiles/rsession.dir/modules/SessionProjectTemplate.cpp.o CMakeFiles/rsession.dir/modules/SessionPythonEnvironments.cpp.o CMakeFiles/rsession.dir/modules/SessionRAddins.cpp.o CMakeFiles/rsession.dir/modules/SessionRCompletions.cpp.o CMakeFiles/rsession.dir/modules/SessionRenv.cpp.o CMakeFiles/rsession.dir/modules/SessionReticulate.cpp.o CM
 akeFiles/rsession.dir/modules/SessionRHooks.cpp.o CMakeFiles/rsession.dir/modules/SessionRParser.cpp.o CMakeFiles/rsession.dir/modules/SessionRPubs.cpp.o CMakeFiles/rsession.dir/modules/SessionRSConnect.cpp.o CMakeFiles/rsession.dir/modules/SessionRUtil.cpp.o CMakeFiles/rsession.dir/modules/SessionRVersions.cpp.o CMakeFiles/rsession.dir/modules/SessionShinyViewer.cpp.o CMakeFiles/rsession.dir/modules/SessionSnippets.cpp.o CMakeFiles/rsession.dir/modules/SessionSource.cpp.o CMakeFiles/rsession.dir/modules/SessionSpelling.cpp.o CMakeFiles/rsession.dir/modules/SessionTerminal.cpp.o CMakeFiles/rsession.dir/modules/SessionTerminalShell.cpp.o CMakeFiles/rsession.dir/modules/SessionTests.cpp.o CMakeFiles/rsession.dir/modules/SessionThemes.cpp.o CMakeFiles/rsession.dir/modules/SessionTutorial.cpp.o CMakeFiles/rsession.dir/modules/SessionSVN.cpp.o CMakeFiles/rsession.dir/modules/SessionSystemResources.cpp.o CMakeFiles/rsession.dir/modules/SessionUpdates.cpp.o CMakeFiles/rsession.dir/modules/
 SessionVCS.cpp.o CMakeFiles/rsession.dir/mod!
 ules/Sess!
 ionWorkbench.cpp.o CMakeFiles/rsession.dir/modules/SessionUserPrefs.cpp.o CMakeFiles/rsession.dir/modules/SessionUserPrefsMigration.cpp.o CMakeFiles/rsession.dir/modules/build/SessionBuild.cpp.o CMakeFiles/rsession.dir/modules/build/SessionBuildEnvironment.cpp.o CMakeFiles/rsession.dir/modules/build/SessionBuildErrors.cpp.o CMakeFiles/rsession.dir/modules/build/SessionSourceCpp.cpp.o CMakeFiles/rsession.dir/modules/clang/CodeCompletion.cpp.o CMakeFiles/rsession.dir/modules/clang/DefinitionIndex.cpp.o CMakeFiles/rsession.dir/modules/clang/Diagnostics.cpp.o CMakeFiles/rsession.dir/modules/clang/FindReferences.cpp.o CMakeFiles/rsession.dir/modules/clang/GoToDefinition.cpp.o CMakeFiles/rsession.dir/modules/clang/RCompilationDatabase.cpp.o CMakeFiles/rsession.dir/modules/clang/RSourceIndex.cpp.o CMakeFiles/rsession.dir/modules/clang/SessionClang.cpp.o CMakeFiles/rsession.dir/modules/connections/ActiveConnections.cpp.o CMakeFiles/rsession.dir/modules/connections/Connection.cpp.o CMakeFile
 s/rsession.dir/modules/connections/ConnectionHistory.cpp.o CMakeFiles/rsession.dir/modules/connections/ConnectionsIndexer.cpp.o CMakeFiles/rsession.dir/modules/connections/SessionConnections.cpp.o CMakeFiles/rsession.dir/modules/customsource/SessionCustomSource.cpp.o CMakeFiles/rsession.dir/modules/data/SessionData.cpp.o CMakeFiles/rsession.dir/modules/data/DataViewer.cpp.o CMakeFiles/rsession.dir/modules/environment/EnvironmentMonitor.cpp.o CMakeFiles/rsession.dir/modules/environment/EnvironmentUtils.cpp.o CMakeFiles/rsession.dir/modules/environment/SessionEnvironment.cpp.o CMakeFiles/rsession.dir/modules/jobs/AsyncRJobManager.cpp.o CMakeFiles/rsession.dir/modules/jobs/SessionJobs.cpp.o CMakeFiles/rsession.dir/modules/jobs/ScriptJob.cpp.o CMakeFiles/rsession.dir/modules/jobs/Job.cpp.o CMakeFiles/rsession.dir/modules/jobs/JobsApi.cpp.o CMakeFiles/rsession.dir/modules/mathjax/SessionMathJax.cpp.o CMakeFiles/rsession.dir/modules/panmirror/SessionPanmirror.cpp.o CMakeFiles/rsession.dir
 /modules/panmirror/SessionPanmirrorBibliogra!
 phy.cpp.o!
  CMakeFiles/rsession.dir/modules/panmirror/SessionPanmirrorCrossref.cpp.o CMakeFiles/rsession.dir/modules/panmirror/SessionPanmirrorDataCite.cpp.o CMakeFiles/rsession.dir/modules/panmirror/SessionPanmirrorDOI.cpp.o CMakeFiles/rsession.dir/modules/panmirror/SessionPanmirrorPandoc.cpp.o CMakeFiles/rsession.dir/modules/panmirror/SessionPanmirrorPubMed.cpp.o CMakeFiles/rsession.dir/modules/panmirror/SessionPanmirrorUtils.cpp.o CMakeFiles/rsession.dir/modules/overlay/SessionOverlay.cpp.o CMakeFiles/rsession.dir/modules/plumber/SessionPlumber.cpp.o CMakeFiles/rsession.dir/modules/presentation/SessionPresentation.cpp.o CMakeFiles/rsession.dir/modules/presentation/PresentationLog.cpp.o CMakeFiles/rsession.dir/modules/presentation/PresentationState.cpp.o CMakeFiles/rsession.dir/modules/presentation/SlideMediaRenderer.cpp.o CMakeFiles/rsession.dir/modules/presentation/SlideNavigationList.cpp.o CMakeFiles/rsession.dir/modules/presentation/SlideParser.cpp.o CMakeFiles/rsession.dir/modules/prese
 ntation/SlideQuizRenderer.cpp.o CMakeFiles/rsession.dir/modules/presentation/SlideRenderer.cpp.o CMakeFiles/rsession.dir/modules/presentation/SlideRequestHandler.cpp.o CMakeFiles/rsession.dir/modules/preview/SessionPreview.cpp.o CMakeFiles/rsession.dir/modules/rmarkdown/SessionBlogdown.cpp.o CMakeFiles/rsession.dir/modules/rmarkdown/SessionBookdown.cpp.o CMakeFiles/rsession.dir/modules/rmarkdown/SessionBookdownXRefs.cpp.o CMakeFiles/rsession.dir/modules/rmarkdown/SessionRMarkdown.cpp.o CMakeFiles/rsession.dir/modules/rmarkdown/SessionRmdNotebook.cpp.o CMakeFiles/rsession.dir/modules/rmarkdown/SessionExecuteChunkOperation.cpp.o CMakeFiles/rsession.dir/modules/rmarkdown/NotebookAlternateEngines.cpp.o CMakeFiles/rsession.dir/modules/rmarkdown/NotebookCache.cpp.o CMakeFiles/rsession.dir/modules/rmarkdown/NotebookCapture.cpp.o CMakeFiles/rsession.dir/modules/rmarkdown/NotebookChunkDefs.cpp.o CMakeFiles/rsession.dir/modules/rmarkdown/NotebookChunkOptions.cpp.o CMakeFiles/rsession.dir/modu
 les/rmarkdown/NotebookConditions.cpp.o CMake!
 Files/rse!
 ssion.dir/modules/rmarkdown/NotebookData.cpp.o CMakeFiles/rsession.dir/modules/rmarkdown/NotebookDocQueue.cpp.o CMakeFiles/rsession.dir/modules/rmarkdown/NotebookErrors.cpp.o CMakeFiles/rsession.dir/modules/rmarkdown/NotebookExec.cpp.o CMakeFiles/rsession.dir/modules/rmarkdown/NotebookHtmlWidgets.cpp.o CMakeFiles/rsession.dir/modules/rmarkdown/NotebookOutput.cpp.o CMakeFiles/rsession.dir/modules/rmarkdown/NotebookPaths.cpp.o CMakeFiles/rsession.dir/modules/rmarkdown/NotebookPlotReplay.cpp.o CMakeFiles/rsession.dir/modules/rmarkdown/NotebookPlots.cpp.o CMakeFiles/rsession.dir/modules/rmarkdown/NotebookQueue.cpp.o CMakeFiles/rsession.dir/modules/rmarkdown/NotebookQueueUnit.cpp.o CMakeFiles/rsession.dir/modules/rmarkdown/NotebookWorkingDir.cpp.o CMakeFiles/rsession.dir/modules/rmarkdown/RMarkdownPresentation.cpp.o CMakeFiles/rsession.dir/modules/rmarkdown/RMarkdownTemplates.cpp.o CMakeFiles/rsession.dir/modules/shiny/SessionShiny.cpp.o CMakeFiles/rsession.dir/modules/shiny/ShinyAsyncJo
 b.cpp.o CMakeFiles/rsession.dir/modules/sql/SessionSql.cpp.o CMakeFiles/rsession.dir/modules/stan/SessionStan.cpp.o CMakeFiles/rsession.dir/modules/tex/SessionCompilePdf.cpp.o CMakeFiles/rsession.dir/modules/tex/SessionCompilePdfSupervisor.cpp.o CMakeFiles/rsession.dir/modules/tex/SessionPdfLatex.cpp.o CMakeFiles/rsession.dir/modules/tex/SessionRnwConcordance.cpp.o CMakeFiles/rsession.dir/modules/tex/SessionRnwWeave.cpp.o CMakeFiles/rsession.dir/modules/tex/SessionSynctex.cpp.o CMakeFiles/rsession.dir/modules/tex/SessionTexUtils.cpp.o CMakeFiles/rsession.dir/modules/tex/SessionViewPdf.cpp.o CMakeFiles/rsession.dir/modules/vcs/SessionVCSCore.cpp.o CMakeFiles/rsession.dir/modules/vcs/SessionVCSUtils.cpp.o CMakeFiles/rsession.dir/modules/viewer/SessionViewer.cpp.o CMakeFiles/rsession.dir/modules/viewer/ViewerHistory.cpp.o CMakeFiles/rsession.dir/modules/zotero/ZoteroBetterBibTeX.cpp.o CMakeFiles/rsession.dir/modules/zotero/ZoteroCollections.cpp.o CMakeFiles/rsession.dir/modules/zotero/
 ZoteroCollectionsWeb.cpp.o CMakeFiles/rsessi!
 on.dir/mo!
 dules/zotero/ZoteroCollectionsLocal.cpp.o CMakeFiles/rsession.dir/modules/zotero/ZoteroCSL.cpp.o CMakeFiles/rsession.dir/modules/zotero/ZoteroUtil.cpp.o CMakeFiles/rsession.dir/modules/zotero/SessionZotero.cpp.o CMakeFiles/rsession.dir/prefs/PrefLayer.cpp.o CMakeFiles/rsession.dir/prefs/Preferences.cpp.o CMakeFiles/rsession.dir/prefs/UserPrefValues.cpp.o CMakeFiles/rsession.dir/prefs/UserPrefValuesNative.cpp.o CMakeFiles/rsession.dir/prefs/UserPrefs.cpp.o CMakeFiles/rsession.dir/prefs/UserPrefsComputedLayer.cpp.o CMakeFiles/rsession.dir/prefs/UserPrefsDefaultLayer.cpp.o CMakeFiles/rsession.dir/prefs/UserPrefsLayer.cpp.o CMakeFiles/rsession.dir/prefs/UserPrefsProjectLayer.cpp.o CMakeFiles/rsession.dir/prefs/UserPrefsSystemLayer.cpp.o CMakeFiles/rsession.dir/prefs/UserState.cpp.o CMakeFiles/rsession.dir/prefs/UserStateComputedLayer.cpp.o CMakeFiles/rsession.dir/prefs/UserStateDefaultLayer.cpp.o CMakeFiles/rsession.dir/prefs/UserStateLayer.cpp.o CMakeFiles/rsession.dir/prefs/UserStateV
 alues.cpp.o CMakeFiles/rsession.dir/projects/SessionProjects.cpp.o CMakeFiles/rsession.dir/projects/SessionProjectContext.cpp.o CMakeFiles/rsession.dir/projects/SessionProjectFirstRun.cpp.o CMakeFiles/rsession.dir/SessionAddins.cpp.o CMakeFiles/rsession.dir/http/SessionPosixHttpConnectionListener.cpp.o CMakeFiles/rsession.dir/SessionConsoleProcessInfoTests.cpp.o CMakeFiles/rsession.dir/SessionConsoleProcessPersistTests.cpp.o CMakeFiles/rsession.dir/SessionConsoleProcessSocketTests.cpp.o CMakeFiles/rsession.dir/SessionConsoleProcessTests.cpp.o CMakeFiles/rsession.dir/modules/SessionDiagnosticsTests.cpp.o CMakeFiles/rsession.dir/modules/SessionFindTests.cpp.o CMakeFiles/rsession.dir/modules/SessionRCompletionsTests.cpp.o CMakeFiles/rsession.dir/modules/SessionRTests.cpp.o CMakeFiles/rsession.dir/modules/SessionTerminalShellTests.cpp.o CMakeFiles/rsession.dir/prefs/PrefTests.cpp.o -o rsession  -Wl,-rpath,/usr/local/lib/R/lib: -L/usr/local/lib -linotify -lprocstat ../core/librstudio-cor
 e.a ../core/spelling/hunspell/librstudio-cor!
 e-hunspel!
 l.a ../core/tex/synctex/librstudio-core-synctex.a ../monitor/librstudio-monitor.a ../r/librstudio-r.a workers/librstudio-session-workers.a /usr/local/lib/R/lib/libR.so ../core/librstudio-core.a ../core/spelling/hunspell/librstudio-core-hunspell.a ../shared_core/librstudio-shared-core.a /usr/local/lib/libboost_atomic.so /usr/local/lib/libboost_chrono.so /usr/local/lib/libboost_date_time.so /usr/local/lib/libboost_filesystem.so /usr/local/lib/libboost_iostreams.so /usr/local/lib/libboost_program_options.so /usr/local/lib/libboost_random.so /usr/local/lib/libboost_regex.so /usr/local/lib/libboost_system.so /usr/local/lib/libboost_thread.so -pthread /usr/local/lib/libsoci_sqlite3.so /usr/local/lib/libsoci_postgresql.so /usr/local/lib/libsqlite3.so.0.8.6 /usr/local/lib/libpq.so.5 /usr/local/lib/libsoci_core.so /usr/lib/libdl.so /usr/lib/libpthread.so /usr/lib/libutil.so /usr/local/lib/libuuid.so /usr/lib/librt.so /usr/lib/libz.so /usr/lib/libssl.so /usr/lib/libcrypto.so /usr/local/lib/li
 byaml-cpp.so.0.6.3 
[100%] Built target rsession
/usr/bin/make  -f src/cpp/session/postback/CMakeFiles/rpostback.dir/build.make src/cpp/session/postback/CMakeFiles/rpostback.dir/depend
cd /wrkdirs/usr/ports/devel/RStudio/work-desktop/.build && /usr/local/bin/cmake -E cmake_depends "Unix Makefiles" /wrkdirs/usr/ports/devel/RStudio/work-desktop/rstudio-1.4.1717 /wrkdirs/usr/ports/devel/RStudio/work-desktop/rstudio-1.4.1717/src/cpp/session/postback /wrkdirs/usr/ports/devel/RStudio/work-desktop/.build /wrkdirs/usr/ports/devel/RStudio/work-desktop/.build/src/cpp/session/postback /wrkdirs/usr/ports/devel/RStudio/work-desktop/.build/src/cpp/session/postback/CMakeFiles/rpostback.dir/DependInfo.cmake
/usr/bin/make  -f src/cpp/session/postback/CMakeFiles/rpostback.dir/build.make src/cpp/session/postback/CMakeFiles/rpostback.dir/build
[100%] Building CXX object src/cpp/session/postback/CMakeFiles/rpostback.dir/PostbackMain.cpp.o
cd /wrkdirs/usr/ports/devel/RStudio/work-desktop/.build/src/cpp/session/postback && /usr/bin/c++ -DBOOST_ASIO_DISABLE_KQUEUE -DBOOST_ENABLE_ASSERT_HANDLER -DBOOST_SIGNALS_NO_DEPRECATION_WARNING -DRSTUDIO_BOOST_NAMESPACE=boost -DRSTUDIO_BOOST_SIGNALS_VERSION=2 -DRSTUDIO_UNIT_TESTS_ENABLED -DWEBSOCKETPP_STRICT_MASKING -D_FORTIFY_SOURCE=2 -D_WEBSOCKETPP_NO_CPP11_MEMORY_=1 -DSTRIPPED_FILENAME=\"src/cpp/session/postback/PostbackMain.cpp\" -I/wrkdirs/usr/ports/devel/RStudio/work-desktop/rstudio-1.4.1717/src/cpp/session/include -I/usr/local/lib/R/include -I/wrkdirs/usr/ports/devel/RStudio/work-desktop/rstudio-1.4.1717/src/cpp/core/include -I/include -I/wrkdirs/usr/ports/devel/RStudio/work-desktop/rstudio-1.4.1717/src/cpp/shared_core/include -I/wrkdirs/usr/ports/devel/RStudio/work-desktop/rstudio-1.4.1717/src/cpp/ext -I/wrkdirs/usr/ports/devel/RStudio/work-desktop/rstudio-1.4.1717/src/cpp/monitor/include -I/wrkdirs/usr/ports/devel/RStudio/work-desktop/rstudio-1.4.1717/src/cpp/r/include -I/wr
 kdirs/usr/ports/devel/RStudio/work-desktop/.build/src/cpp/session -I/wrkdirs/usr/ports/devel/RStudio/work-desktop/rstudio-1.4.1717/src/cpp/tests/cpp -isystem /opt/rstudio-tools/amd64/crashpad -isystem /opt/rstudio-tools/amd64/crashpad/crashpad -isystem /opt/rstudio-tools/amd64/crashpad/crashpad/third_party/mini_chromium/mini_chromium -isystem /usr/include/postgresql -isystem /usr/include/pgsql -O2 -pipe -fstack-protector-strong -isystem /usr/local/include -fno-strict-aliasing  -isystem /usr/local/include -std=c++0x -std=c++11 -O2 -pipe -fstack-protector-strong -isystem /usr/local/include -fno-strict-aliasing  -isystem /usr/local/include -fPIE   -Wall -pthread -Werror=return-type -Wformat -Wformat-security -fstack-protector --param ssp-buffer-size=4 -fPIC -MD -MT src/cpp/session/postback/CMakeFiles/rpostback.dir/PostbackMain.cpp.o -MF CMakeFiles/rpostback.dir/PostbackMain.cpp.o.d -o CMakeFiles/rpostback.dir/PostbackMain.cpp.o -c /wrkdirs/usr/ports/devel/RStudio/work-desktop/rstudio-1
 .4.1717/src/cpp/session/postback/PostbackMai!
 n.cpp
[100%] Building CXX object src/cpp/session/postback/CMakeFiles/rpostback.dir/PostbackOptions.cpp.o
cd /wrkdirs/usr/ports/devel/RStudio/work-desktop/.build/src/cpp/session/postback && /usr/bin/c++ -DBOOST_ASIO_DISABLE_KQUEUE -DBOOST_ENABLE_ASSERT_HANDLER -DBOOST_SIGNALS_NO_DEPRECATION_WARNING -DRSTUDIO_BOOST_NAMESPACE=boost -DRSTUDIO_BOOST_SIGNALS_VERSION=2 -DRSTUDIO_UNIT_TESTS_ENABLED -DWEBSOCKETPP_STRICT_MASKING -D_FORTIFY_SOURCE=2 -D_WEBSOCKETPP_NO_CPP11_MEMORY_=1 -DSTRIPPED_FILENAME=\"src/cpp/session/postback/PostbackOptions.cpp\" -I/wrkdirs/usr/ports/devel/RStudio/work-desktop/rstudio-1.4.1717/src/cpp/session/include -I/usr/local/lib/R/include -I/wrkdirs/usr/ports/devel/RStudio/work-desktop/rstudio-1.4.1717/src/cpp/core/include -I/include -I/wrkdirs/usr/ports/devel/RStudio/work-desktop/rstudio-1.4.1717/src/cpp/shared_core/include -I/wrkdirs/usr/ports/devel/RStudio/work-desktop/rstudio-1.4.1717/src/cpp/ext -I/wrkdirs/usr/ports/devel/RStudio/work-desktop/rstudio-1.4.1717/src/cpp/monitor/include -I/wrkdirs/usr/ports/devel/RStudio/work-desktop/rstudio-1.4.1717/src/cpp/r/include -I
 /wrkdirs/usr/ports/devel/RStudio/work-desktop/.build/src/cpp/session -I/wrkdirs/usr/ports/devel/RStudio/work-desktop/rstudio-1.4.1717/src/cpp/tests/cpp -isystem /opt/rstudio-tools/amd64/crashpad -isystem /opt/rstudio-tools/amd64/crashpad/crashpad -isystem /opt/rstudio-tools/amd64/crashpad/crashpad/third_party/mini_chromium/mini_chromium -isystem /usr/include/postgresql -isystem /usr/include/pgsql -O2 -pipe -fstack-protector-strong -isystem /usr/local/include -fno-strict-aliasing  -isystem /usr/local/include -std=c++0x -std=c++11 -O2 -pipe -fstack-protector-strong -isystem /usr/local/include -fno-strict-aliasing  -isystem /usr/local/include -fPIE   -Wall -pthread -Werror=return-type -Wformat -Wformat-security -fstack-protector --param ssp-buffer-size=4 -fPIC -MD -MT src/cpp/session/postback/CMakeFiles/rpostback.dir/PostbackOptions.cpp.o -MF CMakeFiles/rpostback.dir/PostbackOptions.cpp.o.d -o CMakeFiles/rpostback.dir/PostbackOptions.cpp.o -c /wrkdirs/usr/ports/devel/RStudio/work-deskt
 op/rstudio-1.4.1717/src/cpp/session/postback!
 /PostbackOptions.cpp
[100%] Linking CXX executable postback/rpostback
cd /wrkdirs/usr/ports/devel/RStudio/work-desktop/.build/src/cpp/session/postback && /usr/local/bin/cmake -E cmake_link_script CMakeFiles/rpostback.dir/link.txt --verbose=1
/usr/bin/c++ -O2 -pipe -fstack-protector-strong -isystem /usr/local/include -fno-strict-aliasing  -isystem /usr/local/include -std=c++0x -std=c++11 -O2 -pipe -fstack-protector-strong -isystem /usr/local/include -fno-strict-aliasing  -isystem /usr/local/include  -Wl,-rpath=/usr/local/lib/gcc10  -L/usr/local/lib/gcc10 -B/usr/local/bin -L/usr/local/lib  -fstack-protector-strong -L/usr/local/lib -pie -Wl,-z,relro,-z,now CMakeFiles/rpostback.dir/PostbackMain.cpp.o CMakeFiles/rpostback.dir/PostbackOptions.cpp.o -o postback/rpostback  ../../core/librstudio-core.a -lprocstat ../../shared_core/librstudio-shared-core.a ../../core/spelling/hunspell/librstudio-core-hunspell.a /usr/local/lib/libboost_atomic.so /usr/local/lib/libboost_chrono.so /usr/local/lib/libboost_date_time.so /usr/local/lib/libboost_filesystem.so /usr/local/lib/libboost_iostreams.so /usr/local/lib/libboost_program_options.so /usr/local/lib/libboost_random.so /usr/local/lib/libboost_regex.so /usr/local/lib/libboost_system.so /
 usr/local/lib/libboost_thread.so -pthread /usr/local/lib/libsoci_sqlite3.so /usr/local/lib/libsoci_postgresql.so /usr/local/lib/libsqlite3.so.0.8.6 /usr/local/lib/libpq.so.5 /usr/local/lib/libsoci_core.so /usr/lib/libdl.so /usr/lib/libpthread.so /usr/lib/libutil.so /usr/local/lib/libuuid.so /usr/lib/librt.so /usr/lib/libz.so /usr/lib/libssl.so /usr/lib/libcrypto.so /usr/local/lib/libyaml-cpp.so.0.6.3 
[100%] Built target rpostback
/usr/local/bin/cmake -E cmake_progress_start /wrkdirs/usr/ports/devel/RStudio/work-desktop/.build/CMakeFiles 0
===========================================================================
=======================<phase: run-depends    >============================
===>   RStudio-1.4.1717 depends on executable: gfortran10 - found
===>   RStudio-1.4.1717 depends on executable: update-desktop-database - found
===>   RStudio-1.4.1717 depends on executable: update-mime-database - found
===>   RStudio-1.4.1717 depends on file: /usr/local/lib/qt5/qml/QtQuick/Controls/qmldir - found
===========================================================================
=======================<phase: stage          >============================
===>  Staging for RStudio-1.4.1717
===>   Generating temporary packing list
/usr/local/bin/cmake -S/wrkdirs/usr/ports/devel/RStudio/work-desktop/rstudio-1.4.1717 -B/wrkdirs/usr/ports/devel/RStudio/work-desktop/.build --check-build-system CMakeFiles/Makefile.cmake 0
/usr/local/bin/cmake -E cmake_progress_start /wrkdirs/usr/ports/devel/RStudio/work-desktop/.build/CMakeFiles /wrkdirs/usr/ports/devel/RStudio/work-desktop/.build//CMakeFiles/progress.marks
/usr/bin/make  -f CMakeFiles/Makefile2 all
/usr/bin/make  -f src/gwt/CMakeFiles/gwt_build.dir/build.make src/gwt/CMakeFiles/gwt_build.dir/depend
cd /wrkdirs/usr/ports/devel/RStudio/work-desktop/.build && /usr/local/bin/cmake -E cmake_depends "Unix Makefiles" /wrkdirs/usr/ports/devel/RStudio/work-desktop/rstudio-1.4.1717 /wrkdirs/usr/ports/devel/RStudio/work-desktop/rstudio-1.4.1717/src/gwt /wrkdirs/usr/ports/devel/RStudio/work-desktop/.build /wrkdirs/usr/ports/devel/RStudio/work-desktop/.build/src/gwt /wrkdirs/usr/ports/devel/RStudio/work-desktop/.build/src/gwt/CMakeFiles/gwt_build.dir/DependInfo.cmake
/usr/bin/make  -f src/gwt/CMakeFiles/gwt_build.dir/build.make src/gwt/CMakeFiles/gwt_build.dir/build
cd /wrkdirs/usr/ports/devel/RStudio/work-desktop/rstudio-1.4.1717/src/gwt && /usr/local/bin/ant -Dbuild.dir="bin" -Dwww.dir="www" -Dextras.dir="extras" -Dlib.dir="lib" -Dgwt.main.module="org.rstudio.studio.RStudio"
Buildfile: /wrkdirs/usr/ports/devel/RStudio/work-desktop/rstudio-1.4.1717/src/gwt/build.xml

ext:
   [jscomp] None of the files changed. Compilation skipped.

javac:
    [javac] Compiling 1 source file to /wrkdirs/usr/ports/devel/RStudio/work-desktop/rstudio-1.4.1717/src/gwt/bin

gwtc:

panmirror:
     [exec] node:internal/modules/cjs/loader:944
     [exec]   throw err;
     [exec]   ^
     [exec] 
     [exec] Error: Cannot find module 'fuse-box/sparky'
     [exec] Require stack:
     [exec] - /wrkdirs/usr/ports/devel/RStudio/work-desktop/rstudio-1.4.1717/src/gwt/panmirror/src/editor/fuse.js
     [exec]     at Function.Module._resolveFilename (node:internal/modules/cjs/loader:941:15)
     [exec]     at Function.Module._load (node:internal/modules/cjs/loader:774:27)
     [exec]     at Module.require (node:internal/modules/cjs/loader:1013:19)
     [exec]     at require (node:internal/modules/cjs/helpers:93:18)
     [exec]     at Object.<anonymous> (/wrkdirs/usr/ports/devel/RStudio/work-desktop/rstudio-1.4.1717/src/gwt/panmirror/src/editor/fuse.js:16:27)
     [exec]     at Module._compile (node:internal/modules/cjs/loader:1109:14)
     [exec]     at Object.Module._extensions..js (node:internal/modules/cjs/loader:1138:10)
     [exec]     at Module.load (node:internal/modules/cjs/loader:989:32)
     [exec]     at Function.Module._load (node:internal/modules/cjs/loader:829:14)
     [exec]     at Function.executeUserEntryPoint [as runMain] (node:internal/modules/run_main:76:12) {
     [exec]   code: 'MODULE_NOT_FOUND',
     [exec]   requireStack: [
     [exec]     '/wrkdirs/usr/ports/devel/RStudio/work-desktop/rstudio-1.4.1717/src/gwt/panmirror/src/editor/fuse.js'
     [exec]   ]
     [exec] }
     [exec] Result: 1
     [java] Compiling module org.rstudio.studio.RStudio
     [java]    Computing all possible rebind results for 'org.rstudio.studio.client.workbench.views.environment.view.MemoryUsageSummary.Binder'
     [java]       Rebinding org.rstudio.studio.client.workbench.views.environment.view.MemoryUsageSummary.Binder
     [java]          Invoking generator com.google.gwt.uibinder.rebind.UiBinderGenerator
     [java]             [ERROR] Error opening resource:file:/wrkdirs/usr/ports/devel/RStudio/work-desktop/rstudio-1.4.1717/src/gwt/src/org/rstudio/studio/client/workbench/views/environment/view/MemoryUsageSummary.ui.xml
     [java]    [ERROR] Errors in 'org/rstudio/studio/client/workbench/views/environment/view/MemoryUsageSummary.java'
     [java]       [ERROR] Line 59: Failed to resolve 'org.rstudio.studio.client.workbench.views.environment.view.MemoryUsageSummary.Binder' via deferred binding
     [java]    Computing all possible rebind results for 'org.rstudio.studio.client.workbench.views.jobs.view.JobItem.JobItemUiBinder'
     [java]       Rebinding org.rstudio.studio.client.workbench.views.jobs.view.JobItem.JobItemUiBinder
     [java]          Invoking generator com.google.gwt.uibinder.rebind.UiBinderGenerator
     [java]             [ERROR] Error opening resource:file:/wrkdirs/usr/ports/devel/RStudio/work-desktop/rstudio-1.4.1717/src/gwt/src/org/rstudio/studio/client/workbench/views/jobs/view/JobItem.ui.xml
     [java]    [ERROR] Errors in 'org/rstudio/studio/client/workbench/views/jobs/view/JobItem.java'
     [java]       [ERROR] Line 52: Failed to resolve 'org.rstudio.studio.client.workbench.views.jobs.view.JobItem.JobItemUiBinder' via deferred binding
     [java]    [WARN] For the following type(s), generated source was never committed (did you forget to call commit()?)
     [java]       [WARN] org.rstudio.studio.client.workbench.views.environment.view.MemoryUsageSummary_BinderImpl
     [java]       [WARN] org.rstudio.studio.client.workbench.views.jobs.view.JobItem_JobItemUiBinderImpl

BUILD FAILED
/wrkdirs/usr/ports/devel/RStudio/work-desktop/rstudio-1.4.1717/src/gwt/build.xml:147: Java returned: 1

Total time: 25 seconds
*** Error code 1

Stop.
make[3]: stopped in /wrkdirs/usr/ports/devel/RStudio/work-desktop/.build
*** Error code 1

Stop.
make[2]: stopped in /wrkdirs/usr/ports/devel/RStudio/work-desktop/.build
*** Error code 1

Stop.
make[1]: stopped in /wrkdirs/usr/ports/devel/RStudio/work-desktop/.build
*** Error code 1

Stop.
make: stopped in /usr/ports/devel/RStudio
Received on Sat Jun 19 2021 - 16:12:42 UTC

Original text of this message