[package - main-i386-default][audio/oss] Failed for oss-4.2.b2019_2 in build

From: <pkg-fallout_at_FreeBSD.org>
Date: Sat, 19 Jun 2021 12:28:34 GMT
You are receiving this mail as a port that you maintain
is failing to build on the FreeBSD package build server.
Please investigate the failure and submit a PR to fix
build.

Maintainer:     crees_at_FreeBSD.org
Log URL:        http://beefy17.nyi.freebsd.org/data/main-i386-default/p7e413d93a62b_s5f88df77a6/logs/oss-4.2.b2019_2.log
Build URL:      http://beefy17.nyi.freebsd.org/build.html?mastername=main-i386-default&build=p7e413d93a62b_s5f88df77a6
Log:

=>> Building audio/oss
build started at Sat Jun 19 12:27:31 UTC 2021
port directory: /usr/ports/audio/oss
package name: oss-4.2.b2019_2
building for: FreeBSD main-i386-default-job-08 14.0-CURRENT FreeBSD 14.0-CURRENT 1400024 i386
maintained by: crees_at_FreeBSD.org
Makefile ident: 
Poudriere version: 3.2.8-8-gaf08dbda
Host OSVERSION: 1400008
Jail OSVERSION: 1400024
Job Id: 08




!!! Jail is newer than host. (Jail: 1400024, Host: 1400008) !!!
!!! This is not supported. !!!
!!! Host kernel must be same or newer than jail. !!!
!!! Expect build failures. !!!



---Begin Environment---
SHELL=/bin/csh
UNAME_p=i386
UNAME_m=i386
OSVERSION=1400024
UNAME_v=FreeBSD 14.0-CURRENT 1400024
UNAME_r=14.0-CURRENT
BLOCKSIZE=K
MAIL=/var/mail/root
MM_CHARSET=UTF-8
LANG=C.UTF-8
STATUS=1
HOME=/root
PATH=/sbin:/bin:/usr/sbin:/usr/bin:/usr/local/sbin:/usr/local/bin:/root/bin
LOCALBASE=/usr/local
USER=root
LIBEXECPREFIX=/usr/local/libexec/poudriere
POUDRIERE_VERSION=3.2.8-8-gaf08dbda
MASTERMNT=/usr/local/poudriere/data/.m/main-i386-default/ref
POUDRIERE_BUILD_TYPE=bulk
PACKAGE_BUILDING=yes
SAVED_TERM=
PWD=/usr/local/poudriere/data/.m/main-i386-default/ref/.p/pool
P_PORTS_FEATURES=FLAVORS SELECTED_OPTIONS
MASTERNAME=main-i386-default
SCRIPTPREFIX=/usr/local/share/poudriere
OLDPWD=/usr/local/poudriere/data/.m/main-i386-default/ref/.p
SCRIPTPATH=/usr/local/share/poudriere/bulk.sh
POUDRIEREPATH=/usr/local/bin/poudriere
---End Environment---

---Begin Poudriere Port Flags/Env---
PORT_FLAGS=
PKGENV=
FLAVOR=
DEPENDS_ARGS=
MAKE_ARGS=
---End Poudriere Port Flags/Env---

---Begin OPTIONS List---
===> The following configuration options are available for oss-4.2.b2019_2:
     VORBIS=on: Ogg Vorbis audio codec support
===> Use 'make config' to modify these settings
---End OPTIONS List---

--MAINTAINER--
crees_at_FreeBSD.org
--End MAINTAINER--

--CONFIGURE_ARGS--

--End CONFIGURE_ARGS--

--CONFIGURE_ENV--
HOSTCC="cc" OGG_SUPPORT=YES PKG_CONFIG=pkgconf XDG_DATA_HOME=/wrkdirs/usr/ports/audio/oss/work  XDG_CONFIG_HOME=/wrkdirs/usr/ports/audio/oss/work  HOME=/wrkdirs/usr/ports/audio/oss/work TMPDIR="/tmp" PATH=/wrkdirs/usr/ports/audio/oss/work/.bin:/sbin:/bin:/usr/sbin:/usr/bin:/usr/local/sbin:/usr/local/bin:/root/bin SHELL=/bin/sh CONFIG_SHELL=/bin/sh LANG=en_US.UTF-8 LC_ALL=en_US.UTF-8
--End CONFIGURE_ENV--

--MAKE_ENV--
KMODDIR="/usr/local/lib/oss/modules" SYSDIR="/usr/src/sys" NO_XREF=yes XDG_DATA_HOME=/wrkdirs/usr/ports/audio/oss/work  XDG_CONFIG_HOME=/wrkdirs/usr/ports/audio/oss/work  HOME=/wrkdirs/usr/ports/audio/oss/work TMPDIR="/tmp" PATH=/wrkdirs/usr/ports/audio/oss/work/.bin:/sbin:/bin:/usr/sbin:/usr/bin:/usr/local/sbin:/usr/local/bin:/root/bin NO_PIE=yes MK_DEBUG_FILES=no MK_KERNEL_SYMBOLS=no SHELL=/bin/sh NO_LINT=YES ADDR2LINE="/usr/local/bin/addr2line" AR="/usr/local/bin/ar" AS="/usr/local/bin/as" CPPFILT="/usr/local/bin/c++filt" GPROF="/usr/local/bin/gprof" LD="/usr/local/bin/ld" NM="/usr/local/bin/nm" OBJCOPY="/usr/local/bin/objcopy" OBJDUMP="/usr/local/bin/objdump" RANLIB="/usr/local/bin/ranlib" READELF="/usr/local/bin/readelf" SIZE="/usr/local/bin/size" STRINGS="/usr/local/bin/strings" LANG=en_US.UTF-8 LC_ALL=en_US.UTF-8 PREFIX=/usr/local  LOCALBASE=/usr/local  CC="cc" CFLAGS="-O2 -pipe  -fno-strict-aliasing "  CPP="cpp" CPPFLAGS=""  LDFLAGS=" -fuse-ld=bfd " LIBS=""  CXX="c++" CXXFLAG
 S="-O2 -pipe -fno-strict-aliasing  "  MANPREFIX="/usr/local" BSD_INSTALL_PROGRAM="install  -s -m 555"  BSD_INSTALL_LIB="install  -s -m 0644"  BSD_INSTALL_SCRIPT="install  -m 555"  BSD_INSTALL_DATA="install  -m 0644"  BSD_INSTALL_MAN="install  -m 444"
--End MAKE_ENV--

--PLIST_SUB--
GTK2_VERSION="2.10.0"  GTK3_VERSION="3.0.0"  GTK4_VERSION="4.0.0" KMODDIR="usr/local/lib/oss/modules" OSREL=14.0 PREFIX=%D LOCALBASE=/usr/local  RESETPREFIX=/usr/local LIB32DIR=lib DOCSDIR="share/doc/oss"  EXAMPLESDIR="share/examples/oss"  DATADIR="share/oss"  WWWDIR="www/oss"  ETCDIR="etc/oss"
--End PLIST_SUB--

--SUB_LIST--
PREFIX=/usr/local LOCALBASE=/usr/local  DATADIR=/usr/local/share/oss DOCSDIR=/usr/local/share/doc/oss EXAMPLESDIR=/usr/local/share/examples/oss  WWWDIR=/usr/local/www/oss ETCDIR=/usr/local/etc/oss
--End SUB_LIST--

---Begin make.conf---
USE_PACKAGE_DEPENDS=yes
BATCH=yes
WRKDIRPREFIX=/wrkdirs
PORTSDIR=/usr/ports
PACKAGES=/packages
DISTDIR=/distfiles
PACKAGE_BUILDING=yes
PACKAGE_BUILDING_FLAVORS=yes
MACHINE=i386
MACHINE_ARCH=i386
ARCH=${MACHINE_ARCH}
#### /usr/local/etc/poudriere.d/make.conf ####
# XXX: We really need this but cannot use it while 'make checksum' does not
# try the next mirror on checksum failure.  It currently retries the same
# failed mirror and then fails rather then trying another.  It *does*
# try the next if the size is mismatched though.
#MASTER_SITE_FREEBSD=yes
# Build ALLOW_MAKE_JOBS_PACKAGES with 2 jobs
MAKE_JOBS_NUMBER=2
#### /usr/ports/Mk/Scripts/ports_env.sh ####
_CCVERSION_921dbbb2=FreeBSD clang version 12.0.0 (git_at_github.com:llvm/llvm-project.git llvmorg-12.0.0-0-gd28af7c654d8) Target: i386-unknown-freebsd14.0 Thread model: posix InstalledDir: /usr/bin
_ALTCCVERSION_921dbbb2=none
_CXXINTERNAL_acaad9ca=FreeBSD clang version 12.0.0 (git_at_github.com:llvm/llvm-project.git llvmorg-12.0.0-0-gd28af7c654d8) Target: i386-unknown-freebsd14.0 Thread model: posix InstalledDir: /usr/bin "/usr/bin/ld" "--eh-frame-hdr" "-dynamic-linker" "/libexec/ld-elf.so.1" "--hash-style=both" "--enable-new-dtags" "-m" "elf_i386_fbsd" "-o" "a.out" "/usr/lib/crt1.o" "/usr/lib/crti.o" "/usr/lib/crtbegin.o" "-L/usr/lib" "/dev/null" "-lc++" "-lm" "-lgcc" "--as-needed" "-lgcc_s" "--no-as-needed" "-lc" "-lgcc" "--as-needed" "-lgcc_s" "--no-as-needed" "/usr/lib/crtend.o" "/usr/lib/crtn.o"
CC_OUTPUT_921dbbb2_58173849=yes
CC_OUTPUT_921dbbb2_9bdba57c=yes
CC_OUTPUT_921dbbb2_6a4fe7f5=yes
CC_OUTPUT_921dbbb2_6bcac02b=yes
CC_OUTPUT_921dbbb2_67d20829=yes
CC_OUTPUT_921dbbb2_bfa62e83=yes
CC_OUTPUT_921dbbb2_f0b4d593=yes
CC_OUTPUT_921dbbb2_308abb44=yes
CC_OUTPUT_921dbbb2_f00456e5=yes
CC_OUTPUT_921dbbb2_65ad290d=yes
CC_OUTPUT_921dbbb2_f2776b26=yes
CC_OUTPUT_921dbbb2_b2657cc3=yes
CC_OUTPUT_921dbbb2_380987f7=yes
CC_OUTPUT_921dbbb2_160933ec=yes
CC_OUTPUT_921dbbb2_fb62803b=yes
_OBJC_CCVERSION_921dbbb2=FreeBSD clang version 12.0.0 (git_at_github.com:llvm/llvm-project.git llvmorg-12.0.0-0-gd28af7c654d8) Target: i386-unknown-freebsd14.0 Thread model: posix InstalledDir: /usr/bin
_OBJC_ALTCCVERSION_921dbbb2=none
ARCH=i386
OPSYS=FreeBSD
_OSRELEASE=14.0-CURRENT
OSREL=14.0
OSVERSION=1400024
PYTHONBASE=/usr/local
CONFIGURE_MAX_CMD_LEN=524288
HAVE_PORTS_ENV=1
#### Misc Poudriere ####
GID=0
UID=0
---End make.conf---
--Resource limits--
cpu time               (seconds, -t)  unlimited
file size           (512-blocks, -f)  unlimited
data seg size           (kbytes, -d)  524288
stack size              (kbytes, -s)  65536
core file size      (512-blocks, -c)  unlimited
max memory size         (kbytes, -m)  unlimited
locked memory           (kbytes, -l)  unlimited
max user processes              (-u)  89999
open files                      (-n)  1024
virtual mem size        (kbytes, -v)  unlimited
swap limit              (kbytes, -w)  unlimited
socket buffer size       (bytes, -b)  unlimited
pseudo-terminals                (-p)  unlimited
kqueues                         (-k)  unlimited
umtx shared locks               (-o)  unlimited
--End resource limits--
=======================<phase: check-sanity   >============================
===>  License BSD2CLAUSE accepted by the user
===========================================================================
=======================<phase: pkg-depends    >============================
===>   oss-4.2.b2019_2 depends on file: /usr/local/sbin/pkg - not found
===>   Installing existing package /packages/All/pkg-1.16.3.txz
[main-i386-default-job-08] Installing pkg-1.16.3...
[main-i386-default-job-08] Extracting pkg-1.16.3: .......... done
===>   oss-4.2.b2019_2 depends on file: /usr/local/sbin/pkg - found
===>   Returning to build of oss-4.2.b2019_2
===========================================================================
=======================<phase: fetch-depends  >============================
===========================================================================
=======================<phase: fetch          >============================
===>  License BSD2CLAUSE accepted by the user
===> Fetching all distfiles required by oss-4.2.b2019_2 for building
===========================================================================
=======================<phase: checksum       >============================
===>  License BSD2CLAUSE accepted by the user
===> Fetching all distfiles required by oss-4.2.b2019_2 for building
=> SHA256 Checksum OK for oss-v4.2-build2019-src-bsd.tar.bz2.
===========================================================================
=======================<phase: extract-depends>============================
===========================================================================
=======================<phase: extract        >============================
===>  License BSD2CLAUSE accepted by the user
===> Fetching all distfiles required by oss-4.2.b2019_2 for building
===>  Extracting for oss-4.2.b2019_2
=> SHA256 Checksum OK for oss-v4.2-build2019-src-bsd.tar.bz2.
===========================================================================
=======================<phase: patch-depends  >============================
===========================================================================
=======================<phase: patch          >============================
===>  Patching for oss-4.2.b2019_2
/usr/bin/find /wrkdirs/usr/ports/audio/oss/work/oss-v4.2-build2019-src-bsd -name '*.man' -or  \( -name '*.[ch]' \! -name ossmkdep.c \) |  /usr/bin/xargs /usr/bin/sed -i.bak -e 's|/usr/|/usr/local/|g'  -e 's|/etc/oss|/usr/local/etc/oss|g'
===>  Applying FreeBSD patches for oss-4.2.b2019_2 from /usr/ports/audio/oss/files
/usr/bin/sed -i.bak -e 's|%%LOCALBASE%%|/usr/local|g'  /wrkdirs/usr/ports/audio/oss/work/oss-v4.2-build2019-src-bsd/setup/srcconf.c
/usr/bin/find /wrkdirs/usr/ports/audio/oss/work/oss-v4.2-build2019-src-bsd -name configure -or  -name make.local -or -name soundoff -or -name soundon |  /usr/bin/xargs /usr/bin/sed -i.bak -e 's|%%PREFIX%%|/usr/local|g'
<snip>
gawk: cmd. line:116: warning: regexp escape sequence `\;' is not a known regexp operator
Check devices for oss_digi96
gawk: cmd. line:58: warning: regexp escape sequence `\o' is not a known regexp operator
gawk: cmd. line:116: warning: regexp escape sequence `\,' is not a known regexp operator
gawk: cmd. line:116: warning: regexp escape sequence `\;' is not a known regexp operator
Check devices for oss_emu10k1x
gawk: cmd. line:58: warning: regexp escape sequence `\o' is not a known regexp operator
gawk: cmd. line:116: warning: regexp escape sequence `\,' is not a known regexp operator
gawk: cmd. line:116: warning: regexp escape sequence `\;' is not a known regexp operator
Check devices for oss_envy24
gawk: cmd. line:58: warning: regexp escape sequence `\o' is not a known regexp operator
gawk: cmd. line:116: warning: regexp escape sequence `\,' is not a known regexp operator
gawk: cmd. line:116: warning: regexp escape sequence `\;' is not a known regexp operator
Check devices for oss_envy24ht
gawk: cmd. line:58: warning: regexp escape sequence `\o' is not a known regexp operator
gawk: cmd. line:116: warning: regexp escape sequence `\,' is not a known regexp operator
gawk: cmd. line:116: warning: regexp escape sequence `\;' is not a known regexp operator
Check devices for oss_fmedia
gawk: cmd. line:58: warning: regexp escape sequence `\o' is not a known regexp operator
gawk: cmd. line:116: warning: regexp escape sequence `\,' is not a known regexp operator
gawk: cmd. line:116: warning: regexp escape sequence `\;' is not a known regexp operator
Check devices for oss_geode
gawk: cmd. line:58: warning: regexp escape sequence `\o' is not a known regexp operator
gawk: cmd. line:116: warning: regexp escape sequence `\,' is not a known regexp operator
gawk: cmd. line:116: warning: regexp escape sequence `\;' is not a known regexp operator
Check devices for oss_hdaudio
gawk: cmd. line:58: warning: regexp escape sequence `\o' is not a known regexp operator
gawk: cmd. line:116: warning: regexp escape sequence `\,' is not a known regexp operator
gawk: cmd. line:116: warning: regexp escape sequence `\;' is not a known regexp operator
Check devices for oss_ich
gawk: cmd. line:58: warning: regexp escape sequence `\o' is not a known regexp operator
gawk: cmd. line:116: warning: regexp escape sequence `\,' is not a known regexp operator
gawk: cmd. line:116: warning: regexp escape sequence `\;' is not a known regexp operator
Check devices for oss_imux
gawk: cmd. line:58: warning: regexp escape sequence `\o' is not a known regexp operator
gawk: cmd. line:116: warning: regexp escape sequence `\,' is not a known regexp operator
gawk: cmd. line:116: warning: regexp escape sequence `\;' is not a known regexp operator
Check devices for oss_madi
gawk: cmd. line:58: warning: regexp escape sequence `\o' is not a known regexp operator
gawk: cmd. line:116: warning: regexp escape sequence `\,' is not a known regexp operator
gawk: cmd. line:116: warning: regexp escape sequence `\;' is not a known regexp operator
Check devices for oss_midiloop
gawk: cmd. line:58: warning: regexp escape sequence `\o' is not a known regexp operator
gawk: cmd. line:116: warning: regexp escape sequence `\,' is not a known regexp operator
gawk: cmd. line:116: warning: regexp escape sequence `\;' is not a known regexp operator
Check devices for oss_midimix
gawk: cmd. line:58: warning: regexp escape sequence `\o' is not a known regexp operator
gawk: cmd. line:116: warning: regexp escape sequence `\,' is not a known regexp operator
gawk: cmd. line:116: warning: regexp escape sequence `\;' is not a known regexp operator
Check devices for oss_sblive
gawk: cmd. line:58: warning: regexp escape sequence `\o' is not a known regexp operator
gawk: cmd. line:116: warning: regexp escape sequence `\,' is not a known regexp operator
gawk: cmd. line:116: warning: regexp escape sequence `\;' is not a known regexp operator
Check devices for oss_sbpci
gawk: cmd. line:58: warning: regexp escape sequence `\o' is not a known regexp operator
gawk: cmd. line:116: warning: regexp escape sequence `\,' is not a known regexp operator
gawk: cmd. line:116: warning: regexp escape sequence `\;' is not a known regexp operator
Check devices for oss_sbxfi
gawk: cmd. line:58: warning: regexp escape sequence `\o' is not a known regexp operator
gawk: cmd. line:116: warning: regexp escape sequence `\,' is not a known regexp operator
gawk: cmd. line:116: warning: regexp escape sequence `\;' is not a known regexp operator
Check devices for oss_solo
gawk: cmd. line:58: warning: regexp escape sequence `\o' is not a known regexp operator
gawk: cmd. line:116: warning: regexp escape sequence `\,' is not a known regexp operator
gawk: cmd. line:116: warning: regexp escape sequence `\;' is not a known regexp operator
Check devices for oss_trident
gawk: cmd. line:58: warning: regexp escape sequence `\o' is not a known regexp operator
gawk: cmd. line:116: warning: regexp escape sequence `\,' is not a known regexp operator
gawk: cmd. line:116: warning: regexp escape sequence `\;' is not a known regexp operator
Check devices for oss_userdev
gawk: cmd. line:58: warning: regexp escape sequence `\o' is not a known regexp operator
gawk: cmd. line:116: warning: regexp escape sequence `\,' is not a known regexp operator
gawk: cmd. line:116: warning: regexp escape sequence `\;' is not a known regexp operator
Check devices for oss_via823x
gawk: cmd. line:58: warning: regexp escape sequence `\o' is not a known regexp operator
gawk: cmd. line:116: warning: regexp escape sequence `\,' is not a known regexp operator
gawk: cmd. line:116: warning: regexp escape sequence `\;' is not a known regexp operator
Check devices for oss_via97
gawk: cmd. line:58: warning: regexp escape sequence `\o' is not a known regexp operator
gawk: cmd. line:116: warning: regexp escape sequence `\,' is not a known regexp operator
gawk: cmd. line:116: warning: regexp escape sequence `\;' is not a known regexp operator
Check devices for oss_ymf7xx
gawk: cmd. line:58: warning: regexp escape sequence `\o' is not a known regexp operator
gawk: cmd. line:116: warning: regexp escape sequence `\,' is not a known regexp operator
gawk: cmd. line:116: warning: regexp escape sequence `\;' is not a known regexp operator
gawk: cmd. line:58: warning: regexp escape sequence `\o' is not a known regexp operator
gawk: cmd. line:116: warning: regexp escape sequence `\,' is not a known regexp operator
gawk: cmd. line:116: warning: regexp escape sequence `\;' is not a known regexp operator
--- install ---
cd prototype/usr/local/lib/oss/build && sh install.sh
Compiling module osscore
Compiling osscore module failed
--- machine ---
--- x86 ---
--- machine ---
machine -> /usr/src/sys/i386/include
--- x86 ---
x86 -> /usr/src/sys/x86/include
--- objwarn ---
--- opt_global.h ---
--- objwarn ---
Warning: Object directory not changed from original /wrkdirs/usr/ports/audio/oss/work/.build/prototype/usr/local/lib/oss/build
--- device_if.h ---
--- opt_global.h ---
touch opt_global.h
--- bus_if.h ---
--- device_if.h ---
awk -f /usr/src/sys/tools/makeobjops.awk /usr/src/sys/kern/device_if.m -h
--- bus_if.h ---
awk -f /usr/src/sys/tools/makeobjops.awk /usr/src/sys/kern/bus_if.m -h
--- pci_if.h ---
awk -f /usr/src/sys/tools/makeobjops.awk /usr/src/sys/dev/pci/pci_if.m -h
--- osscore.o ---
cc  -O2 -pipe -fno-strict-aliasing  -Werror -D_KERNEL -DKLD_MODULE -nostdinc   -include /wrkdirs/usr/ports/audio/oss/work/.build/prototype/usr/local/lib/oss/build/opt_global.h -I. -I/usr/src/sys -I/usr/src/sys/contrib/ck/include -fno-common  -fdebug-prefix-map=./machine=/usr/src/sys/i386/include -fdebug-prefix-map=./x86=/usr/src/sys/x86/include     -MD  -MF.depend.osscore.o -MTosscore.o -mno-mmx -mno-sse -msoft-float -ffreestanding -fwrapv -fstack-protector -Wall -Wredundant-decls -Wnested-externs -Wstrict-prototypes -Wmissing-prototypes -Wpointer-arith -Wcast-qual -Wundef -Wno-pointer-sign -D__printf__=__freebsd_kprintf__ -Wmissing-include-dirs -fdiagnostics-show-option -Wno-unknown-pragmas -Wno-error=tautological-compare -Wno-error=empty-body -Wno-error=parentheses-equality -Wno-error=unused-function -Wno-error=pointer-sign -Wno-error=shift-negative-value -Wno-address-of-packed-member -Wno-format-zero-length   -mno-aes -mno-avx  -std=iso9899:1999 -c osscore.c -o osscore.o
osscore.c:150:38: error: incompatible pointer types passing 'dev_info_t *' (aka 'struct device *') to parameter of type 'device_t' (aka 'struct _device *') [-Werror,-Wincompatible-pointer-types]
  intr->irqres = bus_alloc_resource (osdev->dip, SYS_RES_IRQ, &(intr->irqid),
                                     ^~~~~~~~~~
/usr/src/sys/sys/bus.h:517:46: note: passing argument to parameter 'dev' here
struct  resource *bus_alloc_resource(device_t dev, int type, int *rid,
                                              ^
osscore.c:159:31: error: incompatible pointer types passing 'dev_info_t *' (aka 'struct device *') to parameter of type 'device_t' (aka 'struct _device *') [-Werror,-Wincompatible-pointer-types]
  intr->irq = bus_setup_intr (osdev->dip, intr->irqres,
                              ^~~~~~~~~~
/usr/src/sys/sys/bus.h:537:29: note: passing argument to parameter 'dev' here
int     bus_setup_intr(device_t dev, struct resource *r, int flags,
                                ^
osscore.c:182:21: error: incompatible pointer types passing 'dev_info_t *' (aka 'struct device *') to parameter of type 'device_t' (aka 'struct _device *') [-Werror,-Wincompatible-pointer-types]
        bus_teardown_intr (osdev->dip, intr->irqres, intr->cookie);
                           ^~~~~~~~~~
/usr/src/sys/sys/bus.h:540:32: note: passing argument to parameter 'dev' here
int     bus_teardown_intr(device_t dev, struct resource *r, void *cookie);
                                   ^
osscore.c:183:24: error: incompatible pointer types passing 'dev_info_t *' (aka 'struct device *') to parameter of type 'device_t' (aka 'struct _device *') [-Werror,-Wincompatible-pointer-types]
        bus_release_resource (osdev->dip, SYS_RES_IRQ, intr->irqid,
                              ^~~~~~~~~~
/usr/src/sys/sys/bus.h:534:35: note: passing argument to parameter 'dev' here
int     bus_release_resource(device_t dev, int type, int rid,
                                      ^
osscore.c:201:27: error: incompatible pointer types passing 'dev_info_t *' (aka 'struct device *') to parameter of type 'device_t' (aka 'struct _device *') [-Werror,-Wincompatible-pointer-types]
  *val = pci_read_config (osdev->dip, where, 1);
                          ^~~~~~~~~~
/usr/src/sys/dev/pci/pcivar.h:401:26: note: passing argument to parameter 'dev' here
pci_read_config(device_t dev, int reg, int width)
                         ^
osscore.c:208:27: error: incompatible pointer types passing 'dev_info_t *' (aka 'struct device *') to parameter of type 'device_t' (aka 'struct _device *') [-Werror,-Wincompatible-pointer-types]
  *val = pci_read_config (osdev->dip, where, 1);
                          ^~~~~~~~~~
/usr/src/sys/dev/pci/pcivar.h:401:26: note: passing argument to parameter 'dev' here
pci_read_config(device_t dev, int reg, int width)
                         ^
osscore.c:216:27: error: incompatible pointer types passing 'dev_info_t *' (aka 'struct device *') to parameter of type 'device_t' (aka 'struct _device *') [-Werror,-Wincompatible-pointer-types]
  *val = pci_read_config (osdev->dip, where, 2);
                          ^~~~~~~~~~
/usr/src/sys/dev/pci/pcivar.h:401:26: note: passing argument to parameter 'dev' here
pci_read_config(device_t dev, int reg, int width)
                         ^
osscore.c:224:27: error: incompatible pointer types passing 'dev_info_t *' (aka 'struct device *') to parameter of type 'device_t' (aka 'struct _device *') [-Werror,-Wincompatible-pointer-types]
  *val = pci_read_config (osdev->dip, where, 4);
                          ^~~~~~~~~~
/usr/src/sys/dev/pci/pcivar.h:401:26: note: passing argument to parameter 'dev' here
pci_read_config(device_t dev, int reg, int width)
                         ^
osscore.c:232:21: error: incompatible pointer types passing 'dev_info_t *' (aka 'struct device *') to parameter of type 'device_t' (aka 'struct _device *') [-Werror,-Wincompatible-pointer-types]
  pci_write_config (osdev->dip, where, val, 1);
                    ^~~~~~~~~~
/usr/src/sys/dev/pci/pcivar.h:407:27: note: passing argument to parameter 'dev' here
pci_write_config(device_t dev, int reg, uint32_t val, int width)
                          ^
osscore.c:240:21: error: incompatible pointer types passing 'dev_info_t *' (aka 'struct device *') to parameter of type 'device_t' (aka 'struct _device *') [-Werror,-Wincompatible-pointer-types]
  pci_write_config (osdev->dip, where, val, 2);
                    ^~~~~~~~~~
/usr/src/sys/dev/pci/pcivar.h:407:27: note: passing argument to parameter 'dev' here
pci_write_config(device_t dev, int reg, uint32_t val, int width)
                          ^
osscore.c:248:21: error: incompatible pointer types passing 'dev_info_t *' (aka 'struct device *') to parameter of type 'device_t' (aka 'struct _device *') [-Werror,-Wincompatible-pointer-types]
  pci_write_config (osdev->dip, where, val, 4);
                    ^~~~~~~~~~
/usr/src/sys/dev/pci/pcivar.h:407:27: note: passing argument to parameter 'dev' here
pci_write_config(device_t dev, int reg, uint32_t val, int width)
                          ^
11 errors generated.
*** [osscore.o] Error code 1

make[2]: stopped in /wrkdirs/usr/ports/audio/oss/work/.build/prototype/usr/local/lib/oss/build
1 error

make[2]: stopped in /wrkdirs/usr/ports/audio/oss/work/.build/prototype/usr/local/lib/oss/build
*** [install] Error code 1

make[1]: stopped in /wrkdirs/usr/ports/audio/oss/work/.build
1 error

make[1]: stopped in /wrkdirs/usr/ports/audio/oss/work/.build
===> Compilation failed unexpectedly.
Try to set MAKE_JOBS_UNSAFE=yes and rebuild before reporting the failure to
the maintainer.
*** Error code 1

Stop.
make: stopped in /usr/ports/audio/oss
Received on Sat Jun 19 2021 - 12:28:34 UTC

Original text of this message