[package - 130releng-armv6-quarterly][math/lrslib] Failed for lrslib-071_1 in build

From: <pkg-fallout_at_FreeBSD.org>
Date: Sat, 19 Jun 2021 11:31:38 GMT
You are receiving this mail as a port that you maintain
is failing to build on the FreeBSD package build server.
Please investigate the failure and submit a PR to fix
build.

Maintainer:     yuri_at_FreeBSD.org
Log URL:        http://beefy8.nyi.freebsd.org/data/130releng-armv6-quarterly/711a4ba94c32/logs/lrslib-071_1.log
Build URL:      http://beefy8.nyi.freebsd.org/build.html?mastername=130releng-armv6-quarterly&build=711a4ba94c32
Log:

=>> Building math/lrslib
build started at Sat Jun 19 11:30:49 UTC 2021
port directory: /usr/ports/math/lrslib
package name: lrslib-071_1
building for: FreeBSD 130releng-armv6-quarterly-job-02 13.0-RELEASE-p2 FreeBSD 13.0-RELEASE-p2 1300139 arm
maintained by: yuri_at_FreeBSD.org
Makefile ident: 
Poudriere version: 3.2.8-8-gaf08dbda
Host OSVERSION: 1300121
Jail OSVERSION: 1300139
Job Id: 02




!!! Jail is newer than host. (Jail: 1300139, Host: 1300121) !!!
!!! This is not supported. !!!
!!! Host kernel must be same or newer than jail. !!!
!!! Expect build failures. !!!



---Begin Environment---
SHELL=/bin/csh
UNAME_p=armv6
UNAME_m=arm
ABI_FILE=/usr/lib/crt1.o
OSVERSION=1300139
UNAME_v=FreeBSD 13.0-RELEASE-p2 1300139
UNAME_r=13.0-RELEASE-p2
BLOCKSIZE=K
MAIL=/var/mail/root
MM_CHARSET=UTF-8
LANG=C.UTF-8
STATUS=1
HOME=/root
PATH=/sbin:/bin:/usr/sbin:/usr/bin:/usr/local/sbin:/usr/local/bin:/root/bin
LOCALBASE=/usr/local
QEMU_EMULATING=1
USER=root
LIBEXECPREFIX=/usr/local/libexec/poudriere
POUDRIERE_VERSION=3.2.8-8-gaf08dbda
MASTERMNT=/usr/local/poudriere/data/.m/130releng-armv6-quarterly/ref
POUDRIERE_BUILD_TYPE=bulk
PACKAGE_BUILDING=yes
SAVED_TERM=
PWD=/usr/local/poudriere/data/.m/130releng-armv6-quarterly/ref/.p/pool
P_PORTS_FEATURES=FLAVORS SELECTED_OPTIONS
MASTERNAME=130releng-armv6-quarterly
SCRIPTPREFIX=/usr/local/share/poudriere
OLDPWD=/usr/local/poudriere/data/.m/130releng-armv6-quarterly/ref/.p
SCRIPTPATH=/usr/local/share/poudriere/bulk.sh
POUDRIEREPATH=/usr/local/bin/poudriere
---End Environment---

---Begin Poudriere Port Flags/Env---
PORT_FLAGS=
PKGENV=
FLAVOR=
DEPENDS_ARGS=
MAKE_ARGS=
---End Poudriere Port Flags/Env---

---Begin OPTIONS List---
---End OPTIONS List---

--MAINTAINER--
yuri_at_FreeBSD.org
--End MAINTAINER--

--CONFIGURE_ARGS--

--End CONFIGURE_ARGS--

--CONFIGURE_ENV--
MAKE=gmake XDG_DATA_HOME=/wrkdirs/usr/ports/math/lrslib/work  XDG_CONFIG_HOME=/wrkdirs/usr/ports/math/lrslib/work  HOME=/wrkdirs/usr/ports/math/lrslib/work TMPDIR="/tmp" PATH=/wrkdirs/usr/ports/math/lrslib/work/.bin:/sbin:/bin:/usr/sbin:/usr/bin:/usr/local/sbin:/usr/local/bin:/root/bin SHELL=/bin/sh CONFIG_SHELL=/bin/sh CMAKE_PREFIX_PATH="/usr/local"
--End CONFIGURE_ENV--

--MAKE_ENV--
XDG_DATA_HOME=/wrkdirs/usr/ports/math/lrslib/work  XDG_CONFIG_HOME=/wrkdirs/usr/ports/math/lrslib/work  HOME=/wrkdirs/usr/ports/math/lrslib/work TMPDIR="/tmp" PATH=/wrkdirs/usr/ports/math/lrslib/work/.bin:/sbin:/bin:/usr/sbin:/usr/bin:/usr/local/sbin:/usr/local/bin:/root/bin NO_PIE=yes MK_DEBUG_FILES=no MK_KERNEL_SYMBOLS=no SHELL=/bin/sh NO_LINT=YES PREFIX=/usr/local  LOCALBASE=/usr/local  CC="/nxb-bin/usr/bin/cc" CFLAGS="-O2 -pipe  -fstack-protector-strong -isystem /usr/local/include -fno-strict-aliasing "  CPP="/nxb-bin/usr/bin/cpp" CPPFLAGS="-isystem /usr/local/include"  LDFLAGS=" -lthr -fstack-protector-strong -L/usr/local/lib " LIBS=""  CXX="/nxb-bin/usr/bin/c++" CXXFLAGS="-O2 -pipe -fstack-protector-strong -isystem /usr/local/include -fno-strict-aliasing  -isystem /usr/local/include "  MANPREFIX="/usr/local" BSD_INSTALL_PROGRAM="install  -s -m 555"  BSD_INSTALL_LIB="install  -s -m 0644"  BSD_INSTALL_SCRIPT="install  -m 555"  BSD_INSTALL_DATA="install  -m 0644"  BSD_INSTALL_MAN=
 "install  -m 444"
--End MAKE_ENV--

--PLIST_SUB--
OSREL=13.0 PREFIX=%D LOCALBASE=/usr/local  RESETPREFIX=/usr/local LIB32DIR=lib DOCSDIR="share/doc/lrslib"  EXAMPLESDIR="share/examples/lrslib"  DATADIR="share/lrslib"  WWWDIR="www/lrslib"  ETCDIR="etc/lrslib"
--End PLIST_SUB--

--SUB_LIST--
PREFIX=/usr/local LOCALBASE=/usr/local  DATADIR=/usr/local/share/lrslib DOCSDIR=/usr/local/share/doc/lrslib EXAMPLESDIR=/usr/local/share/examples/lrslib  WWWDIR=/usr/local/www/lrslib ETCDIR=/usr/local/etc/lrslib
--End SUB_LIST--

---Begin make.conf---
.sinclude "/etc/make.nxb.conf"
USE_PACKAGE_DEPENDS=yes
BATCH=yes
WRKDIRPREFIX=/wrkdirs
PORTSDIR=/usr/ports
PACKAGES=/packages
DISTDIR=/distfiles
PACKAGE_BUILDING=yes
PACKAGE_BUILDING_FLAVORS=yes
MACHINE=arm
MACHINE_ARCH=armv6
ARCH=${MACHINE_ARCH}
#### /usr/local/etc/poudriere.d/make.conf ####
# XXX: We really need this but cannot use it while 'make checksum' does not
# try the next mirror on checksum failure.  It currently retries the same
# failed mirror and then fails rather then trying another.  It *does*
# try the next if the size is mismatched though.
#MASTER_SITE_FREEBSD=yes
# Build ALLOW_MAKE_JOBS_PACKAGES with 2 jobs
MAKE_JOBS_NUMBER=2
#### /usr/ports/Mk/Scripts/ports_env.sh ####
_CCVERSION_9d218390=FreeBSD clang version 11.0.1 (git_at_github.com:llvm/llvm-project.git llvmorg-11.0.1-0-g43ff75f2c3fe) Target: armv6-unknown-freebsd13.0-gnueabihf Thread model: posix InstalledDir: /nxb-bin/usr/bin
_ALTCCVERSION_9d218390=none
_CXXINTERNAL_9c45a5b1=FreeBSD clang version 11.0.1 (git_at_github.com:llvm/llvm-project.git llvmorg-11.0.1-0-g43ff75f2c3fe) Target: armv6-unknown-freebsd13.0-gnueabihf Thread model: posix InstalledDir: /nxb-bin/usr/bin "/nxb-bin/usr/bin/ld" "--eh-frame-hdr" "-dynamic-linker" "/libexec/ld-elf.so.1" "--hash-style=both" "--enable-new-dtags" "-o" "a.out" "/usr/lib/crt1.o" "/usr/lib/crti.o" "/usr/lib/crtbegin.o" "-L/usr/lib" "/dev/null" "-lc++" "-lm" "-lgcc" "--as-needed" "-lgcc_s" "--no-as-needed" "-lc" "-lgcc" "--as-needed" "-lgcc_s" "--no-as-needed" "/usr/lib/crtend.o" "/usr/lib/crtn.o"
CC_OUTPUT_9d218390_58173849=yes
CC_OUTPUT_9d218390_9bdba57c=yes
CC_OUTPUT_9d218390_6a4fe7f5=yes
CC_OUTPUT_9d218390_6bcac02b=yes
CC_OUTPUT_9d218390_67d20829=yes
CC_OUTPUT_9d218390_bfa62e83=yes
CC_OUTPUT_9d218390_f0b4d593=yes
CC_OUTPUT_9d218390_308abb44=yes
CC_OUTPUT_9d218390_f00456e5=yes
CC_OUTPUT_9d218390_65ad290d=yes
CC_OUTPUT_9d218390_f2776b26=yes
CC_OUTPUT_9d218390_b2657cc3=yes
CC_OUTPUT_9d218390_380987f7=yes
CC_OUTPUT_9d218390_160933ec=yes
CC_OUTPUT_9d218390_fb62803b=yes
_OBJC_CCVERSION_9d218390=FreeBSD clang version 11.0.1 (git_at_github.com:llvm/llvm-project.git llvmorg-11.0.1-0-g43ff75f2c3fe) Target: armv6-unknown-freebsd13.0-gnueabihf Thread model: posix InstalledDir: /nxb-bin/usr/bin
_OBJC_ALTCCVERSION_9d218390=none
ARCH=armv6
OPSYS=FreeBSD
_OSRELEASE=13.0-RELEASE-p2
OSREL=13.0
OSVERSION=1300139
PYTHONBASE=/usr/local
CONFIGURE_MAX_CMD_LEN=524288
HAVE_PORTS_ENV=1
#### Misc Poudriere ####
GID=0
UID=0
DISABLE_MAKE_JOBS=poudriere
---End make.conf---
---Begin make.nxb.conf---
CC=/nxb-bin/usr/bin/cc
CPP=/nxb-bin/usr/bin/cpp
CXX=/nxb-bin/usr/bin/c++
NM=/nxb-bin/usr/bin/nm
LD=/nxb-bin/usr/bin/ld
OBJCOPY=/nxb-bin/usr/bin/objcopy
SIZE=/nxb-bin/usr/bin/size
STRIPBIN=/nxb-bin/usr/bin/strip
SED=/nxb-bin/usr/bin/sed
RANLIB=/nxb-bin/usr/bin/ranlib
YACC=/nxb-bin/usr/bin/yacc
MAKE=/nxb-bin/usr/bin/make
STRINGS=/nxb-bin/usr/bin/strings
AWK=/nxb-bin/usr/bin/awk
FLEX=/nxb-bin/usr/bin/flex
---End make.nxb.conf---
--Resource limits--
cpu time               (seconds, -t)  unlimited
file size           (512-blocks, -f)  unlimited
data seg size           (kbytes, -d)  33554432
stack size              (kbytes, -s)  524288
core file size      (512-blocks, -c)  unlimited
max memory size         (kbytes, -m)  unlimited
locked memory           (kbytes, -l)  unlimited
max user processes              (-u)  89999
open files                      (-n)  1024
virtual mem size        (kbytes, -v)  unlimited
swap limit              (kbytes, -w)  unlimited
socket buffer size       (bytes, -b)  unlimited
pseudo-terminals                (-p)  unlimited
kqueues                         (-k)  unlimited
umtx shared locks               (-o)  unlimited
--End resource limits--
=======================<phase: check-sanity   >============================
===>  License GPLv2 accepted by the user
===========================================================================
=======================<phase: pkg-depends    >============================
===>   lrslib-071_1 depends on file: /usr/local/sbin/pkg - not found
===>   Installing existing package /packages/All/pkg-1.16.3.txz
[130releng-armv6-quarterly-job-02] Installing pkg-1.16.3...
[130releng-armv6-quarterly-job-02] Extracting pkg-1.16.3: .......... done
===>   lrslib-071_1 depends on file: /usr/local/sbin/pkg - found
===>   Returning to build of lrslib-071_1
===========================================================================
=======================<phase: fetch-depends  >============================
===========================================================================
=======================<phase: fetch          >============================
===>  License GPLv2 accepted by the user
===> Fetching all distfiles required by lrslib-071_1 for building
===========================================================================
=======================<phase: checksum       >============================
===>  License GPLv2 accepted by the user
===> Fetching all distfiles required by lrslib-071_1 for building
=> SHA256 Checksum OK for lrslib-071.tar.gz.
===========================================================================
=======================<phase: extract-depends>============================
===========================================================================
=======================<phase: extract        >============================
===>  License GPLv2 accepted by the user
===> Fetching all distfiles required by lrslib-071_1 for building
===>  Extracting for lrslib-071_1
=> SHA256 Checksum OK for lrslib-071.tar.gz.
===========================================================================
=======================<phase: patch-depends  >============================
===========================================================================
=======================<phase: patch          >============================
===>  Patching for lrslib-071_1
===>  Applying FreeBSD patches for lrslib-071_1 from /usr/ports/math/lrslib/files
===========================================================================
=======================<phase: build-depends  >============================
===>   lrslib-071_1 depends on package: gmake>=4.3 - not found
===>   Installing existing package /packages/All/gmake-4.3_2.txz
[130releng-armv6-quarterly-job-02] Installing gmake-4.3_2...
[130releng-armv6-quarterly-job-02] `-- Installing gettext-runtime-0.21...
[130releng-armv6-quarterly-job-02] |   `-- Installing indexinfo-0.3.1...
[130releng-armv6-quarterly-job-02] |   `-- Extracting indexinfo-0.3.1: .... done
[130releng-armv6-quarterly-job-02] `-- Extracting gettext-runtime-0.21: .......... done
[130releng-armv6-quarterly-job-02] Extracting gmake-4.3_2: .......... done
===>   lrslib-071_1 depends on package: gmake>=4.3 - found
===>   Returning to build of lrslib-071_1
===========================================================================
=======================<phase: lib-depends    >============================
===>   lrslib-071_1 depends on shared library: libgmp.so - not found
===>   Installing existing package /packages/All/gmp-6.2.1.txz
[130releng-armv6-quarterly-job-02] Installing gmp-6.2.1...
[130releng-armv6-quarterly-job-02] Extracting gmp-6.2.1: .......... done
===>   lrslib-071_1 depends on shared library: libgmp.so - found (/usr/local/lib/libgmp.so)
===>   Returning to build of lrslib-071_1
===========================================================================
=======================<phase: configure      >============================
===>  Configuring for lrslib-071_1
===========================================================================
=======================<phase: build          >============================
===>  Building for lrslib-071_1
gmake[1]: Entering directory '/wrkdirs/usr/ports/math/lrslib/work/lrslib-071'
/nxb-bin/usr/bin/cc -O2 -pipe  -fstack-protector-strong -isystem /usr/local/include -fno-strict-aliasing  -fPIC -DMA -DSAFE -DLRSLONG -c -o lrslong1-shr.o lrslong.c
lrslong.c:31:8: warning: absolute value function 'labs' given an argument of type 'long long' but has parameter of type 'long' which may cause truncation of value [-Wabsolute-value]
  ul = labs (*u);
       ^
lrslong.c:31:8: note: use function 'llabs' instead
  ul = labs (*u);
       ^~~~
       llabs
lrslong.c:32:8: warning: absolute value function 'labs' given an argument of type 'long long' but has parameter of type 'long' which may cause truncation of value [-Wabsolute-value]
  vl = labs (*v);
       ^
lrslong.c:32:8: note: use function 'llabs' instead
  vl = labs (*v);
       ^~~~
       llabs
lrslong.c:78:3: warning: absolute value function 'labs' given an argument of type 'long long' but has parameter of type 'long' which may cause truncation of value [-Wabsolute-value]
  storesign (Nb, POS);
  ^
./lrslong.h:159:42: note: expanded from macro 'storesign'
 #define storesign(a, sa)        (*(a) = labs(*(a)) * sa)
                                         ^
lrslong.c:78:3: note: use function 'llabs' instead
./lrslong.h:159:42: note: expanded from macro 'storesign'
 #define storesign(a, sa)        (*(a) = labs(*(a)) * sa)
                                         ^
lrslong.c:79:3: warning: absolute value function 'labs' given an argument of type 'long long' but has parameter of type 'long' which may cause truncation of value [-Wabsolute-value]
  storesign (Db, POS);
  ^
./lrslong.h:159:42: note: expanded from macro 'storesign'
 #define storesign(a, sa)        (*(a) = labs(*(a)) * sa)
                                         ^
lrslong.c:79:3: note: use function 'llabs' instead
./lrslong.h:159:42: note: expanded from macro 'storesign'
 #define storesign(a, sa)        (*(a) = labs(*(a)) * sa)
                                         ^
lrslong.c:172:3: warning: absolute value function 'labs' given an argument of type 'long long' but has parameter of type 'long' which may cause truncation of value [-Wabsolute-value]
  storesign (a, sig);
  ^
./lrslong.h:159:42: note: expanded from macro 'storesign'
 #define storesign(a, sa)        (*(a) = labs(*(a)) * sa)
                                         ^
lrslong.c:172:3: note: use function 'llabs' instead
./lrslong.h:159:42: note: expanded from macro 'storesign'
 #define storesign(a, sa)        (*(a) = labs(*(a)) * sa)
                                         ^
lrslong.c:580:3: warning: absolute value function 'labs' given an argument of type 'long long' but has parameter of type 'long' which may cause truncation of value [-Wabsolute-value]
  storesign (divisor, POS);
  ^
./lrslong.h:159:42: note: expanded from macro 'storesign'
 #define storesign(a, sa)        (*(a) = labs(*(a)) * sa)
                                         ^
lrslong.c:580:3: note: use function 'llabs' instead
./lrslong.h:159:42: note: expanded from macro 'storesign'
 #define storesign(a, sa)        (*(a) = labs(*(a)) * sa)
                                         ^
lrslong.c:588:4: warning: absolute value function 'labs' given an argument of type 'long long' but has parameter of type 'long' which may cause truncation of value [-Wabsolute-value]
          storesign (Temp, POS);
          ^
./lrslong.h:159:42: note: expanded from macro 'storesign'
 #define storesign(a, sa)        (*(a) = labs(*(a)) * sa)
                                         ^
lrslong.c:588:4: note: use function 'llabs' instead
./lrslong.h:159:42: note: expanded from macro 'storesign'
 #define storesign(a, sa)        (*(a) = labs(*(a)) * sa)
                                         ^
7 warnings generated.
/nxb-bin/usr/bin/cc -O2 -pipe  -fstack-protector-strong -isystem /usr/local/include -fno-strict-aliasing  -fPIC -DMA -DSAFE -DB128 -DLRSLONG -c -o lrslong2-shr.o lrslong.c
In file included from lrslong.c:14:
./lrslong.h:191:9: error: __int128 is not supported on this target
typedef __int128 lrs_mp[1];     /* type lrs_mp holds one 128-bit integer */
        ^
./lrslong.h:192:9: error: __int128 is not supported on this target
typedef __int128 *lrs_mp_t;
        ^
./lrslong.h:193:9: error: __int128 is not supported on this target
typedef __int128 **lrs_mp_vector;
        ^
./lrslong.h:194:9: error: __int128 is not supported on this target
typedef __int128 ***lrs_mp_matrix;
        ^
lrslong.c:34:3: error: __int128 is not supported on this target
  __int128 ul, vl, r;
  ^
lrslong.c:34:3: error: __int128 is not supported on this target
lrslong.c:34:3: error: __int128 is not supported on this target
7 errors generated.
gmake[1]: *** [makefile:228: lrslong2-shr.o] Error 1
gmake[1]: Leaving directory '/wrkdirs/usr/ports/math/lrslib/work/lrslib-071'
*** Error code 1

Stop.
make: stopped in /usr/ports/math/lrslib
Received on Sat Jun 19 2021 - 11:31:38 UTC

Original text of this message