[package - 130powerpc64-quarterly][audio/faust-lv2] Failed for faust-lv2-1.4.20180118_6 in build

From: <pkg-fallout_at_FreeBSD.org>
Date: Sat, 19 Jun 2021 11:28:36 GMT
You are receiving this mail as a port that you maintain
is failing to build on the FreeBSD package build server.
Please investigate the failure and submit a PR to fix
build.

Maintainer:     yuri_at_FreeBSD.org
Log URL:        http://foul1.nyi.freebsd.org/data/130powerpc64-quarterly/7cc516da8f64/logs/faust-lv2-1.4.20180118_6.log
Build URL:      http://foul1.nyi.freebsd.org/build.html?mastername=130powerpc64-quarterly&build=7cc516da8f64
Log:

=>> Building audio/faust-lv2
build started at Sat Jun 19 11:23:50 UTC 2021
port directory: /usr/ports/audio/faust-lv2
package name: faust-lv2-1.4.20180118_6
building for: FreeBSD 130powerpc64-quarterly-job-13 13.0-RELEASE FreeBSD 13.0-RELEASE powerpc
maintained by: yuri_at_FreeBSD.org
Makefile ident: 
Poudriere version: 3.2.8-8-gaf08dbda
Host OSVERSION: 1400008
Jail OSVERSION: 1300139
Job Id: 13

---Begin Environment---
SHELL=/bin/csh
OSVERSION=1300139
UNAME_v=FreeBSD 13.0-RELEASE
UNAME_r=13.0-RELEASE
BLOCKSIZE=K
MAIL=/var/mail/root
MM_CHARSET=UTF-8
LANG=C.UTF-8
STATUS=1
HOME=/root
PATH=/sbin:/bin:/usr/sbin:/usr/bin:/usr/local/sbin:/usr/local/bin:/root/bin
LOCALBASE=/usr/local
USER=root
LIBEXECPREFIX=/usr/local/libexec/poudriere
POUDRIERE_VERSION=3.2.8-8-gaf08dbda
MASTERMNT=/usr/local/poudriere/data/.m/130powerpc64-quarterly/ref
POUDRIERE_BUILD_TYPE=bulk
PACKAGE_BUILDING=yes
SAVED_TERM=screen
PWD=/usr/local/poudriere/data/.m/130powerpc64-quarterly/ref/.p/pool
P_PORTS_FEATURES=FLAVORS SELECTED_OPTIONS
MASTERNAME=130powerpc64-quarterly
SCRIPTPREFIX=/usr/local/share/poudriere
OLDPWD=/usr/local/poudriere/data/.m/130powerpc64-quarterly/ref/.p
SCRIPTPATH=/usr/local/share/poudriere/bulk.sh
POUDRIEREPATH=/usr/local/bin/poudriere
---End Environment---

---Begin Poudriere Port Flags/Env---
PORT_FLAGS=
PKGENV=
FLAVOR=
DEPENDS_ARGS=
MAKE_ARGS=
---End Poudriere Port Flags/Env---

---Begin OPTIONS List---
---End OPTIONS List---

--MAINTAINER--
yuri_at_FreeBSD.org
--End MAINTAINER--

--CONFIGURE_ARGS--

--End CONFIGURE_ARGS--

--CONFIGURE_ENV--
MAKE=gmake XDG_DATA_HOME=/wrkdirs/usr/ports/audio/faust-lv2/work  XDG_CONFIG_HOME=/wrkdirs/usr/ports/audio/faust-lv2/work  HOME=/wrkdirs/usr/ports/audio/faust-lv2/work TMPDIR="/tmp" PATH=/wrkdirs/usr/ports/audio/faust-lv2/work/.bin:/sbin:/bin:/usr/sbin:/usr/bin:/usr/local/sbin:/usr/local/bin:/root/bin SHELL=/bin/sh CONFIG_SHELL=/bin/sh CMAKE_PREFIX_PATH="/usr/local"
--End CONFIGURE_ENV--

--MAKE_ENV--
XDG_DATA_HOME=/wrkdirs/usr/ports/audio/faust-lv2/work  XDG_CONFIG_HOME=/wrkdirs/usr/ports/audio/faust-lv2/work  HOME=/wrkdirs/usr/ports/audio/faust-lv2/work TMPDIR="/tmp" PATH=/wrkdirs/usr/ports/audio/faust-lv2/work/.bin:/sbin:/bin:/usr/sbin:/usr/bin:/usr/local/sbin:/usr/local/bin:/root/bin NO_PIE=yes MK_DEBUG_FILES=no MK_KERNEL_SYMBOLS=no SHELL=/bin/sh NO_LINT=YES PREFIX=/usr/local  LOCALBASE=/usr/local  CC="cc" CFLAGS="-O2 -pipe  -fstack-protector-strong -isystem /usr/local/include -fno-strict-aliasing "  CPP="cpp" CPPFLAGS="-isystem /usr/local/include"  LDFLAGS=" -fPIC -fstack-protector-strong " LIBS="-L/usr/local/lib"  CXX="c++" CXXFLAGS="-O2 -pipe -fstack-protector-strong -isystem /usr/local/include -fno-strict-aliasing  -isystem /usr/local/include "  MANPREFIX="/usr/local" BSD_INSTALL_PROGRAM="install  -s -m 555"  BSD_INSTALL_LIB="install  -s -m 0644"  BSD_INSTALL_SCRIPT="install  -m 555"  BSD_INSTALL_DATA="install  -m 0644"  BSD_INSTALL_MAN="install  -m 444"
--End MAKE_ENV--

--PLIST_SUB--
OSREL=13.0 PREFIX=%D LOCALBASE=/usr/local  RESETPREFIX=/usr/local LIB32DIR=lib DOCSDIR="share/doc/faust"  EXAMPLESDIR="share/examples/faust"  DATADIR="share/faust"  WWWDIR="www/faust"  ETCDIR="etc/faust"
--End PLIST_SUB--

--SUB_LIST--
PREFIX=/usr/local LOCALBASE=/usr/local  DATADIR=/usr/local/share/faust DOCSDIR=/usr/local/share/doc/faust EXAMPLESDIR=/usr/local/share/examples/faust  WWWDIR=/usr/local/www/faust ETCDIR=/usr/local/etc/faust
--End SUB_LIST--

---Begin make.conf---
USE_PACKAGE_DEPENDS=yes
BATCH=yes
WRKDIRPREFIX=/wrkdirs
PORTSDIR=/usr/ports
PACKAGES=/packages
DISTDIR=/distfiles
PACKAGE_BUILDING=yes
PACKAGE_BUILDING_FLAVORS=yes
#### /usr/local/etc/poudriere.d/make.conf ####
# XXX: We really need this but cannot use it while 'make checksum' does not
# try the next mirror on checksum failure.  It currently retries the same
# failed mirror and then fails rather then trying another.  It *does*
# try the next if the size is mismatched though.
#MASTER_SITE_FREEBSD=yes
# Build ALLOW_MAKE_JOBS_PACKAGES with 2 jobs
MAKE_JOBS_NUMBER=2
#### /usr/ports/Mk/Scripts/ports_env.sh ####
_CCVERSION_921dbbb2=FreeBSD clang version 11.0.1 (git_at_github.com:llvm/llvm-project.git llvmorg-11.0.1-0-g43ff75f2c3fe) Target: powerpc64-unknown-freebsd13.0 Thread model: posix InstalledDir: /usr/bin
_ALTCCVERSION_921dbbb2=none
_CXXINTERNAL_acaad9ca=FreeBSD clang version 11.0.1 (git_at_github.com:llvm/llvm-project.git llvmorg-11.0.1-0-g43ff75f2c3fe) Target: powerpc64-unknown-freebsd13.0 Thread model: posix InstalledDir: /usr/bin "/usr/bin/ld" "--eh-frame-hdr" "-dynamic-linker" "/libexec/ld-elf.so.1" "--enable-new-dtags" "-o" "a.out" "/usr/lib/crt1.o" "/usr/lib/crti.o" "/usr/lib/crtbegin.o" "-L/usr/lib" "/dev/null" "-lc++" "-lm" "-lgcc" "--as-needed" "-lgcc_s" "--no-as-needed" "-lc" "-lgcc" "--as-needed" "-lgcc_s" "--no-as-needed" "/usr/lib/crtend.o" "/usr/lib/crtn.o"
CC_OUTPUT_921dbbb2_58173849=yes
CC_OUTPUT_921dbbb2_9bdba57c=yes
CC_OUTPUT_921dbbb2_6a4fe7f5=yes
CC_OUTPUT_921dbbb2_6bcac02b=yes
CC_OUTPUT_921dbbb2_67d20829=yes
CC_OUTPUT_921dbbb2_bfa62e83=yes
CC_OUTPUT_921dbbb2_f0b4d593=yes
CC_OUTPUT_921dbbb2_308abb44=yes
CC_OUTPUT_921dbbb2_f00456e5=yes
CC_OUTPUT_921dbbb2_65ad290d=yes
CC_OUTPUT_921dbbb2_f2776b26=yes
CC_OUTPUT_921dbbb2_b2657cc3=yes
CC_OUTPUT_921dbbb2_380987f7=yes
CC_OUTPUT_921dbbb2_160933ec=yes
CC_OUTPUT_921dbbb2_fb62803b=yes
_OBJC_CCVERSION_921dbbb2=FreeBSD clang version 11.0.1 (git_at_github.com:llvm/llvm-project.git llvmorg-11.0.1-0-g43ff75f2c3fe) Target: powerpc64-unknown-freebsd13.0 Thread model: posix InstalledDir: /usr/bin
_OBJC_ALTCCVERSION_921dbbb2=none
ARCH=powerpc64
PPC_ABI=ELFv2
OPSYS=FreeBSD
_OSRELEASE=13.0-RELEASE
OSREL=13.0
OSVERSION=1300139
PYTHONBASE=/usr/local
CONFIGURE_MAX_CMD_LEN=524288
HAVE_PORTS_ENV=1
#### Misc Poudriere ####
GID=0
UID=0
---End make.conf---
--Resource limits--
cpu time               (seconds, -t)  unlimited
file size           (512-blocks, -f)  unlimited
data seg size           (kbytes, -d)  33554432
stack size              (kbytes, -s)  524288
core file size      (512-blocks, -c)  unlimited
max memory size         (kbytes, -m)  unlimited
locked memory           (kbytes, -l)  unlimited
max user processes              (-u)  89999
open files                      (-n)  1024
virtual mem size        (kbytes, -v)  unlimited
swap limit              (kbytes, -w)  unlimited
socket buffer size       (bytes, -b)  unlimited
pseudo-terminals                (-p)  unlimited
kqueues                         (-k)  unlimited
umtx shared locks               (-o)  unlimited
--End resource limits--
=======================<phase: check-sanity   >============================
===>  License GPLv3 accepted by the user
===========================================================================
=======================<phase: pkg-depends    >============================
===>   faust-lv2-1.4.20180118_6 depends on file: /usr/local/sbin/pkg - not found
===>   Installing existing package /packages/All/pkg-1.16.3.txz
[130powerpc64-quarterly-job-13] Installing pkg-1.16.3...
[130powerpc64-quarterly-job-13] Extracting pkg-1.16.3: .......... done
===>   faust-lv2-1.4.20180118_6 depends on file: /usr/local/sbin/pkg - found
===>   Returning to build of faust-lv2-1.4.20180118_6
===========================================================================
=======================<phase: fetch-depends  >============================
===========================================================================
=======================<phase: fetch          >============================
===>  License GPLv3 accepted by the user
=> faust-1.4.20180118.tar.bz2 doesn't seem to exist in /portdistfiles/.
=> Attempting to fetch https://bitbucket.org/agraef/faust-lv2/get/4dc83e28e998.tar.gz?dummy=/faust-1.4.20180118.tar.bz2
faust-1.4.20180118.tar.bz2                             120 kB 7313 kBps    00s
===> Fetching all distfiles required by faust-lv2-1.4.20180118_6 for building
===========================================================================
=======================<phase: checksum       >============================
===>  License GPLv3 accepted by the user
===> Fetching all distfiles required by faust-lv2-1.4.20180118_6 for building
=> SHA256 Checksum OK for faust-1.4.20180118.tar.bz2.
===========================================================================
=======================<phase: extract-depends>============================
===========================================================================
=======================<phase: extract        >============================
===>  License GPLv3 accepted by the user
===> Fetching all distfiles required by faust-lv2-1.4.20180118_6 for building
===>  Extracting for faust-lv2-1.4.20180118_6
=> SHA256 Checksum OK for faust-1.4.20180118.tar.bz2.
===========================================================================
=======================<phase: patch-depends  >============================
===========================================================================
=======================<phase: patch          >============================
===>  Patching for faust-lv2-1.4.20180118_6
===>  Applying FreeBSD patches for faust-lv2-1.4.20180118_6 from /usr/ports/audio/faust-lv2/files
===========================================================================
=======================<phase: build-depends  >============================
===>   faust-lv2-1.4.20180118_6 depends on package: lv2>0 - not found
===>   Installing existing package /packages/All/lv2-1.18.2.txz
[130powerpc64-quarterly-job-13] Installing lv2-1.18.2...
[130powerpc64-quarterly-job-13] `-- Installing atk-2.36.0...
[130powerpc64-quarterly-job-13] |   `-- Installing gettext-runtime-0.21...
[130powerpc64-quarterly-job-13] |   | `-- Installing indexinfo-0.3.1...
[130powerpc64-quarterly-job-13] |   | `-- Extracting indexinfo-0.3.1: .... done
[130powerpc64-quarterly-job-13] |   `-- Extracting gettext-runtime-0.21: .......... done
[130powerpc64-quarterly-job-13] |   `-- Installing glib-2.66.7_1,1...
[130powerpc64-quarterly-job-13] |   | `-- Installing libffi-3.3_1...
[130powerpc64-quarterly-job-13] |   | `-- Extracting libffi-3.3_1: .......... done
[130powerpc64-quarterly-job-13] |   | `-- Installing libiconv-1.16...
[130powerpc64-quarterly-job-13] |   | `-- Extracting libiconv-1.16: .......... done
[130powerpc64-quarterly-job-13] |   | `-- Installing libxml2-2.9.10_4...
[130powerpc64-quarterly-job-13] |   | `-- Extracting libxml2-2.9.10_4: .......... done
<snip>
ld: error: relocation R_PPC64_TOC16_LO cannot be used against symbol LV2Plugin::n_tunings; recompile with -fPIC
>>> defined in /tmp/NLFfm-e695b4.o
>>> referenced by NLFfm.cpp
>>>               /tmp/NLFfm-e695b4.o:(lv2_dyn_manifest_get_data)

ld: error: relocation R_PPC64_TOC16_LO cannot be used against symbol LV2Plugin::n_tunings; recompile with -fPIC
>>> defined in /tmp/NLFfm-e695b4.o
>>> referenced by NLFfm.cpp
>>>               /tmp/NLFfm-e695b4.o:(lv2_dyn_manifest_get_data)

ld: error: relocation R_PPC64_TOC16_LO cannot be used against symbol LV2Plugin::n_tunings; recompile with -fPIC
>>> defined in /tmp/NLFfm-e695b4.o
>>> referenced by NLFfm.cpp
>>>               /tmp/NLFfm-e695b4.o:(lv2_dyn_manifest_get_data)

ld: error: relocation R_PPC64_TOC16_LO cannot be used against symbol vtable for NLFfm; recompile with -fPIC
>>> defined in /tmp/NLFfm-e695b4.o
>>> referenced by NLFfm.cpp
>>>               /tmp/NLFfm-e695b4.o:(LV2Plugin::LV2Plugin(int, int))

ld: error: relocation R_PPC64_TOC16_LO cannot be used against symbol vtable for NLFfm; recompile with -fPIC
>>> defined in /tmp/NLFfm-e695b4.o
>>> referenced by NLFfm.cpp
>>>               /tmp/NLFfm-e695b4.o:(LV2Plugin::LV2Plugin(int, int))

ld: error: relocation R_PPC64_TOC16_LO cannot be used against symbol vtable for LV2UI; recompile with -fPIC
>>> defined in /tmp/NLFfm-e695b4.o
>>> referenced by NLFfm.cpp
>>>               /tmp/NLFfm-e695b4.o:(LV2Plugin::LV2Plugin(int, int))

ld: error: relocation R_PPC64_TOC16_LO cannot be used against symbol vtable for NLFfm; recompile with -fPIC
>>> defined in /tmp/NLFfm-e695b4.o
>>> referenced by NLFfm.cpp
>>>               /tmp/NLFfm-e695b4.o:(LV2Plugin::meta_get(char const*, char const*))

ld: error: relocation R_PPC64_TOC16_LO cannot be used against symbol vtable for NLFfm; recompile with -fPIC
>>> defined in /tmp/NLFfm-e695b4.o
>>> referenced by NLFfm.cpp
>>>               /tmp/NLFfm-e695b4.o:(NLFfm::clone())

ld: error: relocation R_PPC64_TOC16_LO cannot be used against symbol LV2Plugin::n_tunings; recompile with -fPIC
>>> defined in /tmp/NLFfm-e695b4.o
>>> referenced by NLFfm.cpp
>>>               /tmp/NLFfm-e695b4.o:(LV2Plugin::load_sysex_data())

ld: error: relocation R_PPC64_TOC16_LO cannot be used against symbol typeinfo for boost::wrapexcept<std::length_error>; recompile with -fPIC
>>> defined in /tmp/NLFfm-e695b4.o
>>> referenced by NLFfm.cpp
>>>               /tmp/NLFfm-e695b4.o:(void boost::throw_exception<std::length_error>(std::length_error const&))

ld: error: relocation R_PPC64_TOC16_LO cannot be used against symbol boost::wrapexcept<std::length_error>::~wrapexcept(); recompile with -fPIC
>>> defined in /tmp/NLFfm-e695b4.o
>>> referenced by NLFfm.cpp
>>>               /tmp/NLFfm-e695b4.o:(void boost::throw_exception<std::length_error>(std::length_error const&))

ld: error: relocation R_PPC64_TOC16_LO cannot be used against symbol vtable for boost::exception_detail::error_info_injector<std::length_error>; recompile with -fPIC
>>> defined in /tmp/NLFfm-e695b4.o
>>> referenced by NLFfm.cpp
>>>               /tmp/NLFfm-e695b4.o:(boost::wrapexcept<boost::exception_detail::remove_error_info_injector<std::length_error>::type> boost::exception_detail::enable_both<std::length_error>(std::length_error const&))

ld: error: relocation R_PPC64_TOC16_LO cannot be used against symbol vtable for boost::exception_detail::clone_base; recompile with -fPIC
>>> defined in /tmp/NLFfm-e695b4.o
>>> referenced by NLFfm.cpp
>>>               /tmp/NLFfm-e695b4.o:(boost::wrapexcept<boost::exception_detail::remove_error_info_injector<std::length_error>::type> boost::exception_detail::enable_both<std::length_error>(std::length_error const&))

ld: error: relocation R_PPC64_TOC16_LO cannot be used against symbol VTT for boost::wrapexcept<std::length_error>; recompile with -fPIC
>>> defined in /tmp/NLFfm-e695b4.o
>>> referenced by NLFfm.cpp
>>>               /tmp/NLFfm-e695b4.o:(boost::wrapexcept<boost::exception_detail::remove_error_info_injector<std::length_error>::type> boost::exception_detail::enable_both<std::length_error>(std::length_error const&))

ld: error: relocation R_PPC64_TOC16_LO cannot be used against symbol vtable for boost::wrapexcept<std::length_error>; recompile with -fPIC
>>> defined in /tmp/NLFfm-e695b4.o
>>> referenced by NLFfm.cpp
>>>               /tmp/NLFfm-e695b4.o:(boost::wrapexcept<boost::exception_detail::remove_error_info_injector<std::length_error>::type> boost::exception_detail::enable_both<std::length_error>(std::length_error const&))

ld: error: relocation R_PPC64_TOC16_LO cannot be used against symbol vtable for boost::exception; recompile with -fPIC
>>> defined in /tmp/NLFfm-e695b4.o
>>> referenced by NLFfm.cpp
>>>               /tmp/NLFfm-e695b4.o:(boost::wrapexcept<boost::exception_detail::remove_error_info_injector<std::length_error>::type> boost::exception_detail::enable_both<std::length_error>(std::length_error const&))

ld: error: relocation R_PPC64_TOC16_LO cannot be used against symbol vtable for boost::exception; recompile with -fPIC
>>> defined in /tmp/NLFfm-e695b4.o
>>> referenced by NLFfm.cpp
>>>               /tmp/NLFfm-e695b4.o:(boost::wrapexcept<boost::exception_detail::remove_error_info_injector<std::length_error>::type> boost::exception_detail::enable_both<std::length_error>(std::length_error const&))

ld: error: too many errors emitted, stopping now (use -error-limit=0 to see all errors)
c++: error: linker command failed with exit code 1 (use -v to see invocation)
gmake[1]: *** [Makefile:247: examples/NLFfm.so] Error 1
gmake[1]: *** Waiting for unfinished jobs....
ld: error: relocation R_PPC64_TOC16_LO cannot be used against symbol vtable for LV2UI; recompile with -fPIC
>>> defined in /tmp/NLFeks-8897c6.o
>>> referenced by NLFeks.cpp
>>>               /tmp/NLFeks-8897c6.o:(LV2UI::LV2UI(int))

ld: error: relocation R_PPC64_TOC16_LO cannot be used against symbol vtable for LV2UI; recompile with -fPIC
>>> defined in /tmp/NLFeks-8897c6.o
>>> referenced by NLFeks.cpp
>>>               /tmp/NLFeks-8897c6.o:(LV2UI::~LV2UI())

ld: error: relocation R_PPC64_TOC16_LO cannot be used against symbol vtable for LV2UI; recompile with -fPIC
>>> defined in /tmp/NLFeks-8897c6.o
>>> referenced by NLFeks.cpp
>>>               /tmp/NLFeks-8897c6.o:(LV2UI::~LV2UI())

ld: error: relocation R_PPC64_TOC16_LO cannot be used against symbol LV2Plugin::n_tunings; recompile with -fPIC
>>> defined in /tmp/NLFeks-8897c6.o
>>> referenced by NLFeks.cpp
>>>               /tmp/NLFeks-8897c6.o:(lv2_dyn_manifest_get_data)

ld: error: relocation R_PPC64_TOC16_LO cannot be used against symbol LV2Plugin::n_tunings; recompile with -fPIC
>>> defined in /tmp/NLFeks-8897c6.o
>>> referenced by NLFeks.cpp
>>>               /tmp/NLFeks-8897c6.o:(lv2_dyn_manifest_get_data)

ld: error: relocation R_PPC64_TOC16_LO cannot be used against symbol LV2Plugin::n_tunings; recompile with -fPIC
>>> defined in /tmp/NLFeks-8897c6.o
>>> referenced by NLFeks.cpp
>>>               /tmp/NLFeks-8897c6.o:(lv2_dyn_manifest_get_data)

ld: error: relocation R_PPC64_TOC16_LO cannot be used against symbol vtable for NLFeks; recompile with -fPIC
>>> defined in /tmp/NLFeks-8897c6.o
>>> referenced by NLFeks.cpp
>>>               /tmp/NLFeks-8897c6.o:(LV2Plugin::LV2Plugin(int, int))

ld: error: relocation R_PPC64_TOC16_LO cannot be used against symbol vtable for NLFeks; recompile with -fPIC
>>> defined in /tmp/NLFeks-8897c6.o
>>> referenced by NLFeks.cpp
>>>               /tmp/NLFeks-8897c6.o:(LV2Plugin::LV2Plugin(int, int))

ld: error: relocation R_PPC64_TOC16_LO cannot be used against symbol vtable for LV2UI; recompile with -fPIC
>>> defined in /tmp/NLFeks-8897c6.o
>>> referenced by NLFeks.cpp
>>>               /tmp/NLFeks-8897c6.o:(LV2Plugin::LV2Plugin(int, int))

ld: error: relocation R_PPC64_TOC16_LO cannot be used against symbol vtable for NLFeks; recompile with -fPIC
>>> defined in /tmp/NLFeks-8897c6.o
>>> referenced by NLFeks.cpp
>>>               /tmp/NLFeks-8897c6.o:(LV2Plugin::meta_get(char const*, char const*))

ld: error: relocation R_PPC64_TOC16_LO cannot be used against symbol vtable for NLFeks; recompile with -fPIC
>>> defined in /tmp/NLFeks-8897c6.o
>>> referenced by NLFeks.cpp
>>>               /tmp/NLFeks-8897c6.o:(NLFeks::clone())

ld: error: relocation R_PPC64_TOC16_LO cannot be used against symbol LV2Plugin::n_tunings; recompile with -fPIC
>>> defined in /tmp/NLFeks-8897c6.o
>>> referenced by NLFeks.cpp
>>>               /tmp/NLFeks-8897c6.o:(LV2Plugin::load_sysex_data())

ld: error: relocation R_PPC64_TOC16_LO cannot be used against symbol typeinfo for boost::wrapexcept<std::length_error>; recompile with -fPIC
>>> defined in /tmp/NLFeks-8897c6.o
>>> referenced by NLFeks.cpp
>>>               /tmp/NLFeks-8897c6.o:(void boost::throw_exception<std::length_error>(std::length_error const&))

ld: error: relocation R_PPC64_TOC16_LO cannot be used against symbol boost::wrapexcept<std::length_error>::~wrapexcept(); recompile with -fPIC
>>> defined in /tmp/NLFeks-8897c6.o
>>> referenced by NLFeks.cpp
>>>               /tmp/NLFeks-8897c6.o:(void boost::throw_exception<std::length_error>(std::length_error const&))

ld: error: relocation R_PPC64_TOC16_LO cannot be used against symbol vtable for boost::exception_detail::error_info_injector<std::length_error>; recompile with -fPIC
>>> defined in /tmp/NLFeks-8897c6.o
>>> referenced by NLFeks.cpp
>>>               /tmp/NLFeks-8897c6.o:(boost::wrapexcept<boost::exception_detail::remove_error_info_injector<std::length_error>::type> boost::exception_detail::enable_both<std::length_error>(std::length_error const&))

ld: error: relocation R_PPC64_TOC16_LO cannot be used against symbol vtable for boost::exception_detail::clone_base; recompile with -fPIC
>>> defined in /tmp/NLFeks-8897c6.o
>>> referenced by NLFeks.cpp
>>>               /tmp/NLFeks-8897c6.o:(boost::wrapexcept<boost::exception_detail::remove_error_info_injector<std::length_error>::type> boost::exception_detail::enable_both<std::length_error>(std::length_error const&))

ld: error: relocation R_PPC64_TOC16_LO cannot be used against symbol VTT for boost::wrapexcept<std::length_error>; recompile with -fPIC
>>> defined in /tmp/NLFeks-8897c6.o
>>> referenced by NLFeks.cpp
>>>               /tmp/NLFeks-8897c6.o:(boost::wrapexcept<boost::exception_detail::remove_error_info_injector<std::length_error>::type> boost::exception_detail::enable_both<std::length_error>(std::length_error const&))

ld: error: relocation R_PPC64_TOC16_LO cannot be used against symbol vtable for boost::wrapexcept<std::length_error>; recompile with -fPIC
>>> defined in /tmp/NLFeks-8897c6.o
>>> referenced by NLFeks.cpp
>>>               /tmp/NLFeks-8897c6.o:(boost::wrapexcept<boost::exception_detail::remove_error_info_injector<std::length_error>::type> boost::exception_detail::enable_both<std::length_error>(std::length_error const&))

ld: error: relocation R_PPC64_TOC16_LO cannot be used against symbol vtable for boost::exception; recompile with -fPIC
>>> defined in /tmp/NLFeks-8897c6.o
>>> referenced by NLFeks.cpp
>>>               /tmp/NLFeks-8897c6.o:(boost::wrapexcept<boost::exception_detail::remove_error_info_injector<std::length_error>::type> boost::exception_detail::enable_both<std::length_error>(std::length_error const&))

ld: error: relocation R_PPC64_TOC16_LO cannot be used against symbol vtable for boost::exception; recompile with -fPIC
>>> defined in /tmp/NLFeks-8897c6.o
>>> referenced by NLFeks.cpp
>>>               /tmp/NLFeks-8897c6.o:(boost::wrapexcept<boost::exception_detail::remove_error_info_injector<std::length_error>::type> boost::exception_detail::enable_both<std::length_error>(std::length_error const&))

ld: error: too many errors emitted, stopping now (use -error-limit=0 to see all errors)
c++: error: linker command failed with exit code 1 (use -v to see invocation)
gmake[1]: *** [Makefile:247: examples/NLFeks.so] Error 1
gmake[1]: Leaving directory '/wrkdirs/usr/ports/audio/faust-lv2/work/agraef-faust-lv2-4dc83e28e998'
===> Compilation failed unexpectedly.
Try to set MAKE_JOBS_UNSAFE=yes and rebuild before reporting the failure to
the maintainer.
*** Error code 1

Stop.
make: stopped in /usr/ports/audio/faust-lv2
Received on Sat Jun 19 2021 - 11:28:36 UTC

Original text of this message