[package - main-arm64-default][java/openjdk16] Failed for openjdk16-16.0.1+9.1 in build

From: <pkg-fallout_at_FreeBSD.org>
Date: Sat, 19 Jun 2021 02:10:29 GMT
You are receiving this mail as a port that you maintain
is failing to build on the FreeBSD package build server.
Please investigate the failure and submit a PR to fix
build.

Maintainer:     java_at_FreeBSD.org
Log URL:        http://ampere2.nyi.freebsd.org/data/main-arm64-default/p68e805c64ee7_s8fa5c577de/logs/openjdk16-16.0.1+9.1.log
Build URL:      http://ampere2.nyi.freebsd.org/build.html?mastername=main-arm64-default&build=p68e805c64ee7_s8fa5c577de
Log:

=>> Building java/openjdk16
build started at Sat Jun 19 02:07:46 UTC 2021
port directory: /usr/ports/java/openjdk16
package name: openjdk16-16.0.1+9.1
building for: FreeBSD main-arm64-default-job-05 14.0-CURRENT FreeBSD 14.0-CURRENT 1400023 arm64
maintained by: java_at_FreeBSD.org
Makefile ident: 
Poudriere version: 3.2.8-8-gaf08dbda
Host OSVERSION: 1400008
Jail OSVERSION: 1400023
Job Id: 05




!!! Jail is newer than host. (Jail: 1400023, Host: 1400008) !!!
!!! This is not supported. !!!
!!! Host kernel must be same or newer than jail. !!!
!!! Expect build failures. !!!



---Begin Environment---
SHELL=/bin/csh
OSVERSION=1400023
UNAME_v=FreeBSD 14.0-CURRENT 1400023
UNAME_r=14.0-CURRENT
BLOCKSIZE=K
MAIL=/var/mail/root
MM_CHARSET=UTF-8
LANG=C.UTF-8
STATUS=1
HOME=/root
PATH=/sbin:/bin:/usr/sbin:/usr/bin:/usr/local/sbin:/usr/local/bin:/root/bin
LOCALBASE=/usr/local
USER=root
LIBEXECPREFIX=/usr/local/libexec/poudriere
POUDRIERE_VERSION=3.2.8-8-gaf08dbda
MASTERMNT=/usr/local/poudriere/data/.m/main-arm64-default/ref
POUDRIERE_BUILD_TYPE=bulk
PACKAGE_BUILDING=yes
SAVED_TERM=
PWD=/usr/local/poudriere/data/.m/main-arm64-default/ref/.p/pool
P_PORTS_FEATURES=FLAVORS SELECTED_OPTIONS
MASTERNAME=main-arm64-default
SCRIPTPREFIX=/usr/local/share/poudriere
OLDPWD=/usr/local/poudriere/data/.m/main-arm64-default/ref/.p
SCRIPTPATH=/usr/local/share/poudriere/bulk.sh
POUDRIEREPATH=/usr/local/bin/poudriere
---End Environment---

---Begin Poudriere Port Flags/Env---
PORT_FLAGS=
PKGENV=
FLAVOR=
DEPENDS_ARGS=
MAKE_ARGS=
---End Poudriere Port Flags/Env---

---Begin OPTIONS List---
---End OPTIONS List---

--MAINTAINER--
java_at_FreeBSD.org
--End MAINTAINER--

--CONFIGURE_ARGS--
--with-boot-jdk=/usr/local/openjdk15  --disable-ccache  --disable-javac-server  --disable-hotspot-gtest  --with-alsa=/usr/local  --with-cups=/usr/local  --with-fontconfig=/usr/local  --with-freetype=system  --with-freetype-include=/usr/local/include/freetype2  --with-freetype-lib=/usr/local/lib  --with-libjpeg=system  --with-giflib=system  --with-giflib-include=/usr/local/include  --with-giflib-lib=/usr/local/lib  --with-harfbuzz=system  --with-libpng=system  --with-zlib=system  --with-lcms=system  --x-includes=/usr/local/include  --x-libraries=/usr/local/lib  --with-cacerts-file=/usr/ports/java/openjdk16/files/cacerts  --with-version-string=16.0.1+9-1  --with-native-debug-symbols=none  --with-debug-level=release  --with-vendor-name="OpenJDK BSD Porting Team"  --with-vendor-url="https://github.com/battleblow/jdk16u/"  --with-vendor-bug-url="https://bugs.freebsd.org/bugzilla/enter_bug.cgi?product=Ports%20%26%20Packages&component=Individual%20Port(s)&short_desc=java/openjdk16%3A%20"  -
 -with-vendor-vm-bug-url="https://bugs.freebsd.org/bugzilla/enter_bug.cgi?product=Ports%20%26%20Packages&component=Individual%20Port(s)&short_desc=java/openjdk16%3A%20" --with-toolchain-type=clang --disable-warnings-as-errors --disable-dtrace --enable-aot=no --x-libraries=/usr/local/lib --x-includes=/usr/local/include --prefix=/usr/local ${_LATE_CONFIGURE_ARGS}
--End CONFIGURE_ARGS--

--CONFIGURE_ENV--
CC=cc  CXX=c++  CPP=cpp  ac_cv_path_SED=/usr/local/bin/gsed MAKE=gmake PKG_CONFIG=pkgconf XDG_DATA_HOME=/wrkdirs/usr/ports/java/openjdk16/work  XDG_CONFIG_HOME=/wrkdirs/usr/ports/java/openjdk16/work  HOME=/wrkdirs/usr/ports/java/openjdk16/work TMPDIR="/tmp" PATH=/wrkdirs/usr/ports/java/openjdk16/work/.bin:/sbin:/bin:/usr/sbin:/usr/bin:/usr/local/sbin:/usr/local/bin:/root/bin SHELL=/bin/sh CONFIG_SHELL=/bin/sh CONFIG_SITE=/usr/ports/Templates/config.site lt_cv_sys_max_cmd_len=524288
--End CONFIGURE_ENV--

--MAKE_ENV--
LANG="C"  LC_ALL="C"  CLASSPATH=""  JAVA_HOME=""  LD_LIBRARY_PATH=""  CC=cc  CXX=c++  CPP=cpp  MAKEFLAGS="" --with-toolchain-type=clang USE_CLANG=true XDG_DATA_HOME=/wrkdirs/usr/ports/java/openjdk16/work  XDG_CONFIG_HOME=/wrkdirs/usr/ports/java/openjdk16/work  HOME=/wrkdirs/usr/ports/java/openjdk16/work TMPDIR="/tmp" PATH=/wrkdirs/usr/ports/java/openjdk16/work/.bin:/sbin:/bin:/usr/sbin:/usr/bin:/usr/local/sbin:/usr/local/bin:/root/bin NO_PIE=yes MK_DEBUG_FILES=no MK_KERNEL_SYMBOLS=no SHELL=/bin/sh NO_LINT=YES PREFIX=/usr/local  LOCALBASE=/usr/local  CC="cc" CFLAGS="-O2 -pipe  -DLIBICONV_PLUG -fstack-protector-strong -fno-strict-aliasing "  CPP="cpp" CPPFLAGS="-DLIBICONV_PLUG"  LDFLAGS=" -fstack-protector-strong " LIBS=""  CXX="c++" CXXFLAGS="-O2 -pipe -DLIBICONV_PLUG -fstack-protector-strong -fno-strict-aliasing  -DLIBICONV_PLUG "  MANPREFIX="/usr/local" BSD_INSTALL_PROGRAM="install  -s -m 555"  BSD_INSTALL_LIB="install  -s -m 0644"  BSD_INSTALL_SCRIPT="install  -m 555"  BSD_INSTALL_
 DATA="install  -m 0644"  BSD_INSTALL_MAN="install  -m 444"
--End MAKE_ENV--

--PLIST_SUB--
OSREL=14.0 PREFIX=%D LOCALBASE=/usr/local  RESETPREFIX=/usr/local LIB32DIR=lib DOCSDIR="share/doc/openjdk"  EXAMPLESDIR="share/examples/openjdk"  DATADIR="share/openjdk"  WWWDIR="www/openjdk"  ETCDIR="etc/openjdk"
--End PLIST_SUB--

--SUB_LIST--
PREFIX=/usr/local LOCALBASE=/usr/local  DATADIR=/usr/local/share/openjdk DOCSDIR=/usr/local/share/doc/openjdk EXAMPLESDIR=/usr/local/share/examples/openjdk  WWWDIR=/usr/local/www/openjdk ETCDIR=/usr/local/etc/openjdk
--End SUB_LIST--

---Begin make.conf---
USE_PACKAGE_DEPENDS=yes
BATCH=yes
WRKDIRPREFIX=/wrkdirs
PORTSDIR=/usr/ports
PACKAGES=/packages
DISTDIR=/distfiles
PACKAGE_BUILDING=yes
PACKAGE_BUILDING_FLAVORS=yes
#### /usr/local/etc/poudriere.d/make.conf ####
# XXX: We really need this but cannot use it while 'make checksum' does not
# try the next mirror on checksum failure.  It currently retries the same
# failed mirror and then fails rather then trying another.  It *does*
# try the next if the size is mismatched though.
#MASTER_SITE_FREEBSD=yes
# Build ALLOW_MAKE_JOBS_PACKAGES with 2 jobs
MAKE_JOBS_NUMBER=2
#### /usr/ports/Mk/Scripts/ports_env.sh ####
_CCVERSION_921dbbb2=FreeBSD clang version 12.0.0 (git_at_github.com:llvm/llvm-project.git llvmorg-12.0.0-0-gd28af7c654d8) Target: aarch64-unknown-freebsd14.0 Thread model: posix InstalledDir: /usr/bin
_ALTCCVERSION_921dbbb2=none
_CXXINTERNAL_acaad9ca=FreeBSD clang version 12.0.0 (git_at_github.com:llvm/llvm-project.git llvmorg-12.0.0-0-gd28af7c654d8) Target: aarch64-unknown-freebsd14.0 Thread model: posix InstalledDir: /usr/bin "/usr/bin/ld" "--eh-frame-hdr" "-dynamic-linker" "/libexec/ld-elf.so.1" "--enable-new-dtags" "-o" "a.out" "/usr/lib/crt1.o" "/usr/lib/crti.o" "/usr/lib/crtbegin.o" "-L/usr/lib" "/dev/null" "-lc++" "-lm" "-lgcc" "--as-needed" "-lgcc_s" "--no-as-needed" "-lc" "-lgcc" "--as-needed" "-lgcc_s" "--no-as-needed" "/usr/lib/crtend.o" "/usr/lib/crtn.o"
CC_OUTPUT_921dbbb2_58173849=yes
CC_OUTPUT_921dbbb2_9bdba57c=yes
CC_OUTPUT_921dbbb2_6a4fe7f5=yes
CC_OUTPUT_921dbbb2_6bcac02b=yes
CC_OUTPUT_921dbbb2_67d20829=yes
CC_OUTPUT_921dbbb2_bfa62e83=yes
CC_OUTPUT_921dbbb2_f0b4d593=yes
CC_OUTPUT_921dbbb2_308abb44=yes
CC_OUTPUT_921dbbb2_f00456e5=yes
CC_OUTPUT_921dbbb2_65ad290d=yes
CC_OUTPUT_921dbbb2_f2776b26=yes
CC_OUTPUT_921dbbb2_b2657cc3=yes
CC_OUTPUT_921dbbb2_380987f7=yes
CC_OUTPUT_921dbbb2_160933ec=yes
CC_OUTPUT_921dbbb2_fb62803b=yes
_OBJC_CCVERSION_921dbbb2=FreeBSD clang version 12.0.0 (git_at_github.com:llvm/llvm-project.git llvmorg-12.0.0-0-gd28af7c654d8) Target: aarch64-unknown-freebsd14.0 Thread model: posix InstalledDir: /usr/bin
_OBJC_ALTCCVERSION_921dbbb2=none
ARCH=aarch64
OPSYS=FreeBSD
_OSRELEASE=14.0-CURRENT
OSREL=14.0
OSVERSION=1400023
PYTHONBASE=/usr/local
CONFIGURE_MAX_CMD_LEN=524288
HAVE_PORTS_ENV=1
#### Misc Poudriere ####
GID=0
UID=0
---End make.conf---
--Resource limits--
cpu time               (seconds, -t)  unlimited
file size           (512-blocks, -f)  unlimited
data seg size           (kbytes, -d)  1048576
stack size              (kbytes, -s)  1048576
core file size      (512-blocks, -c)  unlimited
max memory size         (kbytes, -m)  unlimited
locked memory           (kbytes, -l)  unlimited
max user processes              (-u)  89999
open files                      (-n)  1024
virtual mem size        (kbytes, -v)  unlimited
swap limit              (kbytes, -w)  unlimited
socket buffer size       (bytes, -b)  unlimited
pseudo-terminals                (-p)  unlimited
kqueues                         (-k)  unlimited
umtx shared locks               (-o)  unlimited
--End resource limits--
=======================<phase: check-sanity   >============================
===>  License GPLv2 accepted by the user
===========================================================================
=======================<phase: pkg-depends    >============================
===>   openjdk16-16.0.1+9.1 depends on file: /usr/local/sbin/pkg - not found
===>   Installing existing package /packages/All/pkg-1.16.3.txz
[main-arm64-default-job-05] Installing pkg-1.16.3...
[main-arm64-default-job-05] Extracting pkg-1.16.3: .......... done
===>   openjdk16-16.0.1+9.1 depends on file: /usr/local/sbin/pkg - found
===>   Returning to build of openjdk16-16.0.1+9.1
===========================================================================
=======================<phase: fetch-depends  >============================
===========================================================================
=======================<phase: fetch          >============================
===>  License GPLv2 accepted by the user
===> Fetching all distfiles required by openjdk16-16.0.1+9.1 for building
===========================================================================
=======================<phase: checksum       >============================
===>  License GPLv2 accepted by the user
===> Fetching all distfiles required by openjdk16-16.0.1+9.1 for building
=> SHA256 Checksum OK for battleblow-jdk16u-jdk-16.0.1+9-1_GH0.tar.gz.
===========================================================================
=======================<phase: extract-depends>============================
===========================================================================
=======================<phase: extract        >============================
===>  License GPLv2 accepted by the user
===> Fetching all distfiles required by openjdk16-16.0.1+9.1 for building
===>  Extracting for openjdk16-16.0.1+9.1
=> SHA256 Checksum OK for battleblow-jdk16u-jdk-16.0.1+9-1_GH0.tar.gz.
===========================================================================
=======================<phase: patch-depends  >============================
===========================================================================
=======================<phase: patch          >============================
===>  Patching for openjdk16-16.0.1+9.1
===>  Applying FreeBSD patches for openjdk16-16.0.1+9.1 from /usr/ports/java/openjdk16/files
===========================================================================
=======================<phase: build-depends  >============================
===>   openjdk16-16.0.1+9.1 depends on executable: zip - not found
===>   Installing existing package /packages/All/zip-3.0_1.txz
[main-arm64-default-job-05] Installing zip-3.0_1...
[main-arm64-default-job-05] Extracting zip-3.0_1: .......... done
===>   openjdk16-16.0.1+9.1 depends on executable: zip - found
===>   Returning to build of openjdk16-16.0.1+9.1
===>   openjdk16-16.0.1+9.1 depends on package: autoconf>0 - not found
===>   Installing existing package /packages/All/autoconf-2.69_3.txz
[main-arm64-default-job-05] Installing autoconf-2.69_3...
<snip>
checking if JVM feature 'jvmci' is available... yes
checking if platform is supported by Shenandoah... yes
checking if JVM feature 'shenandoahgc' is available... yes
checking if static-build is enabled in configure... no, use --enable-static-build to enable static build.
checking if JVM feature 'static-build' is available... no
checking if platform is supported by ZGC... no, bsd-aarch64
checking if JVM feature 'zgc' is available... no
configure: Unavailable JVM features explicitly disabled for 'server': 'aot'
checking JVM features to use for variant 'server'... 'cds compiler1 compiler2 epsilongc g1gc graal jfr jni-check jvmci jvmti management nmt parallelgc serialgc services shenandoahgc vm-structs'
configure: WARNING: Option --enable-hotspot-gtest is deprecated and will be ignored.
checking if the jtreg failure handler is available... no (jtreg not present)
checking if the jtreg failure handler should be built... disabled, from default 'auto'
checking if the CDS classlist generation should be enabled... enabled, from default 'auto'
checking if any translations should be excluded... no
checking if static man pages should be copied... enabled, default
checking if CDS archive is available... yes
checking if a default CDS archive should be generated... enabled, from default 'auto'
checking for number of cores... 32
checking for memory size... 130745 MB
checking for appropriate number of jobs to run in parallel... 32
checking whether to use javac server... disabled, from command line
checking flags for boot jdk java command ...  -Duser.language=en -Duser.country=US  -XX:+UnlockDiagnosticVMOptions -XX:-VerifySharedSpaces -XX:SharedArchiveFile=/wrkdirs/usr/ports/java/openjdk16/work/jdk16u-jdk-16.0.1-9-1/build/bsd-aarch64-server-release/configure-support/classes.jsa -Xshare:auto 
checking flags for boot jdk java command for big workloads...  -Xms64M -Xmx1600M
checking flags for bootcycle boot jdk java command for big workloads... -Xms64M -Xmx1600M
checking flags for boot jdk java command for small workloads...  -XX:+UseSerialGC -Xms32M -Xmx512M -XX:TieredStopAtLevel=1
checking for --enable-icecc... disabled, default
checking if precompiled headers are available... yes
checking for --enable-precompiled-headers... enabled, from default 'auto'
checking for ccache... [not found]
checking if ccache is available... no, ccache binary missing or not executable
checking if ccache is enabled... disabled, from command line
checking if build directory is on local disk... yes
configure: creating /wrkdirs/usr/ports/java/openjdk16/work/jdk16u-jdk-16.0.1-9-1/build/bsd-aarch64-server-release/configure-support/config.status
config.status: creating /wrkdirs/usr/ports/java/openjdk16/work/jdk16u-jdk-16.0.1-9-1/build/bsd-aarch64-server-release/spec.gmk
config.status: creating /wrkdirs/usr/ports/java/openjdk16/work/jdk16u-jdk-16.0.1-9-1/build/bsd-aarch64-server-release/bootcycle-spec.gmk
config.status: creating /wrkdirs/usr/ports/java/openjdk16/work/jdk16u-jdk-16.0.1-9-1/build/bsd-aarch64-server-release/buildjdk-spec.gmk
config.status: creating /wrkdirs/usr/ports/java/openjdk16/work/jdk16u-jdk-16.0.1-9-1/build/bsd-aarch64-server-release/compare.sh
config.status: creating /wrkdirs/usr/ports/java/openjdk16/work/jdk16u-jdk-16.0.1-9-1/build/bsd-aarch64-server-release/Makefile

====================================================
A new configuration has been successfully created in
/wrkdirs/usr/ports/java/openjdk16/work/jdk16u-jdk-16.0.1-9-1/build/bsd-aarch64-server-release
using configure arguments '--with-boot-jdk=/usr/local/openjdk15 --disable-ccache --disable-javac-server --disable-hotspot-gtest --with-alsa=/usr/local --with-cups=/usr/local --with-fontconfig=/usr/local --with-freetype=system --with-freetype-include=/usr/local/include/freetype2 --with-freetype-lib=/usr/local/lib --with-libjpeg=system --with-giflib=system --with-giflib-include=/usr/local/include --with-giflib-lib=/usr/local/lib --with-harfbuzz=system --with-libpng=system --with-zlib=system --with-lcms=system --x-includes=/usr/local/include --x-libraries=/usr/local/lib --with-cacerts-file=/usr/ports/java/openjdk16/files/cacerts --with-version-string=16.0.1+9-1 --with-native-debug-symbols=none --with-debug-level=release --with-vendor-name='OpenJDK BSD Porting Team' --with-vendor-url=https://github.com/battleblow/jdk16u/ --with-vendor-bug-url='https://bugs.freebsd.org/bugzilla/enter_bug.cgi?product=Ports/wrkdirs/usr/ports/java/openjdk16/work/jdk16u-jdk-16.0.1-9-1/build/.configure-support
 /generated-configure.sh: line 134538: printf: `%': invalid format character

Configuration summary:
* Name:           bsd-aarch64-server-release
* Debug level:    release
* HS debug level: product
* JVM variants:   server
* JVM features:   server: 'cds compiler1 compiler2 epsilongc g1gc graal jfr jni-check jvmci jvmti management nmt parallelgc serialgc services shenandoahgc vm-structs' 
* OpenJDK target: OS: bsd, CPU architecture: aarch64, address length: 64
* Version string: 16.0.1+9-1 (16.0.1)

Tools summary:
* Boot JDK:       openjdk version "15.0.2" 2021-01-19 OpenJDK Runtime Environment (build 15.0.2+7-1) OpenJDK 64-Bit Server VM (build 15.0.2+7-1, mixed mode, sharing) (at /usr/local/openjdk15)
* Toolchain:      clang (clang/LLVM)
* C Compiler:     Version 12.0.0 (at /usr/bin/cc)
* C++ Compiler:   Version 12.0.0 (at /usr/bin/c++)

Build performance summary:
* Cores to use:   32
* Memory limit:   130745 MB

The following warnings were produced. Repeated here for convenience:
WARNING: Ignoring value of MAKE from the environment. Use command line variables instead.
WARNING: Ignoring CFLAGS(-O2 -pipe  -DLIBICONV_PLUG -fstack-protector-strong -fno-strict-aliasing ) found in environment. Use --with-extra-cflags
WARNING: Ignoring CXXFLAGS(-O2 -pipe -DLIBICONV_PLUG -fstack-protector-strong -fno-strict-aliasing  -DLIBICONV_PLUG ) found in environment. Use --with-extra-cxxflags
WARNING: Ignoring LDFLAGS( -fstack-protector-strong ) found in environment. Use --with-extra-ldflags
WARNING: Option --enable-hotspot-gtest is deprecated and will be ignored.

===========================================================================
=======================<phase: build          >============================
===>  Building for openjdk16-16.0.1+9.1
gmake[1]: Entering directory '/wrkdirs/usr/ports/java/openjdk16/work/jdk16u-jdk-16.0.1-9-1'
gmake[2]: Entering directory '/wrkdirs/usr/ports/java/openjdk16/work/jdk16u-jdk-16.0.1-9-1'
gmake[2]: Leaving directory '/wrkdirs/usr/ports/java/openjdk16/work/jdk16u-jdk-16.0.1-9-1'
gmake[2]: Entering directory '/wrkdirs/usr/ports/java/openjdk16/work/jdk16u-jdk-16.0.1-9-1'
Building target 'images' in configuration 'bsd-aarch64-server-release'
gmake[3]: Entering directory '/wrkdirs/usr/ports/java/openjdk16/work/jdk16u-jdk-16.0.1-9-1'
gmake[4]: Entering directory '/wrkdirs/usr/ports/java/openjdk16/work/jdk16u-jdk-16.0.1-9-1/make'
gmake[4]: Entering directory '/wrkdirs/usr/ports/java/openjdk16/work/jdk16u-jdk-16.0.1-9-1/make'
gmake[4]: Entering directory '/wrkdirs/usr/ports/java/openjdk16/work/jdk16u-jdk-16.0.1-9-1/make'
gmake[4]: Entering directory '/wrkdirs/usr/ports/java/openjdk16/work/jdk16u-jdk-16.0.1-9-1/make'
gmake[4]: Entering directory '/wrkdirs/usr/ports/java/openjdk16/work/jdk16u-jdk-16.0.1-9-1/make'
gmake[4]: Entering directory '/wrkdirs/usr/ports/java/openjdk16/work/jdk16u-jdk-16.0.1-9-1/make'
Warning: No SCM configuration present and no .src-rev
gmake[4]: Leaving directory '/wrkdirs/usr/ports/java/openjdk16/work/jdk16u-jdk-16.0.1-9-1/make'
gmake[4]: Entering directory '/wrkdirs/usr/ports/java/openjdk16/work/jdk16u-jdk-16.0.1-9-1/make'
gmake[4]: Entering directory '/wrkdirs/usr/ports/java/openjdk16/work/jdk16u-jdk-16.0.1-9-1/make'
gmake[4]: Entering directory '/wrkdirs/usr/ports/java/openjdk16/work/jdk16u-jdk-16.0.1-9-1/make'
gmake[4]: Entering directory '/wrkdirs/usr/ports/java/openjdk16/work/jdk16u-jdk-16.0.1-9-1/make'
Compiling 8 files for BUILD_TOOLS_LANGTOOLS
gmake[4]: Leaving directory '/wrkdirs/usr/ports/java/openjdk16/work/jdk16u-jdk-16.0.1-9-1/make'
gmake[4]: Leaving directory '/wrkdirs/usr/ports/java/openjdk16/work/jdk16u-jdk-16.0.1-9-1/make'
gmake[4]: Leaving directory '/wrkdirs/usr/ports/java/openjdk16/work/jdk16u-jdk-16.0.1-9-1/make'
gmake[4]: Leaving directory '/wrkdirs/usr/ports/java/openjdk16/work/jdk16u-jdk-16.0.1-9-1/make'
gmake[4]: Leaving directory '/wrkdirs/usr/ports/java/openjdk16/work/jdk16u-jdk-16.0.1-9-1/make'
gmake[4]: Leaving directory '/wrkdirs/usr/ports/java/openjdk16/work/jdk16u-jdk-16.0.1-9-1/make'
gmake[4]: Leaving directory '/wrkdirs/usr/ports/java/openjdk16/work/jdk16u-jdk-16.0.1-9-1/make'
gmake[4]: Leaving directory '/wrkdirs/usr/ports/java/openjdk16/work/jdk16u-jdk-16.0.1-9-1/make'
gmake[4]: Leaving directory '/wrkdirs/usr/ports/java/openjdk16/work/jdk16u-jdk-16.0.1-9-1/make'
gmake[4]: Entering directory '/wrkdirs/usr/ports/java/openjdk16/work/jdk16u-jdk-16.0.1-9-1/make'
gmake[4]: Entering directory '/wrkdirs/usr/ports/java/openjdk16/work/jdk16u-jdk-16.0.1-9-1/make'
gmake[4]: Entering directory '/wrkdirs/usr/ports/java/openjdk16/work/jdk16u-jdk-16.0.1-9-1/make'
gmake[4]: Entering directory '/wrkdirs/usr/ports/java/openjdk16/work/jdk16u-jdk-16.0.1-9-1/make'
Parsing 2 properties into enum-like class for jdk.compiler
Compiling 7 properties into resource bundles for jdk.jshell
Compiling 13 properties into resource bundles for jdk.javadoc
Compiling 16 properties into resource bundles for jdk.compiler
Compiling 12 properties into resource bundles for jdk.jdeps
gmake[4]: Leaving directory '/wrkdirs/usr/ports/java/openjdk16/work/jdk16u-jdk-16.0.1-9-1/make'
gmake[4]: Leaving directory '/wrkdirs/usr/ports/java/openjdk16/work/jdk16u-jdk-16.0.1-9-1/make'
gmake[4]: Leaving directory '/wrkdirs/usr/ports/java/openjdk16/work/jdk16u-jdk-16.0.1-9-1/make'
gmake[4]: Leaving directory '/wrkdirs/usr/ports/java/openjdk16/work/jdk16u-jdk-16.0.1-9-1/make'
gmake[4]: Entering directory '/wrkdirs/usr/ports/java/openjdk16/work/jdk16u-jdk-16.0.1-9-1/make'
Compiling 127 files for BUILD_java.compiler.interim
Compiling 399 files for BUILD_jdk.compiler.interim
Compiling 225 files for BUILD_jdk.javadoc.interim
gmake[4]: Leaving directory '/wrkdirs/usr/ports/java/openjdk16/work/jdk16u-jdk-16.0.1-9-1/make'
gmake[4]: Entering directory '/wrkdirs/usr/ports/java/openjdk16/work/jdk16u-jdk-16.0.1-9-1/make'
gmake[4]: Entering directory '/wrkdirs/usr/ports/java/openjdk16/work/jdk16u-jdk-16.0.1-9-1/make'
gmake[4]: Entering directory '/wrkdirs/usr/ports/java/openjdk16/work/jdk16u-jdk-16.0.1-9-1/make'
Compiling 186 files for BUILD_TOOLS_JDK
Compiling 31 files for BUILD_JRTFS
Compiling 2 files for COMPILE_DEPEND
Compiling 1 files for BUILD_TOOLS_HOTSPOT
Compiling 3 files for BUILD_VM_COMPILER_MATCH_PROCESSOR
Compiling 5 files for BUILD_VM_COMPILER_NODEINFO_PROCESSOR
Compiling 3 files for BUILD_VM_COMPILER_OPTIONS_PROCESSOR
Compiling 14 files for BUILD_VM_COMPILER_REPLACEMENTS_PROCESSOR
Compiling 3 files for BUILD_VM_COMPILER_SERVICEPROVIDER_PROCESSOR
Creating buildtools/jdk.vm.compiler.serviceprovider.processor.jar
Creating buildtools/jdk.vm.compiler.nodeinfo.processor.jar
Creating buildtools/jdk.vm.compiler.options.processor.jar
Creating buildtools/jdk.vm.compiler.match.processor.jar
Creating buildtools/jdk.vm.compiler.replacements.verifier.jar
Creating support/modules_libs/java.base/jrt-fs.jar
gmake[4]: Leaving directory '/wrkdirs/usr/ports/java/openjdk16/work/jdk16u-jdk-16.0.1-9-1/make'
gmake[4]: Entering directory '/wrkdirs/usr/ports/java/openjdk16/work/jdk16u-jdk-16.0.1-9-1/make'
gmake[4]: Entering directory '/wrkdirs/usr/ports/java/openjdk16/work/jdk16u-jdk-16.0.1-9-1/make/hotspot'
gmake[4]: Leaving directory '/wrkdirs/usr/ports/java/openjdk16/work/jdk16u-jdk-16.0.1-9-1/make'
Creating hotspot/variant-server/tools/adlc/adlc from 13 file(s)
Compiling 2 files for BUILD_JVMTI_TOOLS
gmake[4]: Leaving directory '/wrkdirs/usr/ports/java/openjdk16/work/jdk16u-jdk-16.0.1-9-1/make'
c++: warning: argument unused during compilation: '-static-libstdc++' [-Wunused-command-line-argument]
c++: warning: argument unused during compilation: '-static-libgcc' [-Wunused-command-line-argument]
/usr/local/bin/bash: line 1: 75152 Segmentation fault      (core dumped) /wrkdirs/usr/ports/java/openjdk16/work/jdk16u-jdk-16.0.1-9-1/build/bsd-aarch64-server-release/hotspot/variant-server/tools/adlc/adlc -q -T -D_ALLBSD_SOURCE=1 -D_BSDONLY_SOURCE -g -DAARCH64=1 -D_LP64=1 /wrkdirs/usr/ports/java/openjdk16/work/jdk16u-jdk-16.0.1-9-1/build/bsd-aarch64-server-release/hotspot/variant-server/support/adlc/all-ad-src.ad -c/wrkdirs/usr/ports/java/openjdk16/work/jdk16u-jdk-16.0.1-9-1/build/bsd-aarch64-server-release/hotspot/variant-server/support/adlc/ad_aarch64.cpp -h/wrkdirs/usr/ports/java/openjdk16/work/jdk16u-jdk-16.0.1-9-1/build/bsd-aarch64-server-release/hotspot/variant-server/support/adlc/ad_aarch64.hpp -a/wrkdirs/usr/ports/java/openjdk16/work/jdk16u-jdk-16.0.1-9-1/build/bsd-aarch64-server-release/hotspot/variant-server/support/adlc/dfa_aarch64.cpp -v/wrkdirs/usr/ports/java/openjdk16/work/jdk16u-jdk-16.0.1-9-1/build/bsd-aarch64-server-release/hotspot/variant-server/support/adlc/adGlob
 als_aarch64.hpp > >(/usr/bin/tee -a /wrkdirs/usr/ports/java/openjdk16/work/jdk16u-jdk-16.0.1-9-1/build/bsd-aarch64-server-release/hotspot/variant-server/support/adlc/_adlc_run_exec.log) 2> >(/usr/bin/tee -a /wrkdirs/usr/ports/java/openjdk16/work/jdk16u-jdk-16.0.1-9-1/build/bsd-aarch64-server-release/hotspot/variant-server/support/adlc/_adlc_run_exec.log >&2)
gmake[4]: *** [gensrc/GensrcAdlc.gmk:182: /wrkdirs/usr/ports/java/openjdk16/work/jdk16u-jdk-16.0.1-9-1/build/bsd-aarch64-server-release/hotspot/variant-server/support/adlc/_adlc_run_exec.marker] Error 139
gmake[4]: *** Waiting for unfinished jobs....
gmake[4]: Leaving directory '/wrkdirs/usr/ports/java/openjdk16/work/jdk16u-jdk-16.0.1-9-1/make'
gmake[4]: Entering directory '/wrkdirs/usr/ports/java/openjdk16/work/jdk16u-jdk-16.0.1-9-1/make'
gmake[4]: Entering directory '/wrkdirs/usr/ports/java/openjdk16/work/jdk16u-jdk-16.0.1-9-1/make'
gmake[4]: Entering directory '/wrkdirs/usr/ports/java/openjdk16/work/jdk16u-jdk-16.0.1-9-1/make'
gmake[4]: Entering directory '/wrkdirs/usr/ports/java/openjdk16/work/jdk16u-jdk-16.0.1-9-1/make'
gmake[4]: Entering directory '/wrkdirs/usr/ports/java/openjdk16/work/jdk16u-jdk-16.0.1-9-1/make'
Compiling 11 properties into resource bundles for java.logging
gmake[4]: Entering directory '/wrkdirs/usr/ports/java/openjdk16/work/jdk16u-jdk-16.0.1-9-1/make'
Compiling 2 files for BUILD_BREAKITERATOR_BASE
Compiling 2 files for BUILD_BREAKITERATOR_LD
gmake[4]: Leaving directory '/wrkdirs/usr/ports/java/openjdk16/work/jdk16u-jdk-16.0.1-9-1/make'
gmake[4]: Leaving directory '/wrkdirs/usr/ports/java/openjdk16/work/jdk16u-jdk-16.0.1-9-1/make/hotspot'
gmake[3]: *** [make/Main.gmk:245: hotspot-server-gensrc] Error 2
gmake[3]: *** Waiting for unfinished jobs....
gmake[4]: Entering directory '/wrkdirs/usr/ports/java/openjdk16/work/jdk16u-jdk-16.0.1-9-1/make'
gmake[4]: Leaving directory '/wrkdirs/usr/ports/java/openjdk16/work/jdk16u-jdk-16.0.1-9-1/make'
Compiling 11 properties into resource bundles for jdk.jartool
gmake[4]: Leaving directory '/wrkdirs/usr/ports/java/openjdk16/work/jdk16u-jdk-16.0.1-9-1/make'
gmake[4]: Leaving directory '/wrkdirs/usr/ports/java/openjdk16/work/jdk16u-jdk-16.0.1-9-1/make'
Compiling 11 properties into resource bundles for java.base
Compiling 6 properties into resource bundles for java.base
gmake[4]: Leaving directory '/wrkdirs/usr/ports/java/openjdk16/work/jdk16u-jdk-16.0.1-9-1/make'
gmake[4]: Leaving directory '/wrkdirs/usr/ports/java/openjdk16/work/jdk16u-jdk-16.0.1-9-1/make'
gmake[4]: Leaving directory '/wrkdirs/usr/ports/java/openjdk16/work/jdk16u-jdk-16.0.1-9-1/make'
gmake[3]: Leaving directory '/wrkdirs/usr/ports/java/openjdk16/work/jdk16u-jdk-16.0.1-9-1'

ERROR: Build failed for target 'images' in configuration 'bsd-aarch64-server-release' (exit code 2) 
gmake[3]: Entering directory '/wrkdirs/usr/ports/java/openjdk16/work/jdk16u-jdk-16.0.1-9-1'

=== Output from failing command(s) repeated here ===
* For target hotspot_variant-server_support_adlc__adlc_run_exec:

* All command lines available in /wrkdirs/usr/ports/java/openjdk16/work/jdk16u-jdk-16.0.1-9-1/build/bsd-aarch64-server-release/make-support/failure-logs.
=== End of repeated output ===

No indication of failed target found.
Hint: Try searching the build log for '] Error'.
Hint: See doc/building.html#troubleshooting for assistance.

gmake[3]: Leaving directory '/wrkdirs/usr/ports/java/openjdk16/work/jdk16u-jdk-16.0.1-9-1'
gmake[2]: *** [/wrkdirs/usr/ports/java/openjdk16/work/jdk16u-jdk-16.0.1-9-1/make/Init.gmk:315: main] Error 2
gmake[2]: Leaving directory '/wrkdirs/usr/ports/java/openjdk16/work/jdk16u-jdk-16.0.1-9-1'
gmake[1]: *** [/wrkdirs/usr/ports/java/openjdk16/work/jdk16u-jdk-16.0.1-9-1/make/Init.gmk:186: images] Error 2
gmake[1]: Leaving directory '/wrkdirs/usr/ports/java/openjdk16/work/jdk16u-jdk-16.0.1-9-1'
===> Compilation failed unexpectedly.
Try to set MAKE_JOBS_UNSAFE=yes and rebuild before reporting the failure to
the maintainer.
*** Error code 1

Stop.
make: stopped in /usr/ports/java/openjdk16
Received on Sat Jun 19 2021 - 02:10:29 UTC

Original text of this message