[package - 130powerpc64-quarterly][lang/yap] Failed for yap-6.2.2_9 in build

From: <pkg-fallout_at_FreeBSD.org>
Date: Tue, 29 Jun 2021 07:07:43 GMT
You are receiving this mail as a port that you maintain
is failing to build on the FreeBSD package build server.
Please investigate the failure and submit a PR to fix
build.

Maintainer:     danilo_at_FreeBSD.org
Log URL:        http://foul1.nyi.freebsd.org/data/130powerpc64-quarterly/ae162bd98935/logs/yap-6.2.2_9.log
Build URL:      http://foul1.nyi.freebsd.org/build.html?mastername=130powerpc64-quarterly&build=ae162bd98935
Log:

=>> Building lang/yap
build started at Tue Jun 29 07:02:44 UTC 2021
port directory: /usr/ports/lang/yap
package name: yap-6.2.2_9
building for: FreeBSD 130powerpc64-quarterly-job-02 13.0-RELEASE FreeBSD 13.0-RELEASE powerpc
maintained by: danilo_at_FreeBSD.org
Makefile ident: 
Poudriere version: 3.2.8-8-gaf08dbda
Host OSVERSION: 1400008
Jail OSVERSION: 1300139
Job Id: 02

---Begin Environment---
SHELL=/bin/csh
OSVERSION=1300139
UNAME_v=FreeBSD 13.0-RELEASE
UNAME_r=13.0-RELEASE
BLOCKSIZE=K
MAIL=/var/mail/root
MM_CHARSET=UTF-8
LANG=C.UTF-8
STATUS=1
HOME=/root
PATH=/sbin:/bin:/usr/sbin:/usr/bin:/usr/local/sbin:/usr/local/bin:/root/bin
LOCALBASE=/usr/local
USER=root
LIBEXECPREFIX=/usr/local/libexec/poudriere
POUDRIERE_VERSION=3.2.8-8-gaf08dbda
MASTERMNT=/usr/local/poudriere/data/.m/130powerpc64-quarterly/ref
POUDRIERE_BUILD_TYPE=bulk
PACKAGE_BUILDING=yes
SAVED_TERM=
PWD=/usr/local/poudriere/data/.m/130powerpc64-quarterly/ref/.p/pool
P_PORTS_FEATURES=FLAVORS SELECTED_OPTIONS
MASTERNAME=130powerpc64-quarterly
SCRIPTPREFIX=/usr/local/share/poudriere
OLDPWD=/usr/local/poudriere/data/.m/130powerpc64-quarterly/ref/.p
SCRIPTPATH=/usr/local/share/poudriere/bulk.sh
POUDRIEREPATH=/usr/local/bin/poudriere
---End Environment---

---Begin Poudriere Port Flags/Env---
PORT_FLAGS=
PKGENV=
FLAVOR=
DEPENDS_ARGS=
MAKE_ARGS=
---End Poudriere Port Flags/Env---

---Begin OPTIONS List---
===> The following configuration options are available for yap-6.2.2_9:
     DOCS=on: Build and/or install documentation
===> Use 'make config' to modify these settings
---End OPTIONS List---

--MAINTAINER--
danilo_at_FreeBSD.org
--End MAINTAINER--

--CONFIGURE_ARGS--
--enable-max-performance  --disable-myddas --prefix=/usr/local ${_LATE_CONFIGURE_ARGS}
--End CONFIGURE_ARGS--

--CONFIGURE_ENV--
MAKE=gmake XDG_DATA_HOME=/wrkdirs/usr/ports/lang/yap/work  XDG_CONFIG_HOME=/wrkdirs/usr/ports/lang/yap/work  HOME=/wrkdirs/usr/ports/lang/yap/work TMPDIR="/tmp" PATH=/wrkdirs/usr/ports/lang/yap/work/.bin:/sbin:/bin:/usr/sbin:/usr/bin:/usr/local/sbin:/usr/local/bin:/root/bin SHELL=/bin/sh CONFIG_SHELL=/bin/sh CMAKE_PREFIX_PATH="/usr/local" CONFIG_SITE=/usr/ports/Templates/config.site lt_cv_sys_max_cmd_len=524288
--End CONFIGURE_ENV--

--MAKE_ENV--
XDG_DATA_HOME=/wrkdirs/usr/ports/lang/yap/work  XDG_CONFIG_HOME=/wrkdirs/usr/ports/lang/yap/work  HOME=/wrkdirs/usr/ports/lang/yap/work TMPDIR="/tmp" PATH=/wrkdirs/usr/ports/lang/yap/work/.bin:/sbin:/bin:/usr/sbin:/usr/bin:/usr/local/sbin:/usr/local/bin:/root/bin NO_PIE=yes MK_DEBUG_FILES=no MK_KERNEL_SYMBOLS=no SHELL=/bin/sh NO_LINT=YES PREFIX=/usr/local  LOCALBASE=/usr/local  CC="cc" CFLAGS="-O2 -pipe  -fstack-protector-strong -isystem /usr/local/include -fno-strict-aliasing "  CPP="cpp" CPPFLAGS="-I/usr/local/include -isystem /usr/local/include"  LDFLAGS=" -L/usr/local/lib -fstack-protector-strong " LIBS="-L/usr/local/lib"  CXX="c++" CXXFLAGS="-O2 -pipe -fstack-protector-strong -isystem /usr/local/include -fno-strict-aliasing  -isystem /usr/local/include "  MANPREFIX="/usr/local" BSD_INSTALL_PROGRAM="install  -s -m 555"  BSD_INSTALL_LIB="install  -s -m 0644"  BSD_INSTALL_SCRIPT="install  -m 555"  BSD_INSTALL_DATA="install  -m 0644"  BSD_INSTALL_MAN="install  -m 444"
--End MAKE_ENV--

--PLIST_SUB--
PORTDOCS="" TEXMFDIR="share/texmf" TEXMFDISTDIR="share/texmf-dist" TEXMFLOCALDIR="share/texmf-local" TEXMFVARDIR="share/texmf-var" TEXMFCONFIGDIR="share/texmf-config" FMTUTIL_CNF="share/texmf-config/web2c/fmtutil.cnf" OSREL=13.0 PREFIX=%D LOCALBASE=/usr/local  RESETPREFIX=/usr/local LIB32DIR=lib DOCSDIR="share/doc/Yap"  EXAMPLESDIR="share/examples/yap"  DATADIR="share/Yap"  WWWDIR="www/yap"  ETCDIR="etc/yap"
--End PLIST_SUB--

--SUB_LIST--
PREFIX=/usr/local LOCALBASE=/usr/local  DATADIR=/usr/local/share/Yap DOCSDIR=/usr/local/share/doc/Yap EXAMPLESDIR=/usr/local/share/examples/yap  WWWDIR=/usr/local/www/yap ETCDIR=/usr/local/etc/yap
--End SUB_LIST--

---Begin make.conf---
USE_PACKAGE_DEPENDS=yes
BATCH=yes
WRKDIRPREFIX=/wrkdirs
PORTSDIR=/usr/ports
PACKAGES=/packages
DISTDIR=/distfiles
PACKAGE_BUILDING=yes
PACKAGE_BUILDING_FLAVORS=yes
#### /usr/local/etc/poudriere.d/make.conf ####
# XXX: We really need this but cannot use it while 'make checksum' does not
# try the next mirror on checksum failure.  It currently retries the same
# failed mirror and then fails rather then trying another.  It *does*
# try the next if the size is mismatched though.
#MASTER_SITE_FREEBSD=yes
# Build ALLOW_MAKE_JOBS_PACKAGES with 2 jobs
MAKE_JOBS_NUMBER=2
#### /usr/ports/Mk/Scripts/ports_env.sh ####
_CCVERSION_921dbbb2=FreeBSD clang version 11.0.1 (git_at_github.com:llvm/llvm-project.git llvmorg-11.0.1-0-g43ff75f2c3fe) Target: powerpc64-unknown-freebsd13.0 Thread model: posix InstalledDir: /usr/bin
_ALTCCVERSION_921dbbb2=none
_CXXINTERNAL_acaad9ca=FreeBSD clang version 11.0.1 (git_at_github.com:llvm/llvm-project.git llvmorg-11.0.1-0-g43ff75f2c3fe) Target: powerpc64-unknown-freebsd13.0 Thread model: posix InstalledDir: /usr/bin "/usr/bin/ld" "--eh-frame-hdr" "-dynamic-linker" "/libexec/ld-elf.so.1" "--enable-new-dtags" "-o" "a.out" "/usr/lib/crt1.o" "/usr/lib/crti.o" "/usr/lib/crtbegin.o" "-L/usr/lib" "/dev/null" "-lc++" "-lm" "-lgcc" "--as-needed" "-lgcc_s" "--no-as-needed" "-lc" "-lgcc" "--as-needed" "-lgcc_s" "--no-as-needed" "/usr/lib/crtend.o" "/usr/lib/crtn.o"
CC_OUTPUT_921dbbb2_58173849=yes
CC_OUTPUT_921dbbb2_9bdba57c=yes
CC_OUTPUT_921dbbb2_6a4fe7f5=yes
CC_OUTPUT_921dbbb2_6bcac02b=yes
CC_OUTPUT_921dbbb2_67d20829=yes
CC_OUTPUT_921dbbb2_bfa62e83=yes
CC_OUTPUT_921dbbb2_f0b4d593=yes
CC_OUTPUT_921dbbb2_308abb44=yes
CC_OUTPUT_921dbbb2_f00456e5=yes
CC_OUTPUT_921dbbb2_65ad290d=yes
CC_OUTPUT_921dbbb2_f2776b26=yes
CC_OUTPUT_921dbbb2_b2657cc3=yes
CC_OUTPUT_921dbbb2_380987f7=yes
CC_OUTPUT_921dbbb2_160933ec=yes
CC_OUTPUT_921dbbb2_fb62803b=yes
_OBJC_CCVERSION_921dbbb2=FreeBSD clang version 11.0.1 (git_at_github.com:llvm/llvm-project.git llvmorg-11.0.1-0-g43ff75f2c3fe) Target: powerpc64-unknown-freebsd13.0 Thread model: posix InstalledDir: /usr/bin
_OBJC_ALTCCVERSION_921dbbb2=none
ARCH=powerpc64
PPC_ABI=ELFv2
OPSYS=FreeBSD
_OSRELEASE=13.0-RELEASE
OSREL=13.0
OSVERSION=1300139
PYTHONBASE=/usr/local
CONFIGURE_MAX_CMD_LEN=524288
HAVE_PORTS_ENV=1
#### Misc Poudriere ####
GID=0
UID=0
---End make.conf---
--Resource limits--
cpu time               (seconds, -t)  unlimited
file size           (512-blocks, -f)  unlimited
data seg size           (kbytes, -d)  33554432
stack size              (kbytes, -s)  524288
core file size      (512-blocks, -c)  unlimited
max memory size         (kbytes, -m)  unlimited
locked memory           (kbytes, -l)  unlimited
max user processes              (-u)  89999
open files                      (-n)  1024
virtual mem size        (kbytes, -v)  unlimited
swap limit              (kbytes, -w)  unlimited
socket buffer size       (bytes, -b)  unlimited
pseudo-terminals                (-p)  unlimited
kqueues                         (-k)  unlimited
umtx shared locks               (-o)  unlimited
--End resource limits--
=======================<phase: check-sanity   >============================
===========================================================================
=======================<phase: pkg-depends    >============================
===>   yap-6.2.2_9 depends on file: /usr/local/sbin/pkg - not found
===>   Installing existing package /packages/All/pkg-1.16.3.txz
[130powerpc64-quarterly-job-02] Installing pkg-1.16.3...
[130powerpc64-quarterly-job-02] Extracting pkg-1.16.3: .......... done
===>   yap-6.2.2_9 depends on file: /usr/local/sbin/pkg - found
===>   Returning to build of yap-6.2.2_9
===========================================================================
=======================<phase: fetch-depends  >============================
===========================================================================
=======================<phase: fetch          >============================
===> Fetching all distfiles required by yap-6.2.2_9 for building
===========================================================================
=======================<phase: checksum       >============================
===> Fetching all distfiles required by yap-6.2.2_9 for building
=> SHA256 Checksum OK for yap-6.2.2.tar.gz.
===========================================================================
=======================<phase: extract-depends>============================
===========================================================================
=======================<phase: extract        >============================
===> Fetching all distfiles required by yap-6.2.2_9 for building
===>  Extracting for yap-6.2.2_9
=> SHA256 Checksum OK for yap-6.2.2.tar.gz.
===========================================================================
=======================<phase: patch-depends  >============================
===========================================================================
=======================<phase: patch          >============================
===>  Patching for yap-6.2.2_9
===>  Applying FreeBSD patches for yap-6.2.2_9 from /usr/ports/lang/yap/files
===========================================================================
=======================<phase: build-depends  >============================
===>   yap-6.2.2_9 depends on file: /usr/local/bin/texi2html - not found
===>   Installing existing package /packages/All/texi2html-5.0_2,1.txz
[130powerpc64-quarterly-job-02] Installing texi2html-5.0_2,1...
[130powerpc64-quarterly-job-02] `-- Installing gettext-runtime-0.21...
[130powerpc64-quarterly-job-02] |   `-- Installing indexinfo-0.3.1...
[130powerpc64-quarterly-job-02] |   `-- Extracting indexinfo-0.3.1: .... done
[130powerpc64-quarterly-job-02] `-- Extracting gettext-runtime-0.21: .......... done
[130powerpc64-quarterly-job-02] `-- Installing perl5-5.32.1_1...
[130powerpc64-quarterly-job-02] `-- Extracting perl5-5.32.1_1: .......... done
[130powerpc64-quarterly-job-02] Extracting texi2html-5.0_2,1: .......... done
=====
Message from texi2html-5.0_2,1:

--
===>   NOTICE:

The texi2html port currently does not have a maintainer. As a result, it is
more likely to have unresolved issues, not be up-to-date, or even be removed in
the future. To volunteer to maintain this port, please create an issue at:
<snip>
config.status: creating library/mpi/Makefile
config.status: creating library/random/Makefile
config.status: creating library/regex/Makefile
config.status: creating library/rltree/Makefile
config.status: creating library/system/Makefile
config.status: creating library/tries/Makefile
config.status: creating LGPL/Makefile
config.status: creating LGPL/clp/Makefile
config.status: creating LGPL/swi_console/Makefile
config.status: creating packages/clib/Makefile
config.status: creating packages/clib/maildrop/rfc822/Makefile
config.status: creating packages/clib/maildrop/rfc2045/Makefile
config.status: creating packages/CLPBN/Makefile
config.status: creating packages/cplint/Makefile
config.status: creating packages/cplint/approx/simplecuddLPADs/Makefile
config.status: creating packages/cplint/slipcase/Makefile
config.status: creating packages/http/Makefile
config.status: creating packages/tai/Makefile
config.status: creating packages/tai/libtai/Makefile
config.status: creating packages/PLStream/Makefile
config.status: creating packages/plunit/Makefile
config.status: creating packages/ProbLog/Makefile
config.status: creating packages/RDF/Makefile
config.status: creating packages/semweb/Makefile
config.status: creating packages/sgml/Makefile
config.status: creating packages/zlib/Makefile
config.status: creating packages/chr/Makefile
config.status: creating packages/clpqr/Makefile
config.status: creating packages/swi-minisat2/Makefile
config.status: creating packages/swi-minisat2/C/Makefile
config.status: creating config.h
===========================================================================
=======================<phase: build          >============================
===>  Building for yap-6.2.2_9
gmake[1]: Entering directory '/wrkdirs/usr/ports/lang/yap/work/yap-6.2.2'
cc -c -O3 -fomit-frame-pointer -Wall -Wstrict-prototypes -Wmissing-prototypes -O2 -pipe  -fstack-protector-strong -isystem /usr/local/include -fno-strict-aliasing  -DCUT_C=1  -DCOROUTINING=1 -DRATIONAL_TREES=1 -DDEPTH_LIMIT=1 -DHAVE_CONFIG_H -D_YAP_NOT_INSTALLED_=1 -I/usr/local/include -isystem /usr/local/include  -I. -I./H -I./OPTYap -I./BEAM -I./MYDDAS -I./include ./console/yap.c -o yap.o
cc -c -O3 -fomit-frame-pointer -Wall -Wstrict-prototypes -Wmissing-prototypes -O2 -pipe  -fstack-protector-strong -isystem /usr/local/include -fno-strict-aliasing  -DCUT_C=1  -DCOROUTINING=1 -DRATIONAL_TREES=1 -DDEPTH_LIMIT=1 -DHAVE_CONFIG_H -D_YAP_NOT_INSTALLED_=1 -I/usr/local/include -isystem /usr/local/include  -I. -I./H -I./OPTYap -I./BEAM -I./MYDDAS C/agc.c -o agc.o
In file included from C/agc.c:22:
In file included from ./H/absmi.h:146:
In file included from ./H/Yap.h:419:
./H/Regs.h:489:21: warning: extra tokens at end of #undef directive [-Wextra-tokens]
#undef YENV_ADDRESS (&(YENV))
                    ^
                    //
In file included from C/agc.c:22:
In file included from ./H/absmi.h:146:
In file included from ./H/Yap.h:1024:
./H/TermExt.h:89:10: warning: cast to smaller integer type 'blob_type' from 'Functor' (aka 'struct FunctorEntryStruct *') [-Wpointer-to-enum-cast]
  return (blob_type) (f);
         ^~~~~~~~~~~~~~~
In file included from C/agc.c:202:
./H/rheap.h:969:2: warning: misleading indentation; statement is not part of the previous 'if' [-Wmisleading-indentation]
        objs->name = AtomAdjust(objs->name);
        ^
./H/rheap.h:967:7: note: previous statement is here
      if (objs->next != NULL)
      ^
cc -c -O3 -fomit-frame-pointer -Wall -Wstrict-prototypes -Wmissing-prototypes -O2 -pipe  -fstack-protector-strong -isystem /usr/local/include -fno-strict-aliasing  -DCUT_C=1  -DCOROUTINING=1 -DRATIONAL_TREES=1 -DDEPTH_LIMIT=1 -DHAVE_CONFIG_H -D_YAP_NOT_INSTALLED_=1 -I/usr/local/include -isystem /usr/local/include  -I. -I./H -I./OPTYap -I./BEAM -I./MYDDAS C/absmi.c -o absmi.o
In file included from C/absmi.c:496:
In file included from ./H/absmi.h:146:
In file included from ./H/Yap.h:419:
./H/Regs.h:489:21: warning: extra tokens at end of #undef directive [-Wextra-tokens]
#undef YENV_ADDRESS (&(YENV))
                    ^
                    //
In file included from C/absmi.c:496:
In file included from ./H/absmi.h:146:
In file included from ./H/Yap.h:1024:
./H/TermExt.h:89:10: warning: cast to smaller integer type 'blob_type' from 'Functor' (aka 'struct FunctorEntryStruct *') [-Wpointer-to-enum-cast]
  return (blob_type) (f);
         ^~~~~~~~~~~~~~~
fatal error: error in backend: Invalid register name global variable
PLEASE submit a bug report to https://bugs.freebsd.org/submit/ and include the crash backtrace, preprocessed source, and associated run script.
Stack dump:
0.	Program arguments: cc -c -O3 -fomit-frame-pointer -Wall -Wstrict-prototypes -Wmissing-prototypes -O2 -pipe -fstack-protector-strong -isystem /usr/local/include -fno-strict-aliasing -DCUT_C=1 -DCOROUTINING=1 -DRATIONAL_TREES=1 -DDEPTH_LIMIT=1 -DHAVE_CONFIG_H -D_YAP_NOT_INSTALLED_=1 -I/usr/local/include -isystem /usr/local/include -I. -I./H -I./OPTYap -I./BEAM -I./MYDDAS C/agc.c -o agc.o 
1.	<eof> parser at end of file
2.	Code generation
3.	Running pass 'Function Pass Manager' on module 'C/agc.c'.
4.	Running pass 'PowerPC DAG->DAG Pattern Instruction Selection' on function '_at_atom_gc'
 #0 0x00000000138c02cc (/usr/bin/cc+0x138c02cc)
 #1 0x00000000138bdb6c (/usr/bin/cc+0x138bdb6c)
 #2 0x0000000013851534 (/usr/bin/cc+0x13851534)
 #3 0x000000001385148c (/usr/bin/cc+0x1385148c)
 #4 0x00000000138b60a0 (/usr/bin/cc+0x138b60a0)
 #5 0x000000001106926c (/usr/bin/cc+0x1106926c)
 #6 0x000000001385bd44 (/usr/bin/cc+0x1385bd44)
 #7 0x000000001385bbdc (/usr/bin/cc+0x1385bbdc)
 #8 0x00000000141f1a70 (/usr/bin/cc+0x141f1a70)
 #9 0x0000000013c119fc (/usr/bin/cc+0x13c119fc)
#10 0x00000000141ff5d4 (/usr/bin/cc+0x141ff5d4)
#11 0x0000000013c0e714 (/usr/bin/cc+0x13c0e714)
#12 0x0000000013c0dd38 (/usr/bin/cc+0x13c0dd38)
#13 0x0000000013c0d174 (/usr/bin/cc+0x13c0d174)
#14 0x0000000013c0ad38 (/usr/bin/cc+0x13c0ad38)
#15 0x00000000141f61cc (/usr/bin/cc+0x141f61cc)
#16 0x00000000131604ec (/usr/bin/cc+0x131604ec)
#17 0x0000000013531324 (/usr/bin/cc+0x13531324)
#18 0x0000000013538558 (/usr/bin/cc+0x13538558)
#19 0x0000000013531a38 (/usr/bin/cc+0x13531a38)
#20 0x00000000114b59e0 (/usr/bin/cc+0x114b59e0)
#21 0x0000000011b5b250 (/usr/bin/cc+0x11b5b250)
#22 0x0000000011f397f0 (/usr/bin/cc+0x11f397f0)
#23 0x0000000011a95a64 (/usr/bin/cc+0x11a95a64)
#24 0x0000000011b5900c (/usr/bin/cc+0x11b5900c)
#25 0x0000000011a952c8 (/usr/bin/cc+0x11a952c8)
#26 0x00000000119ebf50 (/usr/bin/cc+0x119ebf50)
#27 0x0000000011b4bc14 (/usr/bin/cc+0x11b4bc14)
#28 0x0000000011068ab4 (/usr/bin/cc+0x11068ab4)
#29 0x0000000011077a18 (/usr/bin/cc+0x11077a18)
#30 0x00000000118c9da0 (/usr/bin/cc+0x118c9da0)
#31 0x0000000013851430 (/usr/bin/cc+0x13851430)
#32 0x00000000118c90d8 (/usr/bin/cc+0x118c90d8)
#33 0x0000000011897f84 (/usr/bin/cc+0x11897f84)
#34 0x00000000118985cc (/usr/bin/cc+0x118985cc)
#35 0x00000000118ad53c (/usr/bin/cc+0x118ad53c)
cc: error: clang frontend command failed with exit code 70 (use -v to see invocation)
FreeBSD clang version 11.0.1 (git_at_github.com:llvm/llvm-project.git llvmorg-11.0.1-0-g43ff75f2c3fe)
Target: powerpc64-unknown-freebsd13.0
Thread model: posix
InstalledDir: /usr/bin
cc: note: diagnostic msg: 
********************

PLEASE ATTACH THE FOLLOWING FILES TO THE BUG REPORT:
Preprocessed source(s) and associated run script(s) are located at:
cc: note: diagnostic msg: /tmp/agc-90e2a0.c
cc: note: diagnostic msg: /tmp/agc-90e2a0.sh
cc: note: diagnostic msg: 

********************
gmake[1]: *** [Makefile:488: agc.o] Error 70
gmake[1]: *** Waiting for unfinished jobs....
fatal error: error in backend: Invalid register name global variable
PLEASE submit a bug report to https://bugs.freebsd.org/submit/ and include the crash backtrace, preprocessed source, and associated run script.
Stack dump:
0.	Program arguments: cc -c -O3 -fomit-frame-pointer -Wall -Wstrict-prototypes -Wmissing-prototypes -O2 -pipe -fstack-protector-strong -isystem /usr/local/include -fno-strict-aliasing -DCUT_C=1 -DCOROUTINING=1 -DRATIONAL_TREES=1 -DDEPTH_LIMIT=1 -DHAVE_CONFIG_H -D_YAP_NOT_INSTALLED_=1 -I/usr/local/include -isystem /usr/local/include -I. -I./H -I./OPTYap -I./BEAM -I./MYDDAS C/absmi.c -o absmi.o 
1.	<eof> parser at end of file
2.	Code generation
3.	Running pass 'Function Pass Manager' on module 'C/absmi.c'.
4.	Running pass 'PowerPC DAG->DAG Pattern Instruction Selection' on function '_at_Yap_absmi'
 #0 0x00000000138c02cc (/usr/bin/cc+0x138c02cc)
 #1 0x00000000138bdb6c (/usr/bin/cc+0x138bdb6c)
 #2 0x0000000013851534 (/usr/bin/cc+0x13851534)
 #3 0x000000001385148c (/usr/bin/cc+0x1385148c)
 #4 0x00000000138b60a0 (/usr/bin/cc+0x138b60a0)
 #5 0x000000001106926c (/usr/bin/cc+0x1106926c)
 #6 0x000000001385bd44 (/usr/bin/cc+0x1385bd44)
 #7 0x000000001385bbdc (/usr/bin/cc+0x1385bbdc)
 #8 0x00000000141f1a70 (/usr/bin/cc+0x141f1a70)
 #9 0x0000000013c11c48 (/usr/bin/cc+0x13c11c48)
#10 0x00000000141ff5d4 (/usr/bin/cc+0x141ff5d4)
#11 0x0000000013c0e714 (/usr/bin/cc+0x13c0e714)
#12 0x0000000013c0dd38 (/usr/bin/cc+0x13c0dd38)
#13 0x0000000013c0d174 (/usr/bin/cc+0x13c0d174)
#14 0x0000000013c0ad38 (/usr/bin/cc+0x13c0ad38)
#15 0x00000000141f61cc (/usr/bin/cc+0x141f61cc)
#16 0x00000000131604ec (/usr/bin/cc+0x131604ec)
#17 0x0000000013531324 (/usr/bin/cc+0x13531324)
#18 0x0000000013538558 (/usr/bin/cc+0x13538558)
#19 0x0000000013531a38 (/usr/bin/cc+0x13531a38)
#20 0x00000000114b59e0 (/usr/bin/cc+0x114b59e0)
#21 0x0000000011b5b250 (/usr/bin/cc+0x11b5b250)
#22 0x0000000011f397f0 (/usr/bin/cc+0x11f397f0)
#23 0x0000000011a95a64 (/usr/bin/cc+0x11a95a64)
#24 0x0000000011b5900c (/usr/bin/cc+0x11b5900c)
#25 0x0000000011a952c8 (/usr/bin/cc+0x11a952c8)
#26 0x00000000119ebf50 (/usr/bin/cc+0x119ebf50)
#27 0x0000000011b4bc14 (/usr/bin/cc+0x11b4bc14)
#28 0x0000000011068ab4 (/usr/bin/cc+0x11068ab4)
#29 0x0000000011077a18 (/usr/bin/cc+0x11077a18)
#30 0x00000000118c9da0 (/usr/bin/cc+0x118c9da0)
#31 0x0000000013851430 (/usr/bin/cc+0x13851430)
#32 0x00000000118c90d8 (/usr/bin/cc+0x118c90d8)
#33 0x0000000011897f84 (/usr/bin/cc+0x11897f84)
#34 0x00000000118985cc (/usr/bin/cc+0x118985cc)
#35 0x00000000118ad53c (/usr/bin/cc+0x118ad53c)
cc: error: clang frontend command failed with exit code 70 (use -v to see invocation)
FreeBSD clang version 11.0.1 (git_at_github.com:llvm/llvm-project.git llvmorg-11.0.1-0-g43ff75f2c3fe)
Target: powerpc64-unknown-freebsd13.0
Thread model: posix
InstalledDir: /usr/bin
cc: note: diagnostic msg: 
********************

PLEASE ATTACH THE FOLLOWING FILES TO THE BUG REPORT:
Preprocessed source(s) and associated run script(s) are located at:
cc: note: diagnostic msg: /tmp/absmi-acdf51.c
cc: note: diagnostic msg: /tmp/absmi-acdf51.sh
cc: note: diagnostic msg: 

********************
gmake[1]: *** [Makefile:488: absmi.o] Error 70
gmake[1]: Leaving directory '/wrkdirs/usr/ports/lang/yap/work/yap-6.2.2'
===> Compilation failed unexpectedly.
Try to set MAKE_JOBS_UNSAFE=yes and rebuild before reporting the failure to
the maintainer.
*** Error code 1

Stop.
make: stopped in /usr/ports/lang/yap
Received on Tue Jun 29 2021 - 07:07:43 UTC

Original text of this message