[package - 122powerpc64-quarterly][devel/hpx] Failed for hpx-1.2.1_4 in build

From: <pkg-fallout_at_FreeBSD.org>
Date: Tue, 29 Jun 2021 05:03:17 GMT
You are receiving this mail as a port that you maintain
is failing to build on the FreeBSD package build server.
Please investigate the failure and submit a PR to fix
build.

Maintainer:     yuri_at_FreeBSD.org
Log URL:        http://foul1.nyi.freebsd.org/data/122powerpc64-quarterly/ae162bd98935/logs/hpx-1.2.1_4.log
Build URL:      http://foul1.nyi.freebsd.org/build.html?mastername=122powerpc64-quarterly&build=ae162bd98935
Log:

=>> Building devel/hpx
build started at Tue Jun 29 04:33:52 UTC 2021
port directory: /usr/ports/devel/hpx
package name: hpx-1.2.1_4
building for: FreeBSD 122powerpc64-quarterly-job-09 12.2-RELEASE FreeBSD 12.2-RELEASE powerpc
maintained by: yuri_at_FreeBSD.org
Makefile ident: 
Poudriere version: 3.2.8-8-gaf08dbda
Host OSVERSION: 1400008
Jail OSVERSION: 1202000
Job Id: 09

---Begin Environment---
SHELL=/bin/csh
OSVERSION=1202000
UNAME_v=FreeBSD 12.2-RELEASE
UNAME_r=12.2-RELEASE
BLOCKSIZE=K
MAIL=/var/mail/root
STATUS=1
HOME=/root
PATH=/sbin:/bin:/usr/sbin:/usr/bin:/usr/local/sbin:/usr/local/bin:/root/bin
LOCALBASE=/usr/local
USER=root
LIBEXECPREFIX=/usr/local/libexec/poudriere
POUDRIERE_VERSION=3.2.8-8-gaf08dbda
MASTERMNT=/usr/local/poudriere/data/.m/122powerpc64-quarterly/ref
POUDRIERE_BUILD_TYPE=bulk
PACKAGE_BUILDING=yes
SAVED_TERM=
PWD=/usr/local/poudriere/data/.m/122powerpc64-quarterly/ref/.p/pool
P_PORTS_FEATURES=FLAVORS SELECTED_OPTIONS
MASTERNAME=122powerpc64-quarterly
SCRIPTPREFIX=/usr/local/share/poudriere
OLDPWD=/usr/local/poudriere/data/.m/122powerpc64-quarterly/ref/.p
SCRIPTPATH=/usr/local/share/poudriere/bulk.sh
POUDRIEREPATH=/usr/local/bin/poudriere
---End Environment---

---Begin Poudriere Port Flags/Env---
PORT_FLAGS=
PKGENV=
FLAVOR=
DEPENDS_ARGS=
MAKE_ARGS=
---End Poudriere Port Flags/Env---

---Begin OPTIONS List---
---End OPTIONS List---

--MAINTAINER--
yuri_at_FreeBSD.org
--End MAINTAINER--

--CONFIGURE_ARGS--

--End CONFIGURE_ARGS--

--CONFIGURE_ENV--
PYTHON="/usr/local/bin/python3.7" XDG_DATA_HOME=/wrkdirs/usr/ports/devel/hpx/work  XDG_CONFIG_HOME=/wrkdirs/usr/ports/devel/hpx/work  HOME=/wrkdirs/usr/ports/devel/hpx/work TMPDIR="/tmp" PATH=/wrkdirs/usr/ports/devel/hpx/work/.bin:/sbin:/bin:/usr/sbin:/usr/bin:/usr/local/sbin:/usr/local/bin:/root/bin SHELL=/bin/sh CONFIG_SHELL=/bin/sh
--End CONFIGURE_ENV--

--MAKE_ENV--
XDG_DATA_HOME=/wrkdirs/usr/ports/devel/hpx/work  XDG_CONFIG_HOME=/wrkdirs/usr/ports/devel/hpx/work  HOME=/wrkdirs/usr/ports/devel/hpx/work TMPDIR="/tmp" PATH=/wrkdirs/usr/ports/devel/hpx/work/.bin:/sbin:/bin:/usr/sbin:/usr/bin:/usr/local/sbin:/usr/local/bin:/root/bin NO_PIE=yes MK_DEBUG_FILES=no MK_KERNEL_SYMBOLS=no SHELL=/bin/sh NO_LINT=YES ADDR2LINE="/usr/local/bin/addr2line" AR="/usr/local/bin/ar" AS="/usr/local/bin/as" CPPFILT="/usr/local/bin/c++filt" GPROF="/usr/local/bin/gprof" LD="/usr/local/bin/ld" NM="/usr/local/bin/nm" OBJCOPY="/usr/local/bin/objcopy" OBJDUMP="/usr/local/bin/objdump" RANLIB="/usr/local/bin/ranlib" READELF="/usr/local/bin/readelf" SIZE="/usr/local/bin/size" STRINGS="/usr/local/bin/strings" DESTDIR=/wrkdirs/usr/ports/devel/hpx/work/stage PREFIX=/usr/local  LOCALBASE=/usr/local  CC="gcc10" CFLAGS="-O2 -pipe  -fstack-protector-strong -Wl,-rpath=/usr/local/lib/gcc10 -fno-strict-aliasing "  CPP="cpp10" CPPFLAGS=""  LDFLAGS=" -latomic -fstack-protector-strong -Wl,
 -rpath=/usr/local/lib/gcc10 -L/usr/local/lib/gcc10 " LIBS=""  CXX="g++10" CXXFLAGS="-O2 -pipe  -fstack-protector-strong -Wl,-rpath=/usr/local/lib/gcc10  -Wl,-rpath=/usr/local/lib/gcc10 "  MANPREFIX="/usr/local" BSD_INSTALL_PROGRAM="install  -s -m 555"  BSD_INSTALL_LIB="install  -s -m 0644"  BSD_INSTALL_SCRIPT="install  -m 555"  BSD_INSTALL_DATA="install  -m 0644"  BSD_INSTALL_MAN="install  -m 444"
--End MAKE_ENV--

--PLIST_SUB--
CMAKE_BUILD_TYPE="release" PYTHON_INCLUDEDIR=include/python3.7m  PYTHON_LIBDIR=lib/python3.7  PYTHON_PLATFORM=freebsd12  PYTHON_SITELIBDIR=lib/python3.7/site-packages  PYTHON_SUFFIX=37  PYTHON_EXT_SUFFIX=  PYTHON_VER=3.7  PYTHON_VERSION=python3.7 PYTHON2="_at_comment " PYTHON3="" OSREL=12.2 PREFIX=%D LOCALBASE=/usr/local  RESETPREFIX=/usr/local LIB32DIR=lib DOCSDIR="share/doc/hpx"  EXAMPLESDIR="share/examples/hpx"  DATADIR="share/hpx"  WWWDIR="www/hpx"  ETCDIR="etc/hpx"
--End PLIST_SUB--

--SUB_LIST--
PREFIX=/usr/local LOCALBASE=/usr/local  DATADIR=/usr/local/share/hpx DOCSDIR=/usr/local/share/doc/hpx EXAMPLESDIR=/usr/local/share/examples/hpx  WWWDIR=/usr/local/www/hpx ETCDIR=/usr/local/etc/hpx
--End SUB_LIST--

---Begin make.conf---
USE_PACKAGE_DEPENDS=yes
BATCH=yes
WRKDIRPREFIX=/wrkdirs
PORTSDIR=/usr/ports
PACKAGES=/packages
DISTDIR=/distfiles
PACKAGE_BUILDING=yes
PACKAGE_BUILDING_FLAVORS=yes
#### /usr/local/etc/poudriere.d/make.conf ####
# XXX: We really need this but cannot use it while 'make checksum' does not
# try the next mirror on checksum failure.  It currently retries the same
# failed mirror and then fails rather then trying another.  It *does*
# try the next if the size is mismatched though.
#MASTER_SITE_FREEBSD=yes
# Build ALLOW_MAKE_JOBS_PACKAGES with 2 jobs
MAKE_JOBS_NUMBER=2
#### /usr/ports/Mk/Scripts/ports_env.sh ####
_CCVERSION_921dbbb2=cc (GCC) 4.2.1 20070831 patched [FreeBSD] Copyright (C) 2007 Free Software Foundation, Inc. This is free software; see the source for copying conditions. There is NO warranty; not even for MERCHANTABILITY or FITNESS FOR A PARTICULAR PURPOSE.
_ALTCCVERSION_921dbbb2=none
_CXXINTERNAL_acaad9ca=Using built-in specs. Target: powerpc64-undermydesk-freebsd Configured with: FreeBSD/powerpc64 system compiler Thread model: posix gcc version 4.2.1 20070831 patched [FreeBSD] "/usr/bin/ld" "--eh-frame-hdr" "-Qy" "-melf64ppc_fbsd" "--enable-new-dtags" "-dynamic-linker" "/libexec/ld-elf.so.1" "/usr/lib/crt1.o" "/usr/lib/crti.o" "/usr/lib/crtbegin.o" "-L/usr/lib" "-L/usr/lib" "/dev/null" "-lstdc++" "-lm" "-lgcc_s" "-lgcc" "-lc" "-lgcc_s" "-lgcc" "/usr/lib/crtsavres.o" "/usr/lib/crtend.o" "/usr/lib/crtn.o"
CC_OUTPUT_921dbbb2_58173849=yes
CC_OUTPUT_921dbbb2_9bdba57c=yes
CC_OUTPUT_921dbbb2_6a4fe7f5=cc1: error: unrecognized command line option "-std=c11"
CC_OUTPUT_921dbbb2_6bcac02b=yes
CC_OUTPUT_921dbbb2_67d20829=yes
CC_OUTPUT_921dbbb2_bfa62e83=cc1: error: unrecognized command line option "-std=gnu11"
CC_OUTPUT_921dbbb2_f0b4d593=yes
CC_OUTPUT_921dbbb2_308abb44=cc1plus: error: unrecognized command line option "-std=c++0x"
CC_OUTPUT_921dbbb2_f00456e5=cc1plus: error: unrecognized command line option "-std=c++11"
CC_OUTPUT_921dbbb2_65ad290d=cc1plus: error: unrecognized command line option "-std=c++14"
CC_OUTPUT_921dbbb2_f2776b26=cc1plus: error: unrecognized command line option "-std=c++17"
CC_OUTPUT_921dbbb2_b2657cc3=yes
CC_OUTPUT_921dbbb2_380987f7=cc1plus: error: unrecognized command line option "-std=gnu++11"
CC_OUTPUT_921dbbb2_160933ec=cc1plus: error: unrecognized command line option "-std=gnu++14"
CC_OUTPUT_921dbbb2_fb62803b=cc1plus: error: unrecognized command line option "-std=gnu++17"
_OBJC_CCVERSION_921dbbb2=cc (GCC) 4.2.1 20070831 patched [FreeBSD] Copyright (C) 2007 Free Software Foundation, Inc. This is free software; see the source for copying conditions. There is NO warranty; not even for MERCHANTABILITY or FITNESS FOR A PARTICULAR PURPOSE.
_OBJC_ALTCCVERSION_921dbbb2=none
ARCH=powerpc64
PPC_ABI=ELFv1
OPSYS=FreeBSD
_OSRELEASE=12.2-RELEASE
OSREL=12.2
OSVERSION=1202000
PYTHONBASE=/usr/local
CONFIGURE_MAX_CMD_LEN=524288
HAVE_PORTS_ENV=1
#### Misc Poudriere ####
GID=0
UID=0
---End make.conf---
--Resource limits--
cpu time               (seconds, -t)  unlimited
file size           (512-blocks, -f)  unlimited
data seg size           (kbytes, -d)  33554432
stack size              (kbytes, -s)  524288
core file size      (512-blocks, -c)  unlimited
max memory size         (kbytes, -m)  unlimited
locked memory           (kbytes, -l)  unlimited
max user processes              (-u)  89999
open files                      (-n)  1024
virtual mem size        (kbytes, -v)  unlimited
swap limit              (kbytes, -w)  unlimited
socket buffer size       (bytes, -b)  unlimited
pseudo-terminals                (-p)  unlimited
kqueues                         (-k)  unlimited
umtx shared locks               (-o)  unlimited
--End resource limits--
=======================<phase: check-sanity   >============================
===>  License BSL accepted by the user
===========================================================================
=======================<phase: pkg-depends    >============================
===>   hpx-1.2.1_4 depends on file: /usr/local/sbin/pkg - not found
===>   Installing existing package /packages/All/pkg-1.16.3.txz
[122powerpc64-quarterly-job-09] Installing pkg-1.16.3...
[122powerpc64-quarterly-job-09] Extracting pkg-1.16.3: .......... done
===>   hpx-1.2.1_4 depends on file: /usr/local/sbin/pkg - found
===>   Returning to build of hpx-1.2.1_4
===========================================================================
=======================<phase: fetch-depends  >============================
===========================================================================
=======================<phase: fetch          >============================
===>  License BSL accepted by the user
===> Fetching all distfiles required by hpx-1.2.1_4 for building
===========================================================================
=======================<phase: checksum       >============================
===>  License BSL accepted by the user
===> Fetching all distfiles required by hpx-1.2.1_4 for building
=> SHA256 Checksum OK for STEllAR-GROUP-hpx-1.2.1_GH0.tar.gz.
===========================================================================
=======================<phase: extract-depends>============================
===========================================================================
=======================<phase: extract        >============================
===>  License BSL accepted by the user
===> Fetching all distfiles required by hpx-1.2.1_4 for building
===>  Extracting for hpx-1.2.1_4
=> SHA256 Checksum OK for STEllAR-GROUP-hpx-1.2.1_GH0.tar.gz.
===========================================================================
=======================<phase: patch-depends  >============================
===========================================================================
=======================<phase: patch          >============================
===>  Patching for hpx-1.2.1_4
===>  Applying FreeBSD patches for hpx-1.2.1_4 from /usr/ports/devel/hpx/files
===========================================================================
=======================<phase: build-depends  >============================
===>   hpx-1.2.1_4 depends on file: /usr/local/bin/cmake - not found
===>   Installing existing package /packages/All/cmake-3.19.6.txz
[122powerpc64-quarterly-job-09] Installing cmake-3.19.6...
[122powerpc64-quarterly-job-09] `-- Installing curl-7.76.0...
[122powerpc64-quarterly-job-09] |   `-- Installing ca_root_nss-3.63...
[122powerpc64-quarterly-job-09] |   `-- Extracting ca_root_nss-3.63: ........ done
[122powerpc64-quarterly-job-09] |   `-- Installing libnghttp2-1.43.0...
[122powerpc64-quarterly-job-09] |   | `-- Installing gcc10-10.2.0_1...
[122powerpc64-quarterly-job-09] |   |   `-- Installing binutils-2.33.1_4,1...
[122powerpc64-quarterly-job-09] |   |   | `-- Installing gettext-runtime-0.21...
[122powerpc64-quarterly-job-09] |   |   |   `-- Installing indexinfo-0.3.1...
[122powerpc64-quarterly-job-09] |   |   |   `-- Extracting indexinfo-0.3.1: .... done
[122powerpc64-quarterly-job-09] |   |   | `-- Extracting gettext-runtime-0.21: .......... done
[122powerpc64-quarterly-job-09] |   |   `-- Extracting binutils-2.33.1_4,1: .......... done
[122powerpc64-quarterly-job-09] |   |   `-- Installing gcc9-9.3.0_3...
[122powerpc64-quarterly-job-09] |   |   | `-- Installing gmp-6.2.1...
[122powerpc64-quarterly-job-09] |   |   | `-- Extracting gmp-6.2.1: .......... done
[122powerpc64-quarterly-job-09] |   |   | `-- Installing mpc-1.2.0...
[122powerpc64-quarterly-job-09] |   |   |   `-- Installing mpfr-4.1.0...
[122powerpc64-quarterly-job-09] |   |   |   `-- Extracting mpfr-4.1.0: .......... done
<snip>
[187/231] /usr/local/bin/g++10 -DBOOST_DISABLE_ASSERTS -DHPX_COMPONENT_NAME=hpx -DHPX_DISABLE_ASSERTS -DHPX_ENABLE_ASSERT_HANDLER -DHPX_EXPORTS -D_GNU_SOURCE -Dhpx_EXPORTS -I/wrkdirs/usr/ports/devel/hpx/work/hpx-1.2.1 -I. -O2 -pipe  -fstack-protector-strong -Wl,-rpath=/usr/local/lib/gcc10  -Wl,-rpath=/usr/local/lib/gcc10 -O2 -pipe  -fstack-protector-strong -Wl,-rpath=/usr/local/lib/gcc10  -Wl,-rpath=/usr/local/lib/gcc10 -fPIC -pthread -Wall -Wextra -Wno-unused-local-typedefs -Wno-strict-aliasing -Wno-sign-promo -Wno-attributes -Wno-cast-align -Wno-unused-parameter -Wformat=2 -Wno-format-nonliteral -Winit-self -Wdouble-promotion -Wcast-qual -Wcast-align -Werror=trampolines -Werror=parentheses -Werror=reorder -Werror=return-type -Werror=sequence-point -Werror=uninitialized -Werror=format -Werror=missing-braces -Werror=sign-compare -fdiagnostics-show-option -Werror=vla -Wno-unused-but-set-parameter -Wno-unused-but-set-variable -Wno-maybe-uninitialized -Wno-sync-nand -Wno-delete-non-virt
 ual-dtor -fvisibility=hidden -std=c++17 -MD -MT src/CMakeFiles/hpx.dir/__/plugins/parcelport/tcp/parcelport_tcp.cpp.o -MF src/CMakeFiles/hpx.dir/__/plugins/parcelport/tcp/parcelport_tcp.cpp.o.d -o src/CMakeFiles/hpx.dir/__/plugins/parcelport/tcp/parcelport_tcp.cpp.o -c /wrkdirs/usr/ports/devel/hpx/work/hpx-1.2.1/plugins/parcelport/tcp/parcelport_tcp.cpp
In file included from /usr/local/include/boost/detail/endian.hpp:9,
                 from /wrkdirs/usr/ports/devel/hpx/work/hpx-1.2.1/hpx/util/integer/endian.hpp:25,
                 from /wrkdirs/usr/ports/devel/hpx/work/hpx-1.2.1/hpx/runtime/parcelset/parcel_buffer.hpp:13,
                 from /wrkdirs/usr/ports/devel/hpx/work/hpx-1.2.1/hpx/runtime/parcelset/encode_parcels.hpp:18,
                 from /wrkdirs/usr/ports/devel/hpx/work/hpx-1.2.1/hpx/runtime/parcelset/parcelport_impl.hpp:18,
                 from /wrkdirs/usr/ports/devel/hpx/work/hpx-1.2.1/hpx/plugins/parcelport/tcp/connection_handler.hpp:20,
                 from /wrkdirs/usr/ports/devel/hpx/work/hpx-1.2.1/plugins/parcelport/tcp/parcelport_tcp.cpp:11:
/usr/local/include/boost/predef/detail/endian_compat.h:11:161: note: '#pragma message: The use of BOOST_*_ENDIAN and BOOST_BYTE_ORDER is deprecated. Please include <boost/predef/other/endian.h> and use BOOST_ENDIAN_*_BYTE instead'
   11 | #pragma message("The use of BOOST_*_ENDIAN and BOOST_BYTE_ORDER is deprecated. Please include <boost/predef/other/endian.h> and use BOOST_ENDIAN_*_BYTE instead")
      |                                                                                                                                                                 ^
[188/231] /usr/local/bin/g++10 -DBOOST_DISABLE_ASSERTS -DHPX_COMPONENT_NAME=hpx -DHPX_DISABLE_ASSERTS -DHPX_ENABLE_ASSERT_HANDLER -DHPX_EXPORTS -D_GNU_SOURCE -Dhpx_EXPORTS -I/wrkdirs/usr/ports/devel/hpx/work/hpx-1.2.1 -I. -O2 -pipe  -fstack-protector-strong -Wl,-rpath=/usr/local/lib/gcc10  -Wl,-rpath=/usr/local/lib/gcc10 -O2 -pipe  -fstack-protector-strong -Wl,-rpath=/usr/local/lib/gcc10  -Wl,-rpath=/usr/local/lib/gcc10 -fPIC -pthread -Wall -Wextra -Wno-unused-local-typedefs -Wno-strict-aliasing -Wno-sign-promo -Wno-attributes -Wno-cast-align -Wno-unused-parameter -Wformat=2 -Wno-format-nonliteral -Winit-self -Wdouble-promotion -Wcast-qual -Wcast-align -Werror=trampolines -Werror=parentheses -Werror=reorder -Werror=return-type -Werror=sequence-point -Werror=uninitialized -Werror=format -Werror=missing-braces -Werror=sign-compare -fdiagnostics-show-option -Werror=vla -Wno-unused-but-set-parameter -Wno-unused-but-set-variable -Wno-maybe-uninitialized -Wno-sync-nand -Wno-delete-non-virt
 ual-dtor -fvisibility=hidden -std=c++17 -MD -MT src/CMakeFiles/hpx.dir/__/plugins/parcelport/tcp/connection_handler_tcp.cpp.o -MF src/CMakeFiles/hpx.dir/__/plugins/parcelport/tcp/connection_handler_tcp.cpp.o.d -o src/CMakeFiles/hpx.dir/__/plugins/parcelport/tcp/connection_handler_tcp.cpp.o -c /wrkdirs/usr/ports/devel/hpx/work/hpx-1.2.1/plugins/parcelport/tcp/connection_handler_tcp.cpp
In file included from /usr/local/include/boost/detail/endian.hpp:9,
                 from /wrkdirs/usr/ports/devel/hpx/work/hpx-1.2.1/hpx/util/integer/endian.hpp:25,
                 from /wrkdirs/usr/ports/devel/hpx/work/hpx-1.2.1/hpx/runtime/parcelset/parcel_buffer.hpp:13,
                 from /wrkdirs/usr/ports/devel/hpx/work/hpx-1.2.1/hpx/runtime/parcelset/encode_parcels.hpp:18,
                 from /wrkdirs/usr/ports/devel/hpx/work/hpx-1.2.1/hpx/runtime/parcelset/parcelport_impl.hpp:18,
                 from /wrkdirs/usr/ports/devel/hpx/work/hpx-1.2.1/hpx/plugins/parcelport/tcp/connection_handler.hpp:20,
                 from /wrkdirs/usr/ports/devel/hpx/work/hpx-1.2.1/plugins/parcelport/tcp/connection_handler_tcp.cpp:16:
/usr/local/include/boost/predef/detail/endian_compat.h:11:161: note: '#pragma message: The use of BOOST_*_ENDIAN and BOOST_BYTE_ORDER is deprecated. Please include <boost/predef/other/endian.h> and use BOOST_ENDIAN_*_BYTE instead'
   11 | #pragma message("The use of BOOST_*_ENDIAN and BOOST_BYTE_ORDER is deprecated. Please include <boost/predef/other/endian.h> and use BOOST_ENDIAN_*_BYTE instead")
      |                                                                                                                                                                 ^
[189/231] : && /usr/local/bin/g++10 -fPIC -O2 -pipe  -fstack-protector-strong -Wl,-rpath=/usr/local/lib/gcc10  -Wl,-rpath=/usr/local/lib/gcc10 -O2 -pipe  -fstack-protector-strong -Wl,-rpath=/usr/local/lib/gcc10  -Wl,-rpath=/usr/local/lib/gcc10  -latomic -fstack-protector-strong -Wl,-rpath=/usr/local/lib/gcc10 -L/usr/local/lib/gcc10 -Wl,-z,defs -fvisibility=hidden -shared -Wl,-soname,libhpx.so.1 -o lib/libhpx.so.1.2.1 src/CMakeFiles/hpx.dir/error_code.cpp.o src/CMakeFiles/hpx.dir/exception.cpp.o src/CMakeFiles/hpx.dir/exception_list.cpp.o src/CMakeFiles/hpx.dir/hpx_init.cpp.o src/CMakeFiles/hpx.dir/runtime.cpp.o src/CMakeFiles/hpx.dir/runtime_impl.cpp.o src/CMakeFiles/hpx.dir/state.cpp.o src/CMakeFiles/hpx.dir/throw_exception.cpp.o src/CMakeFiles/hpx.dir/version.cpp.o src/CMakeFiles/hpx.dir/pre_main.cpp.o src/CMakeFiles/hpx.dir/runtime/actions/base_action.cpp.o src/CMakeFiles/hpx.dir/runtime/actions/continuation.cpp.o src/CMakeFiles/hpx.dir/runtime/actions/detail/action_factory.cpp.o 
 src/CMakeFiles/hpx.dir/runtime/actions/detail/invocation_count_registry.cpp.o src/CMakeFiles/hpx.dir/runtime/agas/addressing_service.cpp.o src/CMakeFiles/hpx.dir/runtime/agas/big_boot_barrier.cpp.o src/CMakeFiles/hpx.dir/runtime/agas/component_namespace.cpp.o src/CMakeFiles/hpx.dir/runtime/agas/detail/bootstrap_component_namespace.cpp.o src/CMakeFiles/hpx.dir/runtime/agas/detail/bootstrap_locality_namespace.cpp.o src/CMakeFiles/hpx.dir/runtime/agas/detail/hosted_component_namespace.cpp.o src/CMakeFiles/hpx.dir/runtime/agas/detail/hosted_locality_namespace.cpp.o src/CMakeFiles/hpx.dir/runtime/agas/interface.cpp.o src/CMakeFiles/hpx.dir/runtime/agas/locality_namespace.cpp.o src/CMakeFiles/hpx.dir/runtime/agas/primary_namespace.cpp.o src/CMakeFiles/hpx.dir/runtime/agas/server/component_namespace_server.cpp.o src/CMakeFiles/hpx.dir/runtime/agas/server/locality_namespace_server.cpp.o src/CMakeFiles/hpx.dir/runtime/agas/server/primary_namespace_server.cpp.o src/CMakeFiles/hpx.dir/runtime/
 agas/server/route.cpp.o src/CMakeFiles/hpx.d!
 ir/runtime/agas/server/symbol_namespace_server.cpp.o src/CMakeFiles/hpx.dir/runtime/agas/symbol_namespace.cpp.o src/CMakeFiles/hpx.dir/runtime/applier/applier.cpp.o src/CMakeFiles/hpx.dir/runtime/applier/bind_naming_wrappers.cpp.o src/CMakeFiles/hpx.dir/runtime/components/binpacking_distribution_policy.cpp.o src/CMakeFiles/hpx.dir/runtime/components/component_type.cpp.o src/CMakeFiles/hpx.dir/runtime/components/console_error_sink.cpp.o src/CMakeFiles/hpx.dir/runtime/components/console_logging.cpp.o src/CMakeFiles/hpx.dir/runtime/components/memory.cpp.o src/CMakeFiles/hpx.dir/runtime/components/runtime_support.cpp.o src/CMakeFiles/hpx.dir/runtime/components/server/component_base.cpp.o src/CMakeFiles/hpx.dir/runtime/components/server/console_error_sink_server.cpp.o src/CMakeFiles/hpx.dir/runtime/components/server/console_error_sink_singleton.cpp.o src/CMakeFiles/hpx.dir/runtime/components/server/console_logging_server.cpp.o src/CMakeFiles/hpx.dir/runtime/components/server/destroy_comp
 onent.cpp.o src/CMakeFiles/hpx.dir/runtime/components/server/runtime_support_server.cpp.o src/CMakeFiles/hpx.dir/runtime/components/server/wrapper_heap.cpp.o src/CMakeFiles/hpx.dir/runtime/components/stubs/memory_stub.cpp.o src/CMakeFiles/hpx.dir/runtime/components/stubs/runtime_support_stubs.cpp.o src/CMakeFiles/hpx.dir/runtime/get_locality_name.cpp.o src/CMakeFiles/hpx.dir/runtime/launch_policy.cpp.o src/CMakeFiles/hpx.dir/runtime/naming/address.cpp.o src/CMakeFiles/hpx.dir/runtime/naming/name.cpp.o src/CMakeFiles/hpx.dir/runtime/parcelset/detail/parcel_await.cpp.o src/CMakeFiles/hpx.dir/runtime/parcelset/detail/parcel_route_handler.cpp.o src/CMakeFiles/hpx.dir/runtime/parcelset/detail/per_action_data_counter.cpp.o src/CMakeFiles/hpx.dir/runtime/parcelset/detail/per_action_data_counter_registry.cpp.o src/CMakeFiles/hpx.dir/runtime/parcelset/locality.cpp.o src/CMakeFiles/hpx.dir/runtime/parcelset/parcel.cpp.o src/CMakeFiles/hpx.dir/runtime/parcelset/parcelhandler.cpp.o src/CMakeFil
 es/hpx.dir/runtime/parcelset/parcelport.cpp.!
 o src/CMa!
 keFiles/hpx.dir/runtime/parcelset/put_parcel.cpp.o src/CMakeFiles/hpx.dir/runtime/resource/detail/detail_partitioner.cpp.o src/CMakeFiles/hpx.dir/runtime/resource/partitioner.cpp.o src/CMakeFiles/hpx.dir/runtime/serialization/detail/polymorphic_id_factory.cpp.o src/CMakeFiles/hpx.dir/runtime/serialization/detail/polymorphic_intrusive_factory.cpp.o src/CMakeFiles/hpx.dir/runtime/serialization/detail/polymorphic_nonintrusive_factory.cpp.o src/CMakeFiles/hpx.dir/runtime/serialization/output_archive.cpp.o src/CMakeFiles/hpx.dir/runtime/set_parcel_write_handler.cpp.o src/CMakeFiles/hpx.dir/runtime/threads/coroutines/detail/context_base.cpp.o src/CMakeFiles/hpx.dir/runtime/threads/coroutines/detail/context_generic_context.cpp.o src/CMakeFiles/hpx.dir/runtime/threads/coroutines/detail/coroutine_impl.cpp.o src/CMakeFiles/hpx.dir/runtime/threads/coroutines/detail/coroutine_self.cpp.o src/CMakeFiles/hpx.dir/runtime/threads/coroutines/detail/tss.cpp.o src/CMakeFiles/hpx.dir/runtime/threads/cor
 outines/swapcontext.cpp.o src/CMakeFiles/hpx.dir/runtime/threads/cpu_mask.cpp.o src/CMakeFiles/hpx.dir/runtime/threads/detail/io_service_thread_pool.cpp.o src/CMakeFiles/hpx.dir/runtime/threads/detail/scheduled_thread_pool.cpp.o src/CMakeFiles/hpx.dir/runtime/threads/detail/thread_num_tss.cpp.o src/CMakeFiles/hpx.dir/runtime/threads/executors/current_executor.cpp.o src/CMakeFiles/hpx.dir/runtime/threads/executors/default_executor.cpp.o src/CMakeFiles/hpx.dir/runtime/threads/executors/pool_executor.cpp.o src/CMakeFiles/hpx.dir/runtime/threads/executors/service_executor.cpp.o src/CMakeFiles/hpx.dir/runtime/threads/executors/this_thread_executors.cpp.o src/CMakeFiles/hpx.dir/runtime/threads/executors/thread_pool_attached_executors.cpp.o src/CMakeFiles/hpx.dir/runtime/threads/executors/thread_pool_executors.cpp.o src/CMakeFiles/hpx.dir/runtime/threads/executors/thread_pool_os_executors.cpp.o src/CMakeFiles/hpx.dir/runtime/threads/policies/affinity_data.cpp.o src/CMakeFiles/hpx.dir/runti
 me/threads/policies/parse_affinity_options.c!
 pp.o src/!
 CMakeFiles/hpx.dir/runtime/threads/resource_manager.cpp.o src/CMakeFiles/hpx.dir/runtime/threads/scheduler_specific_ptr.cpp.o src/CMakeFiles/hpx.dir/runtime/threads/thread.cpp.o src/CMakeFiles/hpx.dir/runtime/threads/thread_data.cpp.o src/CMakeFiles/hpx.dir/runtime/threads/thread_executor.cpp.o src/CMakeFiles/hpx.dir/runtime/threads/thread_helpers.cpp.o src/CMakeFiles/hpx.dir/runtime/threads/thread_pool_base.cpp.o src/CMakeFiles/hpx.dir/runtime/threads/threadmanager.cpp.o src/CMakeFiles/hpx.dir/runtime/threads/topology.cpp.o src/CMakeFiles/hpx.dir/runtime/trigger_lco.cpp.o src/CMakeFiles/hpx.dir/performance_counters/counter_creators.cpp.o src/CMakeFiles/hpx.dir/performance_counters/counter_parser.cpp.o src/CMakeFiles/hpx.dir/performance_counters/counters.cpp.o src/CMakeFiles/hpx.dir/performance_counters/manage_counter.cpp.o src/CMakeFiles/hpx.dir/performance_counters/manage_counter_type.cpp.o src/CMakeFiles/hpx.dir/performance_counters/performance_counter.cpp.o src/CMakeFiles/hpx.di
 r/performance_counters/performance_counter_set.cpp.o src/CMakeFiles/hpx.dir/performance_counters/registry.cpp.o src/CMakeFiles/hpx.dir/performance_counters/server/action_invocation_counter.cpp.o src/CMakeFiles/hpx.dir/performance_counters/server/arithmetics_counter.cpp.o src/CMakeFiles/hpx.dir/performance_counters/server/arithmetics_counter_extended.cpp.o src/CMakeFiles/hpx.dir/performance_counters/server/component_instance_counter.cpp.o src/CMakeFiles/hpx.dir/performance_counters/server/elapsed_time_counter.cpp.o src/CMakeFiles/hpx.dir/performance_counters/server/per_action_data_counters.cpp.o src/CMakeFiles/hpx.dir/performance_counters/server/raw_counter.cpp.o src/CMakeFiles/hpx.dir/performance_counters/server/raw_values_counter.cpp.o src/CMakeFiles/hpx.dir/performance_counters/server/statistics_counter.cpp.o src/CMakeFiles/hpx.dir/performance_counters/stubs/performance_counter_stub.cpp.o src/CMakeFiles/hpx.dir/util/activate_counters.cpp.o src/CMakeFiles/hpx.dir/util/apex.cpp.o sr
 c/CMakeFiles/hpx.dir/util/asio_util.cpp.o sr!
 c/CMakeFi!
 les/hpx.dir/util/backtrace/backtrace.cpp.o src/CMakeFiles/hpx.dir/util/batch_environment.cpp.o src/CMakeFiles/hpx.dir/util/batch_environments/alps_environment.cpp.o src/CMakeFiles/hpx.dir/util/batch_environments/pbs_environment.cpp.o src/CMakeFiles/hpx.dir/util/batch_environments/slurm_environment.cpp.o src/CMakeFiles/hpx.dir/util/command_line_handling.cpp.o src/CMakeFiles/hpx.dir/util/debug/thread_stacktrace.cpp.o src/CMakeFiles/hpx.dir/util/debugging.cpp.o src/CMakeFiles/hpx.dir/util/find_prefix.cpp.o src/CMakeFiles/hpx.dir/util/generate_unique_ids.cpp.o src/CMakeFiles/hpx.dir/util/ini.cpp.o src/CMakeFiles/hpx.dir/util/init_ini_data.cpp.o src/CMakeFiles/hpx.dir/util/integer/int128.cpp.o src/CMakeFiles/hpx.dir/util/integer/uint128.cpp.o src/CMakeFiles/hpx.dir/util/interval_timer.cpp.o src/CMakeFiles/hpx.dir/util/io_service_pool.cpp.o src/CMakeFiles/hpx.dir/util/itt_notify.cpp.o src/CMakeFiles/hpx.dir/util/logging.cpp.o src/CMakeFiles/hpx.dir/util/manage_config.cpp.o src/CMakeFiles/
 hpx.dir/util/map_hostnames.cpp.o src/CMakeFiles/hpx.dir/util/one_size_heap_list.cpp.o src/CMakeFiles/hpx.dir/util/parse_command_line.cpp.o src/CMakeFiles/hpx.dir/util/pool_timer.cpp.o src/CMakeFiles/hpx.dir/util/query_counters.cpp.o src/CMakeFiles/hpx.dir/util/regex_from_pattern.cpp.o src/CMakeFiles/hpx.dir/util/register_locks.cpp.o src/CMakeFiles/hpx.dir/util/register_locks_globally.cpp.o src/CMakeFiles/hpx.dir/util/runtime_configuration.cpp.o src/CMakeFiles/hpx.dir/util/sed_transform.cpp.o src/CMakeFiles/hpx.dir/util/serialize_exception.cpp.o src/CMakeFiles/hpx.dir/util/set_thread_name.cpp.o src/CMakeFiles/hpx.dir/util/static_reinit.cpp.o src/CMakeFiles/hpx.dir/util/thread_aware_timer.cpp.o src/CMakeFiles/hpx.dir/util/thread_description.cpp.o src/CMakeFiles/hpx.dir/util/thread_mapper.cpp.o src/CMakeFiles/hpx.dir/lcos/barrier.cpp.o src/CMakeFiles/hpx.dir/lcos/base_lco.cpp.o src/CMakeFiles/hpx.dir/lcos/base_lco_with_value.cpp.o src/CMakeFiles/hpx.dir/lcos/base_lco_with_value_1.cpp.o
  src/CMakeFiles/hpx.dir/lcos/base_lco_with_v!
 alue_2.cp!
 p.o src/CMakeFiles/hpx.dir/lcos/base_lco_with_value_3.cpp.o src/CMakeFiles/hpx.dir/lcos/detail/barrier_node.cpp.o src/CMakeFiles/hpx.dir/lcos/detail/future_data.cpp.o src/CMakeFiles/hpx.dir/lcos/latch.cpp.o src/CMakeFiles/hpx.dir/lcos/local/composable_guard.cpp.o src/CMakeFiles/hpx.dir/lcos/local/detail/condition_variable.cpp.o src/CMakeFiles/hpx.dir/lcos/local/local_barrier.cpp.o src/CMakeFiles/hpx.dir/lcos/local/mutex.cpp.o src/CMakeFiles/hpx.dir/lcos/promise.cpp.o src/CMakeFiles/hpx.dir/lcos/when_all_fwd.cpp.o src/CMakeFiles/hpx.dir/compute/cuda/cuda_target.cpp.o src/CMakeFiles/hpx.dir/compute/cuda/get_cuda_targets.cpp.o src/CMakeFiles/hpx.dir/compute/host/get_host_targets.cpp.o src/CMakeFiles/hpx.dir/compute/host/host_target.cpp.o src/CMakeFiles/hpx.dir/compute/host/numa_domains.cpp.o src/CMakeFiles/hpx.dir/compat/compat_barrier.cpp.o src/CMakeFiles/hpx.dir/__/plugins/parcelport/tcp/connection_handler_tcp.cpp.o src/CMakeFiles/hpx.dir/__/plugins/parcelport/tcp/parcelport_tcp.cpp.
 o -L/wrkdirs/usr/ports/devel/hpx/work/.build/lib   -L/usr/local/lib -Wl,-rpath,/wrkdirs/usr/ports/devel/hpx/work/.build/lib:/usr/local/lib:  -lrt  /usr/local/lib/libboost_context.so  /usr/local/lib/libboost_thread.so  -pthread  /usr/local/lib/libboost_chrono.so  /usr/local/lib/libboost_atomic.so  /usr/local/lib/libboost_filesystem.so  /usr/local/lib/libboost_program_options.so  /usr/local/lib/libboost_regex.so  /usr/local/lib/libboost_system.so  /usr/local/lib/libboost_date_time.so  /usr/lib/libpthread.so  /usr/local/lib/libboost_context.so  /usr/local/lib/libboost_thread.so  -pthread  /usr/local/lib/libboost_chrono.so  /usr/local/lib/libboost_atomic.so  /usr/local/lib/libboost_filesystem.so  /usr/local/lib/libboost_program_options.so  /usr/local/lib/libboost_regex.so  /usr/local/lib/libboost_system.so  /usr/local/lib/libboost_date_time.so  /usr/local/lib/libhwloc.so  /usr/lib/libpthread.so  /usr/local/lib/libhwloc.so && :
FAILED: lib/libhpx.so.1.2.1 
: && /usr/local/bin/g++10 -fPIC -O2 -pipe  -fstack-protector-strong -Wl,-rpath=/usr/local/lib/gcc10  -Wl,-rpath=/usr/local/lib/gcc10 -O2 -pipe  -fstack-protector-strong -Wl,-rpath=/usr/local/lib/gcc10  -Wl,-rpath=/usr/local/lib/gcc10  -latomic -fstack-protector-strong -Wl,-rpath=/usr/local/lib/gcc10 -L/usr/local/lib/gcc10 -Wl,-z,defs -fvisibility=hidden -shared -Wl,-soname,libhpx.so.1 -o lib/libhpx.so.1.2.1 src/CMakeFiles/hpx.dir/error_code.cpp.o src/CMakeFiles/hpx.dir/exception.cpp.o src/CMakeFiles/hpx.dir/exception_list.cpp.o src/CMakeFiles/hpx.dir/hpx_init.cpp.o src/CMakeFiles/hpx.dir/runtime.cpp.o src/CMakeFiles/hpx.dir/runtime_impl.cpp.o src/CMakeFiles/hpx.dir/state.cpp.o src/CMakeFiles/hpx.dir/throw_exception.cpp.o src/CMakeFiles/hpx.dir/version.cpp.o src/CMakeFiles/hpx.dir/pre_main.cpp.o src/CMakeFiles/hpx.dir/runtime/actions/base_action.cpp.o src/CMakeFiles/hpx.dir/runtime/actions/continuation.cpp.o src/CMakeFiles/hpx.dir/runtime/actions/detail/action_factory.cpp.o src/CMakeF
 iles/hpx.dir/runtime/actions/detail/invocation_count_registry.cpp.o src/CMakeFiles/hpx.dir/runtime/agas/addressing_service.cpp.o src/CMakeFiles/hpx.dir/runtime/agas/big_boot_barrier.cpp.o src/CMakeFiles/hpx.dir/runtime/agas/component_namespace.cpp.o src/CMakeFiles/hpx.dir/runtime/agas/detail/bootstrap_component_namespace.cpp.o src/CMakeFiles/hpx.dir/runtime/agas/detail/bootstrap_locality_namespace.cpp.o src/CMakeFiles/hpx.dir/runtime/agas/detail/hosted_component_namespace.cpp.o src/CMakeFiles/hpx.dir/runtime/agas/detail/hosted_locality_namespace.cpp.o src/CMakeFiles/hpx.dir/runtime/agas/interface.cpp.o src/CMakeFiles/hpx.dir/runtime/agas/locality_namespace.cpp.o src/CMakeFiles/hpx.dir/runtime/agas/primary_namespace.cpp.o src/CMakeFiles/hpx.dir/runtime/agas/server/component_namespace_server.cpp.o src/CMakeFiles/hpx.dir/runtime/agas/server/locality_namespace_server.cpp.o src/CMakeFiles/hpx.dir/runtime/agas/server/primary_namespace_server.cpp.o src/CMakeFiles/hpx.dir/runtime/agas/serve
 r/route.cpp.o src/CMakeFiles/hpx.dir/runtime!
 /agas/server/symbol_namespace_server.cpp.o src/CMakeFiles/hpx.dir/runtime/agas/symbol_namespace.cpp.o src/CMakeFiles/hpx.dir/runtime/applier/applier.cpp.o src/CMakeFiles/hpx.dir/runtime/applier/bind_naming_wrappers.cpp.o src/CMakeFiles/hpx.dir/runtime/components/binpacking_distribution_policy.cpp.o src/CMakeFiles/hpx.dir/runtime/components/component_type.cpp.o src/CMakeFiles/hpx.dir/runtime/components/console_error_sink.cpp.o src/CMakeFiles/hpx.dir/runtime/components/console_logging.cpp.o src/CMakeFiles/hpx.dir/runtime/components/memory.cpp.o src/CMakeFiles/hpx.dir/runtime/components/runtime_support.cpp.o src/CMakeFiles/hpx.dir/runtime/components/server/component_base.cpp.o src/CMakeFiles/hpx.dir/runtime/components/server/console_error_sink_server.cpp.o src/CMakeFiles/hpx.dir/runtime/components/server/console_error_sink_singleton.cpp.o src/CMakeFiles/hpx.dir/runtime/components/server/console_logging_server.cpp.o src/CMakeFiles/hpx.dir/runtime/components/server/destroy_component.cpp.
 o src/CMakeFiles/hpx.dir/runtime/components/server/runtime_support_server.cpp.o src/CMakeFiles/hpx.dir/runtime/components/server/wrapper_heap.cpp.o src/CMakeFiles/hpx.dir/runtime/components/stubs/memory_stub.cpp.o src/CMakeFiles/hpx.dir/runtime/components/stubs/runtime_support_stubs.cpp.o src/CMakeFiles/hpx.dir/runtime/get_locality_name.cpp.o src/CMakeFiles/hpx.dir/runtime/launch_policy.cpp.o src/CMakeFiles/hpx.dir/runtime/naming/address.cpp.o src/CMakeFiles/hpx.dir/runtime/naming/name.cpp.o src/CMakeFiles/hpx.dir/runtime/parcelset/detail/parcel_await.cpp.o src/CMakeFiles/hpx.dir/runtime/parcelset/detail/parcel_route_handler.cpp.o src/CMakeFiles/hpx.dir/runtime/parcelset/detail/per_action_data_counter.cpp.o src/CMakeFiles/hpx.dir/runtime/parcelset/detail/per_action_data_counter_registry.cpp.o src/CMakeFiles/hpx.dir/runtime/parcelset/locality.cpp.o src/CMakeFiles/hpx.dir/runtime/parcelset/parcel.cpp.o src/CMakeFiles/hpx.dir/runtime/parcelset/parcelhandler.cpp.o src/CMakeFiles/hpx.dir
 /runtime/parcelset/parcelport.cpp.o src/CMak!
 eFiles/hp!
 x.dir/runtime/parcelset/put_parcel.cpp.o src/CMakeFiles/hpx.dir/runtime/resource/detail/detail_partitioner.cpp.o src/CMakeFiles/hpx.dir/runtime/resource/partitioner.cpp.o src/CMakeFiles/hpx.dir/runtime/serialization/detail/polymorphic_id_factory.cpp.o src/CMakeFiles/hpx.dir/runtime/serialization/detail/polymorphic_intrusive_factory.cpp.o src/CMakeFiles/hpx.dir/runtime/serialization/detail/polymorphic_nonintrusive_factory.cpp.o src/CMakeFiles/hpx.dir/runtime/serialization/output_archive.cpp.o src/CMakeFiles/hpx.dir/runtime/set_parcel_write_handler.cpp.o src/CMakeFiles/hpx.dir/runtime/threads/coroutines/detail/context_base.cpp.o src/CMakeFiles/hpx.dir/runtime/threads/coroutines/detail/context_generic_context.cpp.o src/CMakeFiles/hpx.dir/runtime/threads/coroutines/detail/coroutine_impl.cpp.o src/CMakeFiles/hpx.dir/runtime/threads/coroutines/detail/coroutine_self.cpp.o src/CMakeFiles/hpx.dir/runtime/threads/coroutines/detail/tss.cpp.o src/CMakeFiles/hpx.dir/runtime/threads/coroutines/sw
 apcontext.cpp.o src/CMakeFiles/hpx.dir/runtime/threads/cpu_mask.cpp.o src/CMakeFiles/hpx.dir/runtime/threads/detail/io_service_thread_pool.cpp.o src/CMakeFiles/hpx.dir/runtime/threads/detail/scheduled_thread_pool.cpp.o src/CMakeFiles/hpx.dir/runtime/threads/detail/thread_num_tss.cpp.o src/CMakeFiles/hpx.dir/runtime/threads/executors/current_executor.cpp.o src/CMakeFiles/hpx.dir/runtime/threads/executors/default_executor.cpp.o src/CMakeFiles/hpx.dir/runtime/threads/executors/pool_executor.cpp.o src/CMakeFiles/hpx.dir/runtime/threads/executors/service_executor.cpp.o src/CMakeFiles/hpx.dir/runtime/threads/executors/this_thread_executors.cpp.o src/CMakeFiles/hpx.dir/runtime/threads/executors/thread_pool_attached_executors.cpp.o src/CMakeFiles/hpx.dir/runtime/threads/executors/thread_pool_executors.cpp.o src/CMakeFiles/hpx.dir/runtime/threads/executors/thread_pool_os_executors.cpp.o src/CMakeFiles/hpx.dir/runtime/threads/policies/affinity_data.cpp.o src/CMakeFiles/hpx.dir/runtime/threads
 /policies/parse_affinity_options.cpp.o src/C!
 MakeFiles!
 /hpx.dir/runtime/threads/resource_manager.cpp.o src/CMakeFiles/hpx.dir/runtime/threads/scheduler_specific_ptr.cpp.o src/CMakeFiles/hpx.dir/runtime/threads/thread.cpp.o src/CMakeFiles/hpx.dir/runtime/threads/thread_data.cpp.o src/CMakeFiles/hpx.dir/runtime/threads/thread_executor.cpp.o src/CMakeFiles/hpx.dir/runtime/threads/thread_helpers.cpp.o src/CMakeFiles/hpx.dir/runtime/threads/thread_pool_base.cpp.o src/CMakeFiles/hpx.dir/runtime/threads/threadmanager.cpp.o src/CMakeFiles/hpx.dir/runtime/threads/topology.cpp.o src/CMakeFiles/hpx.dir/runtime/trigger_lco.cpp.o src/CMakeFiles/hpx.dir/performance_counters/counter_creators.cpp.o src/CMakeFiles/hpx.dir/performance_counters/counter_parser.cpp.o src/CMakeFiles/hpx.dir/performance_counters/counters.cpp.o src/CMakeFiles/hpx.dir/performance_counters/manage_counter.cpp.o src/CMakeFiles/hpx.dir/performance_counters/manage_counter_type.cpp.o src/CMakeFiles/hpx.dir/performance_counters/performance_counter.cpp.o src/CMakeFiles/hpx.dir/performa
 nce_counters/performance_counter_set.cpp.o src/CMakeFiles/hpx.dir/performance_counters/registry.cpp.o src/CMakeFiles/hpx.dir/performance_counters/server/action_invocation_counter.cpp.o src/CMakeFiles/hpx.dir/performance_counters/server/arithmetics_counter.cpp.o src/CMakeFiles/hpx.dir/performance_counters/server/arithmetics_counter_extended.cpp.o src/CMakeFiles/hpx.dir/performance_counters/server/component_instance_counter.cpp.o src/CMakeFiles/hpx.dir/performance_counters/server/elapsed_time_counter.cpp.o src/CMakeFiles/hpx.dir/performance_counters/server/per_action_data_counters.cpp.o src/CMakeFiles/hpx.dir/performance_counters/server/raw_counter.cpp.o src/CMakeFiles/hpx.dir/performance_counters/server/raw_values_counter.cpp.o src/CMakeFiles/hpx.dir/performance_counters/server/statistics_counter.cpp.o src/CMakeFiles/hpx.dir/performance_counters/stubs/performance_counter_stub.cpp.o src/CMakeFiles/hpx.dir/util/activate_counters.cpp.o src/CMakeFiles/hpx.dir/util/apex.cpp.o src/CMakeFil
 es/hpx.dir/util/asio_util.cpp.o src/CMakeFil!
 es/hpx.di!
 r/util/backtrace/backtrace.cpp.o src/CMakeFiles/hpx.dir/util/batch_environment.cpp.o src/CMakeFiles/hpx.dir/util/batch_environments/alps_environment.cpp.o src/CMakeFiles/hpx.dir/util/batch_environments/pbs_environment.cpp.o src/CMakeFiles/hpx.dir/util/batch_environments/slurm_environment.cpp.o src/CMakeFiles/hpx.dir/util/command_line_handling.cpp.o src/CMakeFiles/hpx.dir/util/debug/thread_stacktrace.cpp.o src/CMakeFiles/hpx.dir/util/debugging.cpp.o src/CMakeFiles/hpx.dir/util/find_prefix.cpp.o src/CMakeFiles/hpx.dir/util/generate_unique_ids.cpp.o src/CMakeFiles/hpx.dir/util/ini.cpp.o src/CMakeFiles/hpx.dir/util/init_ini_data.cpp.o src/CMakeFiles/hpx.dir/util/integer/int128.cpp.o src/CMakeFiles/hpx.dir/util/integer/uint128.cpp.o src/CMakeFiles/hpx.dir/util/interval_timer.cpp.o src/CMakeFiles/hpx.dir/util/io_service_pool.cpp.o src/CMakeFiles/hpx.dir/util/itt_notify.cpp.o src/CMakeFiles/hpx.dir/util/logging.cpp.o src/CMakeFiles/hpx.dir/util/manage_config.cpp.o src/CMakeFiles/hpx.dir/ut
 il/map_hostnames.cpp.o src/CMakeFiles/hpx.dir/util/one_size_heap_list.cpp.o src/CMakeFiles/hpx.dir/util/parse_command_line.cpp.o src/CMakeFiles/hpx.dir/util/pool_timer.cpp.o src/CMakeFiles/hpx.dir/util/query_counters.cpp.o src/CMakeFiles/hpx.dir/util/regex_from_pattern.cpp.o src/CMakeFiles/hpx.dir/util/register_locks.cpp.o src/CMakeFiles/hpx.dir/util/register_locks_globally.cpp.o src/CMakeFiles/hpx.dir/util/runtime_configuration.cpp.o src/CMakeFiles/hpx.dir/util/sed_transform.cpp.o src/CMakeFiles/hpx.dir/util/serialize_exception.cpp.o src/CMakeFiles/hpx.dir/util/set_thread_name.cpp.o src/CMakeFiles/hpx.dir/util/static_reinit.cpp.o src/CMakeFiles/hpx.dir/util/thread_aware_timer.cpp.o src/CMakeFiles/hpx.dir/util/thread_description.cpp.o src/CMakeFiles/hpx.dir/util/thread_mapper.cpp.o src/CMakeFiles/hpx.dir/lcos/barrier.cpp.o src/CMakeFiles/hpx.dir/lcos/base_lco.cpp.o src/CMakeFiles/hpx.dir/lcos/base_lco_with_value.cpp.o src/CMakeFiles/hpx.dir/lcos/base_lco_with_value_1.cpp.o src/CMake
 Files/hpx.dir/lcos/base_lco_with_value_2.cpp!
 .o src/CM!
 akeFiles/hpx.dir/lcos/base_lco_with_value_3.cpp.o src/CMakeFiles/hpx.dir/lcos/detail/barrier_node.cpp.o src/CMakeFiles/hpx.dir/lcos/detail/future_data.cpp.o src/CMakeFiles/hpx.dir/lcos/latch.cpp.o src/CMakeFiles/hpx.dir/lcos/local/composable_guard.cpp.o src/CMakeFiles/hpx.dir/lcos/local/detail/condition_variable.cpp.o src/CMakeFiles/hpx.dir/lcos/local/local_barrier.cpp.o src/CMakeFiles/hpx.dir/lcos/local/mutex.cpp.o src/CMakeFiles/hpx.dir/lcos/promise.cpp.o src/CMakeFiles/hpx.dir/lcos/when_all_fwd.cpp.o src/CMakeFiles/hpx.dir/compute/cuda/cuda_target.cpp.o src/CMakeFiles/hpx.dir/compute/cuda/get_cuda_targets.cpp.o src/CMakeFiles/hpx.dir/compute/host/get_host_targets.cpp.o src/CMakeFiles/hpx.dir/compute/host/host_target.cpp.o src/CMakeFiles/hpx.dir/compute/host/numa_domains.cpp.o src/CMakeFiles/hpx.dir/compat/compat_barrier.cpp.o src/CMakeFiles/hpx.dir/__/plugins/parcelport/tcp/connection_handler_tcp.cpp.o src/CMakeFiles/hpx.dir/__/plugins/parcelport/tcp/parcelport_tcp.cpp.o -L/wrkdi
 rs/usr/ports/devel/hpx/work/.build/lib   -L/usr/local/lib -Wl,-rpath,/wrkdirs/usr/ports/devel/hpx/work/.build/lib:/usr/local/lib:  -lrt  /usr/local/lib/libboost_context.so  /usr/local/lib/libboost_thread.so  -pthread  /usr/local/lib/libboost_chrono.so  /usr/local/lib/libboost_atomic.so  /usr/local/lib/libboost_filesystem.so  /usr/local/lib/libboost_program_options.so  /usr/local/lib/libboost_regex.so  /usr/local/lib/libboost_system.so  /usr/local/lib/libboost_date_time.so  /usr/lib/libpthread.so  /usr/local/lib/libboost_context.so  /usr/local/lib/libboost_thread.so  -pthread  /usr/local/lib/libboost_chrono.so  /usr/local/lib/libboost_atomic.so  /usr/local/lib/libboost_filesystem.so  /usr/local/lib/libboost_program_options.so  /usr/local/lib/libboost_regex.so  /usr/local/lib/libboost_system.so  /usr/local/lib/libboost_date_time.so  /usr/local/lib/libhwloc.so  /usr/lib/libpthread.so  /usr/local/lib/libhwloc.so && :
/usr/local/bin/ld: src/CMakeFiles/hpx.dir/runtime/agas/component_namespace.cpp.o: in function `void hpx::set_lco_value<int>(hpx::naming::id_type const&, hpx::naming::address&&, int&&, bool)':
component_namespace.cpp:(.text._ZN3hpx13set_lco_valueIiEEvRKNS_6naming7id_typeEONS1_7addressEOT_b[_ZN3hpx13set_lco_valueIiEEvRKNS_6naming7id_typeEONS1_7addressEOT_b]+0x74): undefined reference to `bool hpx::detail::apply_impl<hpx::lcos::base_lco_with_value<int, int, hpx::traits::detail::managed_component_tag>::set_value_action, int>(hpx::naming::id_type const&, hpx::naming::address&&, hpx::threads::thread_priority, int&&)'
/usr/local/bin/ld: component_namespace.cpp:(.text._ZN3hpx13set_lco_valueIiEEvRKNS_6naming7id_typeEONS1_7addressEOT_b[_ZN3hpx13set_lco_valueIiEEvRKNS_6naming7id_typeEONS1_7addressEOT_b]+0xd8): undefined reference to `bool hpx::detail::apply_impl<hpx::lcos::base_lco_with_value<int, int, hpx::traits::detail::component_tag>::set_value_action, int>(hpx::naming::id_type const&, hpx::naming::address&&, hpx::threads::thread_priority, int&&)'
/usr/local/bin/ld: component_namespace.cpp:(.text._ZN3hpx13set_lco_valueIiEEvRKNS_6naming7id_typeEONS1_7addressEOT_b[_ZN3hpx13set_lco_valueIiEEvRKNS_6naming7id_typeEONS1_7addressEOT_b]+0x120): undefined reference to `bool hpx::detail::apply_impl<hpx::lcos::base_lco_with_value<int, int, hpx::traits::detail::managed_component_tag>::set_value_action, int>(hpx::naming::id_type const&, hpx::naming::address&&, hpx::threads::thread_priority, int&&)'
/usr/local/bin/ld: component_namespace.cpp:(.text._ZN3hpx13set_lco_valueIiEEvRKNS_6naming7id_typeEONS1_7addressEOT_b[_ZN3hpx13set_lco_valueIiEEvRKNS_6naming7id_typeEONS1_7addressEOT_b]+0x170): undefined reference to `bool hpx::detail::apply_impl<hpx::lcos::base_lco_with_value<int, int, hpx::traits::detail::component_tag>::set_value_action, int>(hpx::naming::id_type const&, hpx::naming::address&&, hpx::threads::thread_priority, int&&)'
/usr/local/bin/ld: src/CMakeFiles/hpx.dir/runtime/agas/component_namespace.cpp.o: in function `void hpx::set_lco_value<std::vector<unsigned int, std::allocator<unsigned int> > >(hpx::naming::id_type const&, hpx::naming::address&&, std::vector<unsigned int, std::allocator<unsigned int> >&&, bool)':
component_namespace.cpp:(.text._ZN3hpx13set_lco_valueISt6vectorIjSaIjEEEEvRKNS_6naming7id_typeEONS4_7addressEOT_b[_ZN3hpx13set_lco_valueISt6vectorIjSaIjEEEEvRKNS_6naming7id_typeEONS4_7addressEOT_b]+0x74): undefined reference to `bool hpx::detail::apply_impl<hpx::lcos::base_lco_with_value<std::vector<unsigned int, std::allocator<unsigned int> >, std::vector<unsigned int, std::allocator<unsigned int> >, hpx::traits::detail::managed_component_tag>::set_value_action, std::vector<unsigned int, std::allocator<unsigned int> > >(hpx::naming::id_type const&, hpx::naming::address&&, hpx::threads::thread_priority, std::vector<unsigned int, std::allocator<unsigned int> >&&)'
/usr/local/bin/ld: component_namespace.cpp:(.text._ZN3hpx13set_lco_valueISt6vectorIjSaIjEEEEvRKNS_6naming7id_typeEONS4_7addressEOT_b[_ZN3hpx13set_lco_valueISt6vectorIjSaIjEEEEvRKNS_6naming7id_typeEONS4_7addressEOT_b]+0xd8): undefined reference to `bool hpx::detail::apply_impl<hpx::lcos::base_lco_with_value<std::vector<unsigned int, std::allocator<unsigned int> >, std::vector<unsigned int, std::allocator<unsigned int> >, hpx::traits::detail::component_tag>::set_value_action, std::vector<unsigned int, std::allocator<unsigned int> > >(hpx::naming::id_type const&, hpx::naming::address&&, hpx::threads::thread_priority, std::vector<unsigned int, std::allocator<unsigned int> >&&)'
/usr/local/bin/ld: component_namespace.cpp:(.text._ZN3hpx13set_lco_valueISt6vectorIjSaIjEEEEvRKNS_6naming7id_typeEONS4_7addressEOT_b[_ZN3hpx13set_lco_valueISt6vectorIjSaIjEEEEvRKNS_6naming7id_typeEONS4_7addressEOT_b]+0x120): undefined reference to `bool hpx::detail::apply_impl<hpx::lcos::base_lco_with_value<std::vector<unsigned int, std::allocator<unsigned int> >, std::vector<unsigned int, std::allocator<unsigned int> >, hpx::traits::detail::managed_component_tag>::set_value_action, std::vector<unsigned int, std::allocator<unsigned int> > >(hpx::naming::id_type const&, hpx::naming::address&&, hpx::threads::thread_priority, std::vector<unsigned int, std::allocator<unsigned int> >&&)'
/usr/local/bin/ld: component_namespace.cpp:(.text._ZN3hpx13set_lco_valueISt6vectorIjSaIjEEEEvRKNS_6naming7id_typeEONS4_7addressEOT_b[_ZN3hpx13set_lco_valueISt6vectorIjSaIjEEEEvRKNS_6naming7id_typeEONS4_7addressEOT_b]+0x170): undefined reference to `bool hpx::detail::apply_impl<hpx::lcos::base_lco_with_value<std::vector<unsigned int, std::allocator<unsigned int> >, std::vector<unsigned int, std::allocator<unsigned int> >, hpx::traits::detail::component_tag>::set_value_action, std::vector<unsigned int, std::allocator<unsigned int> > >(hpx::naming::id_type const&, hpx::naming::address&&, hpx::threads::thread_priority, std::vector<unsigned int, std::allocator<unsigned int> >&&)'
/usr/local/bin/ld: src/CMakeFiles/hpx.dir/runtime/agas/component_namespace.cpp.o: in function `void hpx::set_lco_value<bool>(hpx::naming::id_type const&, hpx::naming::address&&, bool&&, bool)':
component_namespace.cpp:(.text._ZN3hpx13set_lco_valueIbEEvRKNS_6naming7id_typeEONS1_7addressEOT_b[_ZN3hpx13set_lco_valueIbEEvRKNS_6naming7id_typeEONS1_7addressEOT_b]+0x74): undefined reference to `bool hpx::detail::apply_impl<hpx::lcos::base_lco_with_value<bool, bool, hpx::traits::detail::managed_component_tag>::set_value_action, bool>(hpx::naming::id_type const&, hpx::naming::address&&, hpx::threads::thread_priority, bool&&)'
/usr/local/bin/ld: component_namespace.cpp:(.text._ZN3hpx13set_lco_valueIbEEvRKNS_6naming7id_typeEONS1_7addressEOT_b[_ZN3hpx13set_lco_valueIbEEvRKNS_6naming7id_typeEONS1_7addressEOT_b]+0xd8): undefined reference to `bool hpx::detail::apply_impl<hpx::lcos::base_lco_with_value<bool, bool, hpx::traits::detail::component_tag>::set_value_action, bool>(hpx::naming::id_type const&, hpx::naming::address&&, hpx::threads::thread_priority, bool&&)'
/usr/local/bin/ld: component_namespace.cpp:(.text._ZN3hpx13set_lco_valueIbEEvRKNS_6naming7id_typeEONS1_7addressEOT_b[_ZN3hpx13set_lco_valueIbEEvRKNS_6naming7id_typeEONS1_7addressEOT_b]+0x120): undefined reference to `bool hpx::detail::apply_impl<hpx::lcos::base_lco_with_value<bool, bool, hpx::traits::detail::managed_component_tag>::set_value_action, bool>(hpx::naming::id_type const&, hpx::naming::address&&, hpx::threads::thread_priority, bool&&)'
/usr/local/bin/ld: component_namespace.cpp:(.text._ZN3hpx13set_lco_valueIbEEvRKNS_6naming7id_typeEONS1_7addressEOT_b[_ZN3hpx13set_lco_valueIbEEvRKNS_6naming7id_typeEONS1_7addressEOT_b]+0x170): undefined reference to `bool hpx::detail::apply_impl<hpx::lcos::base_lco_with_value<bool, bool, hpx::traits::detail::component_tag>::set_value_action, bool>(hpx::naming::id_type const&, hpx::naming::address&&, hpx::threads::thread_priority, bool&&)'
/usr/local/bin/ld: src/CMakeFiles/hpx.dir/runtime/agas/component_namespace.cpp.o: in function `void hpx::set_lco_value<std::__cxx11::basic_string<char, std::char_traits<char>, std::allocator<char> > >(hpx::naming::id_type const&, hpx::naming::address&&, std::__cxx11::basic_string<char, std::char_traits<char>, std::allocator<char> >&&, bool)':
component_namespace.cpp:(.text._ZN3hpx13set_lco_valueINSt7__cxx1112basic_stringIcSt11char_traitsIcESaIcEEEEEvRKNS_6naming7id_typeEONS7_7addressEOT_b[_ZN3hpx13set_lco_valueINSt7__cxx1112basic_stringIcSt11char_traitsIcESaIcEEEEEvRKNS_6naming7id_typeEONS7_7addressEOT_b]+0x74): undefined reference to `bool hpx::detail::apply_impl<hpx::lcos::base_lco_with_value<std::__cxx11::basic_string<char, std::char_traits<char>, std::allocator<char> >, std::__cxx11::basic_string<char, std::char_traits<char>, std::allocator<char> >, hpx::traits::detail::managed_component_tag>::set_value_action, std::__cxx11::basic_string<char, std::char_traits<char>, std::allocator<char> > >(hpx::naming::id_type const&, hpx::naming::address&&, hpx::threads::thread_priority, std::__cxx11::basic_string<char, std::char_traits<char>, std::allocator<char> >&&)'
/usr/local/bin/ld: component_namespace.cpp:(.text._ZN3hpx13set_lco_valueINSt7__cxx1112basic_stringIcSt11char_traitsIcESaIcEEEEEvRKNS_6naming7id_typeEONS7_7addressEOT_b[_ZN3hpx13set_lco_valueINSt7__cxx1112basic_stringIcSt11char_traitsIcESaIcEEEEEvRKNS_6naming7id_typeEONS7_7addressEOT_b]+0xd8): undefined reference to `bool hpx::detail::apply_impl<hpx::lcos::base_lco_with_value<std::__cxx11::basic_string<char, std::char_traits<char>, std::allocator<char> >, std::__cxx11::basic_string<char, std::char_traits<char>, std::allocator<char> >, hpx::traits::detail::component_tag>::set_value_action, std::__cxx11::basic_string<char, std::char_traits<char>, std::allocator<char> > >(hpx::naming::id_type const&, hpx::naming::address&&, hpx::threads::thread_priority, std::__cxx11::basic_string<char, std::char_traits<char>, std::allocator<char> >&&)'
/usr/local/bin/ld: component_namespace.cpp:(.text._ZN3hpx13set_lco_valueINSt7__cxx1112basic_stringIcSt11char_traitsIcESaIcEEEEEvRKNS_6naming7id_typeEONS7_7addressEOT_b[_ZN3hpx13set_lco_valueINSt7__cxx1112basic_stringIcSt11char_traitsIcESaIcEEEEEvRKNS_6naming7id_typeEONS7_7addressEOT_b]+0x120): undefined reference to `bool hpx::detail::apply_impl<hpx::lcos::base_lco_with_value<std::__cxx11::basic_string<char, std::char_traits<char>, std::allocator<char> >, std::__cxx11::basic_string<char, std::char_traits<char>, std::allocator<char> >, hpx::traits::detail::managed_component_tag>::set_value_action, std::__cxx11::basic_string<char, std::char_traits<char>, std::allocator<char> > >(hpx::naming::id_type const&, hpx::naming::address&&, hpx::threads::thread_priority, std::__cxx11::basic_string<char, std::char_traits<char>, std::allocator<char> >&&)'
/usr/local/bin/ld: component_namespace.cpp:(.text._ZN3hpx13set_lco_valueINSt7__cxx1112basic_stringIcSt11char_traitsIcESaIcEEEEEvRKNS_6naming7id_typeEONS7_7addressEOT_b[_ZN3hpx13set_lco_valueINSt7__cxx1112basic_stringIcSt11char_traitsIcESaIcEEEEEvRKNS_6naming7id_typeEONS7_7addressEOT_b]+0x170): undefined reference to `bool hpx::detail::apply_impl<hpx::lcos::base_lco_with_value<std::__cxx11::basic_string<char, std::char_traits<char>, std::allocator<char> >, std::__cxx11::basic_string<char, std::char_traits<char>, std::allocator<char> >, hpx::traits::detail::component_tag>::set_value_action, std::__cxx11::basic_string<char, std::char_traits<char>, std::allocator<char> > >(hpx::naming::id_type const&, hpx::naming::address&&, hpx::threads::thread_priority, std::__cxx11::basic_string<char, std::char_traits<char>, std::allocator<char> >&&)'
/usr/local/bin/ld: src/CMakeFiles/hpx.dir/runtime/agas/component_namespace.cpp.o: in function `void hpx::set_lco_value<unsigned int>(hpx::naming::id_type const&, hpx::naming::address&&, unsigned int&&, bool)':
component_namespace.cpp:(.text._ZN3hpx13set_lco_valueIjEEvRKNS_6naming7id_typeEONS1_7addressEOT_b[_ZN3hpx13set_lco_valueIjEEvRKNS_6naming7id_typeEONS1_7addressEOT_b]+0x74): undefined reference to `bool hpx::detail::apply_impl<hpx::lcos::base_lco_with_value<unsigned int, unsigned int, hpx::traits::detail::managed_component_tag>::set_value_action, unsigned int>(hpx::naming::id_type const&, hpx::naming::address&&, hpx::threads::thread_priority, unsigned int&&)'
/usr/local/bin/ld: component_namespace.cpp:(.text._ZN3hpx13set_lco_valueIjEEvRKNS_6naming7id_typeEONS1_7addressEOT_b[_ZN3hpx13set_lco_valueIjEEvRKNS_6naming7id_typeEONS1_7addressEOT_b]+0xd8): undefined reference to `bool hpx::detail::apply_impl<hpx::lcos::base_lco_with_value<unsigned int, unsigned int, hpx::traits::detail::component_tag>::set_value_action, unsigned int>(hpx::naming::id_type const&, hpx::naming::address&&, hpx::threads::thread_priority, unsigned int&&)'
/usr/local/bin/ld: component_namespace.cpp:(.text._ZN3hpx13set_lco_valueIjEEvRKNS_6naming7id_typeEONS1_7addressEOT_b[_ZN3hpx13set_lco_valueIjEEvRKNS_6naming7id_typeEONS1_7addressEOT_b]+0x120): undefined reference to `bool hpx::detail::apply_impl<hpx::lcos::base_lco_with_value<unsigned int, unsigned int, hpx::traits::detail::managed_component_tag>::set_value_action, unsigned int>(hpx::naming::id_type const&, hpx::naming::address&&, hpx::threads::thread_priority, unsigned int&&)'
/usr/local/bin/ld: component_namespace.cpp:(.text._ZN3hpx13set_lco_valueIjEEvRKNS_6naming7id_typeEONS1_7addressEOT_b[_ZN3hpx13set_lco_valueIjEEvRKNS_6naming7id_typeEONS1_7addressEOT_b]+0x170): undefined reference to `bool hpx::detail::apply_impl<hpx::lcos::base_lco_with_value<unsigned int, unsigned int, hpx::traits::detail::component_tag>::set_value_action, unsigned int>(hpx::naming::id_type const&, hpx::naming::address&&, hpx::threads::thread_priority, unsigned int&&)'
/usr/local/bin/ld: src/CMakeFiles/hpx.dir/runtime/agas/component_namespace.cpp.o: in function `void hpx::set_lco_value<hpx::naming::gid_type>(hpx::naming::id_type const&, hpx::naming::address&&, hpx::naming::gid_type&&, bool)':
component_namespace.cpp:(.text._ZN3hpx13set_lco_valueINS_6naming8gid_typeEEEvRKNS1_7id_typeEONS1_7addressEOT_b[_ZN3hpx13set_lco_valueINS_6naming8gid_typeEEEvRKNS1_7id_typeEONS1_7addressEOT_b]+0x74): undefined reference to `bool hpx::detail::apply_impl<hpx::lcos::base_lco_with_value<hpx::naming::id_type, hpx::naming::gid_type, hpx::traits::detail::managed_component_tag>::set_value_action, hpx::naming::gid_type>(hpx::naming::id_type const&, hpx::naming::address&&, hpx::threads::thread_priority, hpx::naming::gid_type&&)'
/usr/local/bin/ld: component_namespace.cpp:(.text._ZN3hpx13set_lco_valueINS_6naming8gid_typeEEEvRKNS1_7id_typeEONS1_7addressEOT_b[_ZN3hpx13set_lco_valueINS_6naming8gid_typeEEEvRKNS1_7id_typeEONS1_7addressEOT_b]+0xd8): undefined reference to `bool hpx::detail::apply_impl<hpx::lcos::base_lco_with_value<hpx::naming::id_type, hpx::naming::gid_type, hpx::traits::detail::component_tag>::set_value_action, hpx::naming::gid_type>(hpx::naming::id_type const&, hpx::naming::address&&, hpx::threads::thread_priority, hpx::naming::gid_type&&)'
/usr/local/bin/ld: component_namespace.cpp:(.text._ZN3hpx13set_lco_valueINS_6naming8gid_typeEEEvRKNS1_7id_typeEONS1_7addressEOT_b[_ZN3hpx13set_lco_valueINS_6naming8gid_typeEEEvRKNS1_7id_typeEONS1_7addressEOT_b]+0x120): undefined reference to `bool hpx::detail::apply_impl<hpx::lcos::base_lco_with_value<hpx::naming::id_type, hpx::naming::gid_type, hpx::traits::detail::managed_component_tag>::set_value_action, hpx::naming::gid_type>(hpx::naming::id_type const&, hpx::naming::address&&, hpx::threads::thread_priority, hpx::naming::gid_type&&)'
/usr/local/bin/ld: component_namespace.cpp:(.text._ZN3hpx13set_lco_valueINS_6naming8gid_typeEEEvRKNS1_7id_typeEONS1_7addressEOT_b[_ZN3hpx13set_lco_valueINS_6naming8gid_typeEEEvRKNS1_7id_typeEONS1_7addressEOT_b]+0x170): undefined reference to `bool hpx::detail::apply_impl<hpx::lcos::base_lco_with_value<hpx::naming::id_type, hpx::naming::gid_type, hpx::traits::detail::component_tag>::set_value_action, hpx::naming::gid_type>(hpx::naming::id_type const&, hpx::naming::address&&, hpx::threads::thread_priority, hpx::naming::gid_type&&)'
/usr/local/bin/ld: src/CMakeFiles/hpx.dir/runtime/agas/server/symbol_namespace_server.cpp.o: in function `std::enable_if<!std::is_same<hpx::util::decay<hpx::naming::gid_type>::type, hpx::naming::address>::value, void>::type hpx::set_lco_value<hpx::naming::gid_type>(hpx::naming::id_type const&, hpx::naming::gid_type&&, bool)':
symbol_namespace_server.cpp:(.text._ZN3hpx13set_lco_valueINS_6naming8gid_typeEEENSt9enable_ifIXntsrSt7is_sameINS_4util5decayIT_E4typeENS1_7addressEE5valueEvE4typeERKNS1_7id_typeEOS7_b[_ZN3hpx13set_lco_valueINS_6naming8gid_typeEEENSt9enable_ifIXntsrSt7is_sameINS_4util5decayIT_E4typeENS1_7addressEE5valueEvE4typeERKNS1_7id_typeEOS7_b]+0x74): undefined reference to `bool hpx::detail::apply_impl<hpx::lcos::base_lco_with_value<hpx::naming::id_type, hpx::naming::gid_type, hpx::traits::detail::managed_component_tag>::set_value_action, hpx::naming::gid_type>(hpx::naming::id_type const&, hpx::naming::address&&, hpx::threads::thread_priority, hpx::naming::gid_type&&)'
/usr/local/bin/ld: symbol_namespace_server.cpp:(.text._ZN3hpx13set_lco_valueINS_6naming8gid_typeEEENSt9enable_ifIXntsrSt7is_sameINS_4util5decayIT_E4typeENS1_7addressEE5valueEvE4typeERKNS1_7id_typeEOS7_b[_ZN3hpx13set_lco_valueINS_6naming8gid_typeEEENSt9enable_ifIXntsrSt7is_sameINS_4util5decayIT_E4typeENS1_7addressEE5valueEvE4typeERKNS1_7id_typeEOS7_b]+0xe0): undefined reference to `bool hpx::detail::apply_impl<hpx::lcos::base_lco_with_value<hpx::naming::id_type, hpx::naming::gid_type, hpx::traits::detail::managed_component_tag>::set_value_action, hpx::naming::gid_type>(hpx::naming::id_type const&, hpx::naming::address&&, hpx::threads::thread_priority, hpx::naming::gid_type&&)'
collect2: error: ld returned 1 exit status
[190/231] /usr/local/bin/g++10 -DBOOST_DISABLE_ASSERTS -DHPX_COMPONENT_EXPORTS -DHPX_COMPONENT_NAME=hpx_component_storage -DHPX_COMPONENT_STRING=\"hpx_component_storage\" -DHPX_DISABLE_ASSERTS -DHPX_MIGRATE_TO_STORAGE_MODULE_EXPORTS -D_GNU_SOURCE -Dcomponent_storage_component_EXPORTS -I/wrkdirs/usr/ports/devel/hpx/work/hpx-1.2.1 -I. -O2 -pipe  -fstack-protector-strong -Wl,-rpath=/usr/local/lib/gcc10  -Wl,-rpath=/usr/local/lib/gcc10 -O2 -pipe  -fstack-protector-strong -Wl,-rpath=/usr/local/lib/gcc10  -Wl,-rpath=/usr/local/lib/gcc10 -fPIC -std=c++17 -MD -MT src/components/component_storage/CMakeFiles/component_storage_component.dir/component_module.cpp.o -MF src/components/component_storage/CMakeFiles/component_storage_component.dir/component_module.cpp.o.d -o src/components/component_storage/CMakeFiles/component_storage_component.dir/component_module.cpp.o -c /wrkdirs/usr/ports/devel/hpx/work/hpx-1.2.1/src/components/component_storage/component_module.cpp
In file included from /wrkdirs/usr/ports/devel/hpx/work/hpx-1.2.1/hpx/throw_exception.hpp:16,
                 from /wrkdirs/usr/ports/devel/hpx/work/hpx-1.2.1/hpx/exception_fwd.hpp:69,
                 from /wrkdirs/usr/ports/devel/hpx/work/hpx-1.2.1/hpx/error_code.hpp:14,
                 from /wrkdirs/usr/ports/devel/hpx/work/hpx-1.2.1/hpx/exception.hpp:14,
                 from /wrkdirs/usr/ports/devel/hpx/work/hpx-1.2.1/hpx/runtime/actions/basic_action.hpp:14,
                 from /wrkdirs/usr/ports/devel/hpx/work/hpx-1.2.1/src/components/component_storage/component_module.cpp:7:
/wrkdirs/usr/ports/devel/hpx/work/hpx-1.2.1/hpx/runtime/actions/basic_action.hpp:861:43: warning: type attributes ignored after type is already defined [-Wattributes]
  861 |         template struct HPX_ALWAYS_EXPORT transfer_action< action>;           \
      |                                           ^~~~~~~~~~~~~~~~~~~~~~~~
/wrkdirs/usr/ports/devel/hpx/work/hpx-1.2.1/hpx/util/detail/pp/expand.hpp:11:26: note: in definition of macro 'HPX_PP_EXPAND'
   11 | #define HPX_PP_EXPAND(x) x
      |                          ^
/wrkdirs/usr/ports/devel/hpx/work/hpx-1.2.1/hpx/util/detail/pp/cat.hpp:29:32: note: in expansion of macro 'HPX_REGISTER_ACTION_2'
   29 | #    define HPX_PP_CAT_I(a, b) a ## b
      |                                ^
/wrkdirs/usr/ports/devel/hpx/work/hpx-1.2.1/hpx/util/detail/pp/cat.hpp:21:30: note: in expansion of macro 'HPX_PP_CAT_I'
   21 | #    define HPX_PP_CAT(a, b) HPX_PP_CAT_I(a, b)
      |                              ^~~~~~~~~~~~
/wrkdirs/usr/ports/devel/hpx/work/hpx-1.2.1/hpx/runtime/actions/basic_action.hpp:849:19: note: in expansion of macro 'HPX_PP_CAT'
  849 |     HPX_PP_EXPAND(HPX_PP_CAT(                                                 \
      |                   ^~~~~~~~~~
/wrkdirs/usr/ports/devel/hpx/work/hpx-1.2.1/hpx/runtime/actions/basic_action.hpp:1077:5: note: in expansion of macro 'HPX_REGISTER_ACTION_'
 1077 |     HPX_REGISTER_ACTION_(__VA_ARGS__)                                         \
      |     ^~~~~~~~~~~~~~~~~~~~
/wrkdirs/usr/ports/devel/hpx/work/hpx-1.2.1/src/components/component_storage/component_module.cpp:25:1: note: in expansion of macro 'HPX_REGISTER_ACTION'
   25 | HPX_REGISTER_ACTION(
      | ^~~~~~~~~~~~~~~~~~~
/wrkdirs/usr/ports/devel/hpx/work/hpx-1.2.1/hpx/runtime/actions/basic_action.hpp:863:13: warning: type attributes ignored after type is already defined [-Wattributes]
  863 |             transfer_continuation_action< action>;                            \
      |             ^~~~~~~~~~~~~~~~~~~~~~~~~~~~~~~~~~~~~
/wrkdirs/usr/ports/devel/hpx/work/hpx-1.2.1/hpx/util/detail/pp/expand.hpp:11:26: note: in definition of macro 'HPX_PP_EXPAND'
   11 | #define HPX_PP_EXPAND(x) x
      |                          ^
/wrkdirs/usr/ports/devel/hpx/work/hpx-1.2.1/hpx/util/detail/pp/cat.hpp:29:32: note: in expansion of macro 'HPX_REGISTER_ACTION_2'
   29 | #    define HPX_PP_CAT_I(a, b) a ## b
      |                                ^
/wrkdirs/usr/ports/devel/hpx/work/hpx-1.2.1/hpx/util/detail/pp/cat.hpp:21:30: note: in expansion of macro 'HPX_PP_CAT_I'
   21 | #    define HPX_PP_CAT(a, b) HPX_PP_CAT_I(a, b)
      |                              ^~~~~~~~~~~~
/wrkdirs/usr/ports/devel/hpx/work/hpx-1.2.1/hpx/runtime/actions/basic_action.hpp:849:19: note: in expansion of macro 'HPX_PP_CAT'
  849 |     HPX_PP_EXPAND(HPX_PP_CAT(                                                 \
      |                   ^~~~~~~~~~
/wrkdirs/usr/ports/devel/hpx/work/hpx-1.2.1/hpx/runtime/actions/basic_action.hpp:1077:5: note: in expansion of macro 'HPX_REGISTER_ACTION_'
 1077 |     HPX_REGISTER_ACTION_(__VA_ARGS__)                                         \
      |     ^~~~~~~~~~~~~~~~~~~~
/wrkdirs/usr/ports/devel/hpx/work/hpx-1.2.1/src/components/component_storage/component_module.cpp:25:1: note: in expansion of macro 'HPX_REGISTER_ACTION'
   25 | HPX_REGISTER_ACTION(
      | ^~~~~~~~~~~~~~~~~~~
/wrkdirs/usr/ports/devel/hpx/work/hpx-1.2.1/hpx/runtime/actions/basic_action.hpp:861:43: warning: type attributes ignored after type is already defined [-Wattributes]
  861 |         template struct HPX_ALWAYS_EXPORT transfer_action< action>;           \
      |                                           ^~~~~~~~~~~~~~~~~~~~~~~~
/wrkdirs/usr/ports/devel/hpx/work/hpx-1.2.1/hpx/util/detail/pp/expand.hpp:11:26: note: in definition of macro 'HPX_PP_EXPAND'
   11 | #define HPX_PP_EXPAND(x) x
      |                          ^
/wrkdirs/usr/ports/devel/hpx/work/hpx-1.2.1/hpx/util/detail/pp/cat.hpp:29:32: note: in expansion of macro 'HPX_REGISTER_ACTION_2'
   29 | #    define HPX_PP_CAT_I(a, b) a ## b
      |                                ^
/wrkdirs/usr/ports/devel/hpx/work/hpx-1.2.1/hpx/util/detail/pp/cat.hpp:21:30: note: in expansion of macro 'HPX_PP_CAT_I'
   21 | #    define HPX_PP_CAT(a, b) HPX_PP_CAT_I(a, b)
      |                              ^~~~~~~~~~~~
/wrkdirs/usr/ports/devel/hpx/work/hpx-1.2.1/hpx/runtime/actions/basic_action.hpp:849:19: note: in expansion of macro 'HPX_PP_CAT'
  849 |     HPX_PP_EXPAND(HPX_PP_CAT(                                                 \
      |                   ^~~~~~~~~~
/wrkdirs/usr/ports/devel/hpx/work/hpx-1.2.1/hpx/runtime/actions/basic_action.hpp:1077:5: note: in expansion of macro 'HPX_REGISTER_ACTION_'
 1077 |     HPX_REGISTER_ACTION_(__VA_ARGS__)                                         \
      |     ^~~~~~~~~~~~~~~~~~~~
/wrkdirs/usr/ports/devel/hpx/work/hpx-1.2.1/src/components/component_storage/component_module.cpp:28:1: note: in expansion of macro 'HPX_REGISTER_ACTION'
   28 | HPX_REGISTER_ACTION(
      | ^~~~~~~~~~~~~~~~~~~
/wrkdirs/usr/ports/devel/hpx/work/hpx-1.2.1/hpx/runtime/actions/basic_action.hpp:863:13: warning: type attributes ignored after type is already defined [-Wattributes]
  863 |             transfer_continuation_action< action>;                            \
      |             ^~~~~~~~~~~~~~~~~~~~~~~~~~~~~~~~~~~~~
/wrkdirs/usr/ports/devel/hpx/work/hpx-1.2.1/hpx/util/detail/pp/expand.hpp:11:26: note: in definition of macro 'HPX_PP_EXPAND'
   11 | #define HPX_PP_EXPAND(x) x
      |                          ^
/wrkdirs/usr/ports/devel/hpx/work/hpx-1.2.1/hpx/util/detail/pp/cat.hpp:29:32: note: in expansion of macro 'HPX_REGISTER_ACTION_2'
   29 | #    define HPX_PP_CAT_I(a, b) a ## b
      |                                ^
/wrkdirs/usr/ports/devel/hpx/work/hpx-1.2.1/hpx/util/detail/pp/cat.hpp:21:30: note: in expansion of macro 'HPX_PP_CAT_I'
   21 | #    define HPX_PP_CAT(a, b) HPX_PP_CAT_I(a, b)
      |                              ^~~~~~~~~~~~
/wrkdirs/usr/ports/devel/hpx/work/hpx-1.2.1/hpx/runtime/actions/basic_action.hpp:849:19: note: in expansion of macro 'HPX_PP_CAT'
  849 |     HPX_PP_EXPAND(HPX_PP_CAT(                                                 \
      |                   ^~~~~~~~~~
/wrkdirs/usr/ports/devel/hpx/work/hpx-1.2.1/hpx/runtime/actions/basic_action.hpp:1077:5: note: in expansion of macro 'HPX_REGISTER_ACTION_'
 1077 |     HPX_REGISTER_ACTION_(__VA_ARGS__)                                         \
      |     ^~~~~~~~~~~~~~~~~~~~
/wrkdirs/usr/ports/devel/hpx/work/hpx-1.2.1/src/components/component_storage/component_module.cpp:28:1: note: in expansion of macro 'HPX_REGISTER_ACTION'
   28 | HPX_REGISTER_ACTION(
      | ^~~~~~~~~~~~~~~~~~~
/wrkdirs/usr/ports/devel/hpx/work/hpx-1.2.1/hpx/runtime/actions/basic_action.hpp:861:43: warning: type attributes ignored after type is already defined [-Wattributes]
  861 |         template struct HPX_ALWAYS_EXPORT transfer_action< action>;           \
      |                                           ^~~~~~~~~~~~~~~~~~~~~~~~
/wrkdirs/usr/ports/devel/hpx/work/hpx-1.2.1/hpx/util/detail/pp/expand.hpp:11:26: note: in definition of macro 'HPX_PP_EXPAND'
   11 | #define HPX_PP_EXPAND(x) x
      |                          ^
/wrkdirs/usr/ports/devel/hpx/work/hpx-1.2.1/hpx/util/detail/pp/cat.hpp:29:32: note: in expansion of macro 'HPX_REGISTER_ACTION_2'
   29 | #    define HPX_PP_CAT_I(a, b) a ## b
      |                                ^
/wrkdirs/usr/ports/devel/hpx/work/hpx-1.2.1/hpx/util/detail/pp/cat.hpp:21:30: note: in expansion of macro 'HPX_PP_CAT_I'
   21 | #    define HPX_PP_CAT(a, b) HPX_PP_CAT_I(a, b)
      |                              ^~~~~~~~~~~~
/wrkdirs/usr/ports/devel/hpx/work/hpx-1.2.1/hpx/runtime/actions/basic_action.hpp:849:19: note: in expansion of macro 'HPX_PP_CAT'
  849 |     HPX_PP_EXPAND(HPX_PP_CAT(                                                 \
      |                   ^~~~~~~~~~
/wrkdirs/usr/ports/devel/hpx/work/hpx-1.2.1/hpx/runtime/actions/basic_action.hpp:1077:5: note: in expansion of macro 'HPX_REGISTER_ACTION_'
 1077 |     HPX_REGISTER_ACTION_(__VA_ARGS__)                                         \
      |     ^~~~~~~~~~~~~~~~~~~~
/wrkdirs/usr/ports/devel/hpx/work/hpx-1.2.1/src/components/component_storage/component_module.cpp:31:1: note: in expansion of macro 'HPX_REGISTER_ACTION'
   31 | HPX_REGISTER_ACTION(
      | ^~~~~~~~~~~~~~~~~~~
/wrkdirs/usr/ports/devel/hpx/work/hpx-1.2.1/hpx/runtime/actions/basic_action.hpp:863:13: warning: type attributes ignored after type is already defined [-Wattributes]
  863 |             transfer_continuation_action< action>;                            \
      |             ^~~~~~~~~~~~~~~~~~~~~~~~~~~~~~~~~~~~~
/wrkdirs/usr/ports/devel/hpx/work/hpx-1.2.1/hpx/util/detail/pp/expand.hpp:11:26: note: in definition of macro 'HPX_PP_EXPAND'
   11 | #define HPX_PP_EXPAND(x) x
      |                          ^
/wrkdirs/usr/ports/devel/hpx/work/hpx-1.2.1/hpx/util/detail/pp/cat.hpp:29:32: note: in expansion of macro 'HPX_REGISTER_ACTION_2'
   29 | #    define HPX_PP_CAT_I(a, b) a ## b
      |                                ^
/wrkdirs/usr/ports/devel/hpx/work/hpx-1.2.1/hpx/util/detail/pp/cat.hpp:21:30: note: in expansion of macro 'HPX_PP_CAT_I'
   21 | #    define HPX_PP_CAT(a, b) HPX_PP_CAT_I(a, b)
      |                              ^~~~~~~~~~~~
/wrkdirs/usr/ports/devel/hpx/work/hpx-1.2.1/hpx/runtime/actions/basic_action.hpp:849:19: note: in expansion of macro 'HPX_PP_CAT'
  849 |     HPX_PP_EXPAND(HPX_PP_CAT(                                                 \
      |                   ^~~~~~~~~~
/wrkdirs/usr/ports/devel/hpx/work/hpx-1.2.1/hpx/runtime/actions/basic_action.hpp:1077:5: note: in expansion of macro 'HPX_REGISTER_ACTION_'
 1077 |     HPX_REGISTER_ACTION_(__VA_ARGS__)                                         \
      |     ^~~~~~~~~~~~~~~~~~~~
/wrkdirs/usr/ports/devel/hpx/work/hpx-1.2.1/src/components/component_storage/component_module.cpp:31:1: note: in expansion of macro 'HPX_REGISTER_ACTION'
   31 | HPX_REGISTER_ACTION(
      | ^~~~~~~~~~~~~~~~~~~
ninja: build stopped: subcommand failed.
===> Compilation failed unexpectedly.
Try to set MAKE_JOBS_UNSAFE=yes and rebuild before reporting the failure to
the maintainer.
*** Error code 1

Stop.
make: stopped in /usr/ports/devel/hpx
Received on Tue Jun 29 2021 - 05:03:17 UTC

Original text of this message