[package - 122powerpc64-quarterly][devel/cquery] Failed for cquery-20180718_7 in build

From: <pkg-fallout_at_FreeBSD.org>
Date: Tue, 29 Jun 2021 04:23:49 GMT
You are receiving this mail as a port that you maintain
is failing to build on the FreeBSD package build server.
Please investigate the failure and submit a PR to fix
build.

Maintainer:     henry.hu.sh_at_gmail.com
Log URL:        http://foul1.nyi.freebsd.org/data/122powerpc64-quarterly/ae162bd98935/logs/cquery-20180718_7.log
Build URL:      http://foul1.nyi.freebsd.org/build.html?mastername=122powerpc64-quarterly&build=ae162bd98935
Log:

=>> Building devel/cquery
build started at Tue Jun 29 04:20:50 UTC 2021
port directory: /usr/ports/devel/cquery
package name: cquery-20180718_7
building for: FreeBSD 122powerpc64-quarterly-job-06 12.2-RELEASE FreeBSD 12.2-RELEASE powerpc
maintained by: henry.hu.sh_at_gmail.com
Makefile ident: 
Poudriere version: 3.2.8-8-gaf08dbda
Host OSVERSION: 1400008
Jail OSVERSION: 1202000
Job Id: 06

---Begin Environment---
SHELL=/bin/csh
OSVERSION=1202000
UNAME_v=FreeBSD 12.2-RELEASE
UNAME_r=12.2-RELEASE
BLOCKSIZE=K
MAIL=/var/mail/root
STATUS=1
HOME=/root
PATH=/sbin:/bin:/usr/sbin:/usr/bin:/usr/local/sbin:/usr/local/bin:/root/bin
LOCALBASE=/usr/local
USER=root
LIBEXECPREFIX=/usr/local/libexec/poudriere
POUDRIERE_VERSION=3.2.8-8-gaf08dbda
MASTERMNT=/usr/local/poudriere/data/.m/122powerpc64-quarterly/ref
POUDRIERE_BUILD_TYPE=bulk
PACKAGE_BUILDING=yes
SAVED_TERM=
PWD=/usr/local/poudriere/data/.m/122powerpc64-quarterly/ref/.p/pool
P_PORTS_FEATURES=FLAVORS SELECTED_OPTIONS
MASTERNAME=122powerpc64-quarterly
SCRIPTPREFIX=/usr/local/share/poudriere
OLDPWD=/usr/local/poudriere/data/.m/122powerpc64-quarterly/ref/.p
SCRIPTPATH=/usr/local/share/poudriere/bulk.sh
POUDRIEREPATH=/usr/local/bin/poudriere
---End Environment---

---Begin Poudriere Port Flags/Env---
PORT_FLAGS=
PKGENV=
FLAVOR=
DEPENDS_ARGS=
MAKE_ARGS=
---End Poudriere Port Flags/Env---

---Begin OPTIONS List---
---End OPTIONS List---

--MAINTAINER--
henry.hu.sh_at_gmail.com
--End MAINTAINER--

--CONFIGURE_ARGS--

--End CONFIGURE_ARGS--

--CONFIGURE_ENV--
XDG_DATA_HOME=/wrkdirs/usr/ports/devel/cquery/work  XDG_CONFIG_HOME=/wrkdirs/usr/ports/devel/cquery/work  HOME=/wrkdirs/usr/ports/devel/cquery/work TMPDIR="/tmp" PATH=/wrkdirs/usr/ports/devel/cquery/work/.bin:/sbin:/bin:/usr/sbin:/usr/bin:/usr/local/sbin:/usr/local/bin:/root/bin SHELL=/bin/sh CONFIG_SHELL=/bin/sh
--End CONFIGURE_ENV--

--MAKE_ENV--
XDG_DATA_HOME=/wrkdirs/usr/ports/devel/cquery/work  XDG_CONFIG_HOME=/wrkdirs/usr/ports/devel/cquery/work  HOME=/wrkdirs/usr/ports/devel/cquery/work TMPDIR="/tmp" PATH=/wrkdirs/usr/ports/devel/cquery/work/.bin:/sbin:/bin:/usr/sbin:/usr/bin:/usr/local/sbin:/usr/local/bin:/root/bin NO_PIE=yes MK_DEBUG_FILES=no MK_KERNEL_SYMBOLS=no SHELL=/bin/sh NO_LINT=YES ADDR2LINE="/usr/local/bin/addr2line" AR="/usr/local/bin/ar" AS="/usr/local/bin/as" CPPFILT="/usr/local/bin/c++filt" GPROF="/usr/local/bin/gprof" LD="/usr/local/bin/ld" NM="/usr/local/bin/nm" OBJCOPY="/usr/local/bin/objcopy" OBJDUMP="/usr/local/bin/objdump" RANLIB="/usr/local/bin/ranlib" READELF="/usr/local/bin/readelf" SIZE="/usr/local/bin/size" STRINGS="/usr/local/bin/strings" DESTDIR=/wrkdirs/usr/ports/devel/cquery/work/stage PREFIX=/usr/local  LOCALBASE=/usr/local  CC="gcc10" CFLAGS="-O2 -pipe  -fstack-protector-strong -Wl,-rpath=/usr/local/lib/gcc10 -fno-strict-aliasing "  CPP="cpp10" CPPFLAGS=""  LDFLAGS=" -fstack-protector-stron
 g -Wl,-rpath=/usr/local/lib/gcc10 -L/usr/local/lib/gcc10 " LIBS=""  CXX="g++10" CXXFLAGS="-O2 -pipe  -fstack-protector-strong -Wl,-rpath=/usr/local/lib/gcc10  -Wl,-rpath=/usr/local/lib/gcc10 "  MANPREFIX="/usr/local" BSD_INSTALL_PROGRAM="install  -s -m 555"  BSD_INSTALL_LIB="install  -s -m 0644"  BSD_INSTALL_SCRIPT="install  -m 555"  BSD_INSTALL_DATA="install  -m 0644"  BSD_INSTALL_MAN="install  -m 444"
--End MAKE_ENV--

--PLIST_SUB--
CMAKE_BUILD_TYPE="release" OSREL=12.2 PREFIX=%D LOCALBASE=/usr/local  RESETPREFIX=/usr/local LIB32DIR=lib DOCSDIR="share/doc/cquery"  EXAMPLESDIR="share/examples/cquery"  DATADIR="share/cquery"  WWWDIR="www/cquery"  ETCDIR="etc/cquery"
--End PLIST_SUB--

--SUB_LIST--
PREFIX=/usr/local LOCALBASE=/usr/local  DATADIR=/usr/local/share/cquery DOCSDIR=/usr/local/share/doc/cquery EXAMPLESDIR=/usr/local/share/examples/cquery  WWWDIR=/usr/local/www/cquery ETCDIR=/usr/local/etc/cquery
--End SUB_LIST--

---Begin make.conf---
USE_PACKAGE_DEPENDS=yes
BATCH=yes
WRKDIRPREFIX=/wrkdirs
PORTSDIR=/usr/ports
PACKAGES=/packages
DISTDIR=/distfiles
PACKAGE_BUILDING=yes
PACKAGE_BUILDING_FLAVORS=yes
#### /usr/local/etc/poudriere.d/make.conf ####
# XXX: We really need this but cannot use it while 'make checksum' does not
# try the next mirror on checksum failure.  It currently retries the same
# failed mirror and then fails rather then trying another.  It *does*
# try the next if the size is mismatched though.
#MASTER_SITE_FREEBSD=yes
# Build ALLOW_MAKE_JOBS_PACKAGES with 2 jobs
MAKE_JOBS_NUMBER=2
#### /usr/ports/Mk/Scripts/ports_env.sh ####
_CCVERSION_921dbbb2=cc (GCC) 4.2.1 20070831 patched [FreeBSD] Copyright (C) 2007 Free Software Foundation, Inc. This is free software; see the source for copying conditions. There is NO warranty; not even for MERCHANTABILITY or FITNESS FOR A PARTICULAR PURPOSE.
_ALTCCVERSION_921dbbb2=none
_CXXINTERNAL_acaad9ca=Using built-in specs. Target: powerpc64-undermydesk-freebsd Configured with: FreeBSD/powerpc64 system compiler Thread model: posix gcc version 4.2.1 20070831 patched [FreeBSD] "/usr/bin/ld" "--eh-frame-hdr" "-Qy" "-melf64ppc_fbsd" "--enable-new-dtags" "-dynamic-linker" "/libexec/ld-elf.so.1" "/usr/lib/crt1.o" "/usr/lib/crti.o" "/usr/lib/crtbegin.o" "-L/usr/lib" "-L/usr/lib" "/dev/null" "-lstdc++" "-lm" "-lgcc_s" "-lgcc" "-lc" "-lgcc_s" "-lgcc" "/usr/lib/crtsavres.o" "/usr/lib/crtend.o" "/usr/lib/crtn.o"
CC_OUTPUT_921dbbb2_58173849=yes
CC_OUTPUT_921dbbb2_9bdba57c=yes
CC_OUTPUT_921dbbb2_6a4fe7f5=cc1: error: unrecognized command line option "-std=c11"
CC_OUTPUT_921dbbb2_6bcac02b=yes
CC_OUTPUT_921dbbb2_67d20829=yes
CC_OUTPUT_921dbbb2_bfa62e83=cc1: error: unrecognized command line option "-std=gnu11"
CC_OUTPUT_921dbbb2_f0b4d593=yes
CC_OUTPUT_921dbbb2_308abb44=cc1plus: error: unrecognized command line option "-std=c++0x"
CC_OUTPUT_921dbbb2_f00456e5=cc1plus: error: unrecognized command line option "-std=c++11"
CC_OUTPUT_921dbbb2_65ad290d=cc1plus: error: unrecognized command line option "-std=c++14"
CC_OUTPUT_921dbbb2_f2776b26=cc1plus: error: unrecognized command line option "-std=c++17"
CC_OUTPUT_921dbbb2_b2657cc3=yes
CC_OUTPUT_921dbbb2_380987f7=cc1plus: error: unrecognized command line option "-std=gnu++11"
CC_OUTPUT_921dbbb2_160933ec=cc1plus: error: unrecognized command line option "-std=gnu++14"
CC_OUTPUT_921dbbb2_fb62803b=cc1plus: error: unrecognized command line option "-std=gnu++17"
_OBJC_CCVERSION_921dbbb2=cc (GCC) 4.2.1 20070831 patched [FreeBSD] Copyright (C) 2007 Free Software Foundation, Inc. This is free software; see the source for copying conditions. There is NO warranty; not even for MERCHANTABILITY or FITNESS FOR A PARTICULAR PURPOSE.
_OBJC_ALTCCVERSION_921dbbb2=none
ARCH=powerpc64
PPC_ABI=ELFv1
OPSYS=FreeBSD
_OSRELEASE=12.2-RELEASE
OSREL=12.2
OSVERSION=1202000
PYTHONBASE=/usr/local
CONFIGURE_MAX_CMD_LEN=524288
HAVE_PORTS_ENV=1
#### Misc Poudriere ####
GID=0
UID=0
---End make.conf---
--Resource limits--
cpu time               (seconds, -t)  unlimited
file size           (512-blocks, -f)  unlimited
data seg size           (kbytes, -d)  33554432
stack size              (kbytes, -s)  524288
core file size      (512-blocks, -c)  unlimited
max memory size         (kbytes, -m)  unlimited
locked memory           (kbytes, -l)  unlimited
max user processes              (-u)  89999
open files                      (-n)  1024
virtual mem size        (kbytes, -v)  unlimited
swap limit              (kbytes, -w)  unlimited
socket buffer size       (bytes, -b)  unlimited
pseudo-terminals                (-p)  unlimited
kqueues                         (-k)  unlimited
umtx shared locks               (-o)  unlimited
--End resource limits--
=======================<phase: check-sanity   >============================
===>  License MIT accepted by the user
===========================================================================
=======================<phase: pkg-depends    >============================
===>   cquery-20180718_7 depends on file: /usr/local/sbin/pkg - not found
===>   Installing existing package /packages/All/pkg-1.16.3.txz
[122powerpc64-quarterly-job-06] Installing pkg-1.16.3...
[122powerpc64-quarterly-job-06] Extracting pkg-1.16.3: .......... done
===>   cquery-20180718_7 depends on file: /usr/local/sbin/pkg - found
===>   Returning to build of cquery-20180718_7
===========================================================================
=======================<phase: fetch-depends  >============================
===========================================================================
=======================<phase: fetch          >============================
===>  License MIT accepted by the user
===> Fetching all distfiles required by cquery-20180718_7 for building
===========================================================================
=======================<phase: checksum       >============================
===>  License MIT accepted by the user
===> Fetching all distfiles required by cquery-20180718_7 for building
=> SHA256 Checksum OK for cquery-project-cquery-v20180718_GH0.tar.gz.
=> SHA256 Checksum OK for miloyip-rapidjson-daabb88_GH0.tar.gz.
=> SHA256 Checksum OK for onqtam-doctest-b40b7e7_GH0.tar.gz.
=> SHA256 Checksum OK for greg7mdp-sparsepp-1ca7189_GH0.tar.gz.
=> SHA256 Checksum OK for msgpack-msgpack-c-208595b_GH0.tar.gz.
=> SHA256 Checksum OK for emilk-loguru-6bf94c_GH0.tar.gz.
=> SHA256 Checksum OK for zeux-pugixml-24a7064_GH0.tar.gz.
===========================================================================
=======================<phase: extract-depends>============================
===========================================================================
=======================<phase: extract        >============================
===>  License MIT accepted by the user
===> Fetching all distfiles required by cquery-20180718_7 for building
===>  Extracting for cquery-20180718_7
=> SHA256 Checksum OK for cquery-project-cquery-v20180718_GH0.tar.gz.
=> SHA256 Checksum OK for miloyip-rapidjson-daabb88_GH0.tar.gz.
=> SHA256 Checksum OK for onqtam-doctest-b40b7e7_GH0.tar.gz.
=> SHA256 Checksum OK for greg7mdp-sparsepp-1ca7189_GH0.tar.gz.
=> SHA256 Checksum OK for msgpack-msgpack-c-208595b_GH0.tar.gz.
=> SHA256 Checksum OK for emilk-loguru-6bf94c_GH0.tar.gz.
=> SHA256 Checksum OK for zeux-pugixml-24a7064_GH0.tar.gz.
===========================================================================
=======================<phase: patch-depends  >============================
===========================================================================
=======================<phase: patch          >============================
===>  Patching for cquery-20180718_7
===========================================================================
=======================<phase: build-depends  >============================
===>   cquery-20180718_7 depends on file: /usr/local/bin/cmake - not found
===>   Installing existing package /packages/All/cmake-3.19.6.txz
[122powerpc64-quarterly-job-06] Installing cmake-3.19.6...
[122powerpc64-quarterly-job-06] `-- Installing curl-7.76.0...
[122powerpc64-quarterly-job-06] |   `-- Installing ca_root_nss-3.63...
[122powerpc64-quarterly-job-06] |   `-- Extracting ca_root_nss-3.63: ........ done
[122powerpc64-quarterly-job-06] |   `-- Installing libnghttp2-1.43.0...
[122powerpc64-quarterly-job-06] |   | `-- Installing gcc10-10.2.0_1...
[122powerpc64-quarterly-job-06] |   |   `-- Installing binutils-2.33.1_4,1...
<snip>
/wrkdirs/usr/ports/devel/cquery/work/cquery-20180718/third_party/rapidjson/include/rapidjson/reader.h:2174:58:   required from 'rapidjson::ParseResult rapidjson::GenericReader<SourceEncoding, TargetEncoding, StackAllocator>::IterativeParse(InputStream&, Handler&) [with unsigned int parseFlags = 0; InputStream = rapidjson::GenericStringStream<rapidjson::UTF8<> >; Handler = rapidjson::GenericDocument<rapidjson::UTF8<> >; SourceEncoding = rapidjson::UTF8<>; TargetEncoding = rapidjson::UTF8<>; StackAllocator = rapidjson::CrtAllocator]'
/wrkdirs/usr/ports/devel/cquery/work/cquery-20180718/third_party/rapidjson/include/rapidjson/reader.h:561:46:   required from 'rapidjson::ParseResult rapidjson::GenericReader<SourceEncoding, TargetEncoding, StackAllocator>::Parse(InputStream&, Handler&) [with unsigned int parseFlags = 0; InputStream = rapidjson::GenericStringStream<rapidjson::UTF8<> >; Handler = rapidjson::GenericDocument<rapidjson::UTF8<> >; SourceEncoding = rapidjson::UTF8<>; TargetEncoding = rapidjson::UTF8<>; StackAllocator = rapidjson::CrtAllocator]'
/wrkdirs/usr/ports/devel/cquery/work/cquery-20180718/third_party/rapidjson/include/rapidjson/document.h:2241:57:   required from 'rapidjson::GenericDocument<Encoding, Allocator, StackAllocator>& rapidjson::GenericDocument<Encoding, Allocator, StackAllocator>::ParseStream(InputStream&) [with unsigned int parseFlags = 0; SourceEncoding = rapidjson::UTF8<>; InputStream = rapidjson::GenericStringStream<rapidjson::UTF8<> >; Encoding = rapidjson::UTF8<>; Allocator = rapidjson::MemoryPoolAllocator<>; StackAllocator = rapidjson::CrtAllocator]'
/wrkdirs/usr/ports/devel/cquery/work/cquery-20180718/third_party/rapidjson/include/rapidjson/document.h:2306:55:   required from 'rapidjson::GenericDocument<Encoding, Allocator, StackAllocator>& rapidjson::GenericDocument<Encoding, Allocator, StackAllocator>::Parse(const typename SourceEncoding::Ch*) [with unsigned int parseFlags = 0; SourceEncoding = rapidjson::UTF8<>; Encoding = rapidjson::UTF8<>; Allocator = rapidjson::MemoryPoolAllocator<>; StackAllocator = rapidjson::CrtAllocator; typename SourceEncoding::Ch = char]'
/wrkdirs/usr/ports/devel/cquery/work/cquery-20180718/third_party/rapidjson/include/rapidjson/document.h:2315:43:   required from 'rapidjson::GenericDocument<Encoding, Allocator, StackAllocator>& rapidjson::GenericDocument<Encoding, Allocator, StackAllocator>::Parse(const Ch*) [with unsigned int parseFlags = 0; Encoding = rapidjson::UTF8<>; Allocator = rapidjson::MemoryPoolAllocator<>; StackAllocator = rapidjson::CrtAllocator; rapidjson::GenericDocument<Encoding, Allocator, StackAllocator>::Ch = char]'
/wrkdirs/usr/ports/devel/cquery/work/cquery-20180718/third_party/rapidjson/include/rapidjson/document.h:2322:41:   required from 'rapidjson::GenericDocument<Encoding, Allocator, StackAllocator>& rapidjson::GenericDocument<Encoding, Allocator, StackAllocator>::Parse(const Ch*) [with Encoding = rapidjson::UTF8<>; Allocator = rapidjson::MemoryPoolAllocator<>; StackAllocator = rapidjson::CrtAllocator; rapidjson::GenericDocument<Encoding, Allocator, StackAllocator>::Ch = char]'
/wrkdirs/usr/ports/devel/cquery/work/cquery-20180718/src/command_line.cc:487:70:   required from here
/wrkdirs/usr/ports/devel/cquery/work/cquery-20180718/third_party/rapidjson/include/rapidjson/document.h:2030:24: warning: 'void* memcpy(void*, const void*, size_t)' writing to an object of type 'rapidjson::GenericValue<rapidjson::UTF8<> >::Member' {aka 'struct rapidjson::GenericMember<rapidjson::UTF8<>, rapidjson::MemoryPoolAllocator<> >'} with no trivial copy-assignment; use copy-assignment instead [-Wclass-memaccess]
 2030 |             std::memcpy(m, members, count * sizeof(Member));
      |             ~~~~~~~~~~~^~~~~~~~~~~~~~~~~~~~~~~~~~~~~~~~~~~~
In file included from /wrkdirs/usr/ports/devel/cquery/work/cquery-20180718/src/serializers/json.h:5,
                 from /wrkdirs/usr/ports/devel/cquery/work/cquery-20180718/src/command_line.cc:25:
/wrkdirs/usr/ports/devel/cquery/work/cquery-20180718/third_party/rapidjson/include/rapidjson/document.h:71:8: note: 'rapidjson::GenericValue<rapidjson::UTF8<> >::Member' {aka 'struct rapidjson::GenericMember<rapidjson::UTF8<>, rapidjson::MemoryPoolAllocator<> >'} declared here
   71 | struct GenericMember {
      |        ^~~~~~~~~~~~~
In file included from /wrkdirs/usr/ports/devel/cquery/work/cquery-20180718/src/serializers/json.h:5,
                 from /wrkdirs/usr/ports/devel/cquery/work/cquery-20180718/src/command_line.cc:25:
/wrkdirs/usr/ports/devel/cquery/work/cquery-20180718/third_party/rapidjson/include/rapidjson/document.h: In instantiation of 'void rapidjson::GenericValue<Encoding, Allocator>::SetArrayRaw(rapidjson::GenericValue<Encoding, Allocator>*, rapidjson::SizeType, Allocator&) [with Encoding = rapidjson::UTF8<>; Allocator = rapidjson::MemoryPoolAllocator<>; rapidjson::SizeType = unsigned int]':
/wrkdirs/usr/ports/devel/cquery/work/cquery-20180718/third_party/rapidjson/include/rapidjson/document.h:2453:54:   required from 'bool rapidjson::GenericDocument<Encoding, Allocator, StackAllocator>::EndArray(rapidjson::SizeType) [with Encoding = rapidjson::UTF8<>; Allocator = rapidjson::MemoryPoolAllocator<>; StackAllocator = rapidjson::CrtAllocator; rapidjson::SizeType = unsigned int]'
/wrkdirs/usr/ports/devel/cquery/work/cquery-20180718/third_party/rapidjson/include/rapidjson/reader.h:2100:39:   required from 'rapidjson::GenericReader<SourceEncoding, TargetEncoding, StackAllocator>::IterativeParsingState rapidjson::GenericReader<SourceEncoding, TargetEncoding, StackAllocator>::Transit(rapidjson::GenericReader<SourceEncoding, TargetEncoding, StackAllocator>::IterativeParsingState, rapidjson::GenericReader<SourceEncoding, TargetEncoding, StackAllocator>::Token, rapidjson::GenericReader<SourceEncoding, TargetEncoding, StackAllocator>::IterativeParsingState, InputStream&, Handler&) [with unsigned int parseFlags = 0; InputStream = rapidjson::GenericStringStream<rapidjson::UTF8<> >; Handler = rapidjson::GenericDocument<rapidjson::UTF8<> >; SourceEncoding = rapidjson::UTF8<>; TargetEncoding = rapidjson::UTF8<>; StackAllocator = rapidjson::CrtAllocator]'
/wrkdirs/usr/ports/devel/cquery/work/cquery-20180718/third_party/rapidjson/include/rapidjson/reader.h:2174:58:   required from 'rapidjson::ParseResult rapidjson::GenericReader<SourceEncoding, TargetEncoding, StackAllocator>::IterativeParse(InputStream&, Handler&) [with unsigned int parseFlags = 0; InputStream = rapidjson::GenericStringStream<rapidjson::UTF8<> >; Handler = rapidjson::GenericDocument<rapidjson::UTF8<> >; SourceEncoding = rapidjson::UTF8<>; TargetEncoding = rapidjson::UTF8<>; StackAllocator = rapidjson::CrtAllocator]'
/wrkdirs/usr/ports/devel/cquery/work/cquery-20180718/third_party/rapidjson/include/rapidjson/reader.h:561:46:   required from 'rapidjson::ParseResult rapidjson::GenericReader<SourceEncoding, TargetEncoding, StackAllocator>::Parse(InputStream&, Handler&) [with unsigned int parseFlags = 0; InputStream = rapidjson::GenericStringStream<rapidjson::UTF8<> >; Handler = rapidjson::GenericDocument<rapidjson::UTF8<> >; SourceEncoding = rapidjson::UTF8<>; TargetEncoding = rapidjson::UTF8<>; StackAllocator = rapidjson::CrtAllocator]'
/wrkdirs/usr/ports/devel/cquery/work/cquery-20180718/third_party/rapidjson/include/rapidjson/document.h:2241:57:   required from 'rapidjson::GenericDocument<Encoding, Allocator, StackAllocator>& rapidjson::GenericDocument<Encoding, Allocator, StackAllocator>::ParseStream(InputStream&) [with unsigned int parseFlags = 0; SourceEncoding = rapidjson::UTF8<>; InputStream = rapidjson::GenericStringStream<rapidjson::UTF8<> >; Encoding = rapidjson::UTF8<>; Allocator = rapidjson::MemoryPoolAllocator<>; StackAllocator = rapidjson::CrtAllocator]'
/wrkdirs/usr/ports/devel/cquery/work/cquery-20180718/third_party/rapidjson/include/rapidjson/document.h:2306:55:   required from 'rapidjson::GenericDocument<Encoding, Allocator, StackAllocator>& rapidjson::GenericDocument<Encoding, Allocator, StackAllocator>::Parse(const typename SourceEncoding::Ch*) [with unsigned int parseFlags = 0; SourceEncoding = rapidjson::UTF8<>; Encoding = rapidjson::UTF8<>; Allocator = rapidjson::MemoryPoolAllocator<>; StackAllocator = rapidjson::CrtAllocator; typename SourceEncoding::Ch = char]'
/wrkdirs/usr/ports/devel/cquery/work/cquery-20180718/third_party/rapidjson/include/rapidjson/document.h:2315:43:   required from 'rapidjson::GenericDocument<Encoding, Allocator, StackAllocator>& rapidjson::GenericDocument<Encoding, Allocator, StackAllocator>::Parse(const Ch*) [with unsigned int parseFlags = 0; Encoding = rapidjson::UTF8<>; Allocator = rapidjson::MemoryPoolAllocator<>; StackAllocator = rapidjson::CrtAllocator; rapidjson::GenericDocument<Encoding, Allocator, StackAllocator>::Ch = char]'
/wrkdirs/usr/ports/devel/cquery/work/cquery-20180718/third_party/rapidjson/include/rapidjson/document.h:2322:41:   required from 'rapidjson::GenericDocument<Encoding, Allocator, StackAllocator>& rapidjson::GenericDocument<Encoding, Allocator, StackAllocator>::Parse(const Ch*) [with Encoding = rapidjson::UTF8<>; Allocator = rapidjson::MemoryPoolAllocator<>; StackAllocator = rapidjson::CrtAllocator; rapidjson::GenericDocument<Encoding, Allocator, StackAllocator>::Ch = char]'
/wrkdirs/usr/ports/devel/cquery/work/cquery-20180718/src/command_line.cc:487:70:   required from here
/wrkdirs/usr/ports/devel/cquery/work/cquery-20180718/third_party/rapidjson/include/rapidjson/document.h:2017:24: warning: 'void* memcpy(void*, const void*, size_t)' writing to an object of type 'class rapidjson::GenericValue<rapidjson::UTF8<> >' with no trivial copy-assignment; use copy-assignment or copy-initialization instead [-Wclass-memaccess]
 2017 |             std::memcpy(e, values, count * sizeof(GenericValue));
      |             ~~~~~~~~~~~^~~~~~~~~~~~~~~~~~~~~~~~~~~~~~~~~~~~~~~~~
/wrkdirs/usr/ports/devel/cquery/work/cquery-20180718/third_party/rapidjson/include/rapidjson/document.h:557:7: note: 'class rapidjson::GenericValue<rapidjson::UTF8<> >' declared here
  557 | class GenericValue {
      |       ^~~~~~~~~~~~
[17/91] /usr/local/bin/g++10 -DDEFAULT_RESOURCE_DIRECTORY=\"/usr/local/llvm90/lib/clang/9.0.1\" -DLOGURU_FILENAME_WIDTH=18 -DLOGURU_THREADNAME_WIDTH=13 -DLOGURU_WITH_STREAMS=1 -I/wrkdirs/usr/ports/devel/cquery/work/cquery-20180718/src -I/wrkdirs/usr/ports/devel/cquery/work/cquery-20180718/third_party -I/wrkdirs/usr/ports/devel/cquery/work/cquery-20180718/third_party/doctest -I/wrkdirs/usr/ports/devel/cquery/work/cquery-20180718/third_party/loguru -I/wrkdirs/usr/ports/devel/cquery/work/cquery-20180718/third_party/msgpack-c/include -I/wrkdirs/usr/ports/devel/cquery/work/cquery-20180718/third_party/pugixml/src -I/wrkdirs/usr/ports/devel/cquery/work/cquery-20180718/third_party/rapidjson/include -I/wrkdirs/usr/ports/devel/cquery/work/cquery-20180718/third_party/sparsepp -isystem /usr/local/llvm90/include -O2 -pipe  -fstack-protector-strong -Wl,-rpath=/usr/local/lib/gcc10  -Wl,-rpath=/usr/local/lib/gcc10 -O2 -pipe  -fstack-protector-strong -Wl,-rpath=/usr/local/lib/gcc10  -Wl,-rpath=/usr/l
 ocal/lib/gcc10 -Wall -Wno-sign-compare -Wno-unknown-pragmas -Wno-return-type -Wno-unused-result -pthread -std=c++14 -MD -MT CMakeFiles/cquery.dir/src/file_contents.cc.o -MF CMakeFiles/cquery.dir/src/file_contents.cc.o.d -o CMakeFiles/cquery.dir/src/file_contents.cc.o -c /wrkdirs/usr/ports/devel/cquery/work/cquery-20180718/src/file_contents.cc
[18/91] /usr/local/bin/g++10 -DDEFAULT_RESOURCE_DIRECTORY=\"/usr/local/llvm90/lib/clang/9.0.1\" -DLOGURU_FILENAME_WIDTH=18 -DLOGURU_THREADNAME_WIDTH=13 -DLOGURU_WITH_STREAMS=1 -I/wrkdirs/usr/ports/devel/cquery/work/cquery-20180718/src -I/wrkdirs/usr/ports/devel/cquery/work/cquery-20180718/third_party -I/wrkdirs/usr/ports/devel/cquery/work/cquery-20180718/third_party/doctest -I/wrkdirs/usr/ports/devel/cquery/work/cquery-20180718/third_party/loguru -I/wrkdirs/usr/ports/devel/cquery/work/cquery-20180718/third_party/msgpack-c/include -I/wrkdirs/usr/ports/devel/cquery/work/cquery-20180718/third_party/pugixml/src -I/wrkdirs/usr/ports/devel/cquery/work/cquery-20180718/third_party/rapidjson/include -I/wrkdirs/usr/ports/devel/cquery/work/cquery-20180718/third_party/sparsepp -isystem /usr/local/llvm90/include -O2 -pipe  -fstack-protector-strong -Wl,-rpath=/usr/local/lib/gcc10  -Wl,-rpath=/usr/local/lib/gcc10 -O2 -pipe  -fstack-protector-strong -Wl,-rpath=/usr/local/lib/gcc10  -Wl,-rpath=/usr/l
 ocal/lib/gcc10 -Wall -Wno-sign-compare -Wno-unknown-pragmas -Wno-return-type -Wno-unused-result -pthread -std=c++14 -MD -MT CMakeFiles/cquery.dir/src/file_types.cc.o -MF CMakeFiles/cquery.dir/src/file_types.cc.o.d -o CMakeFiles/cquery.dir/src/file_types.cc.o -c /wrkdirs/usr/ports/devel/cquery/work/cquery-20180718/src/file_types.cc
[19/91] /usr/local/bin/g++10 -DDEFAULT_RESOURCE_DIRECTORY=\"/usr/local/llvm90/lib/clang/9.0.1\" -DLOGURU_FILENAME_WIDTH=18 -DLOGURU_THREADNAME_WIDTH=13 -DLOGURU_WITH_STREAMS=1 -I/wrkdirs/usr/ports/devel/cquery/work/cquery-20180718/src -I/wrkdirs/usr/ports/devel/cquery/work/cquery-20180718/third_party -I/wrkdirs/usr/ports/devel/cquery/work/cquery-20180718/third_party/doctest -I/wrkdirs/usr/ports/devel/cquery/work/cquery-20180718/third_party/loguru -I/wrkdirs/usr/ports/devel/cquery/work/cquery-20180718/third_party/msgpack-c/include -I/wrkdirs/usr/ports/devel/cquery/work/cquery-20180718/third_party/pugixml/src -I/wrkdirs/usr/ports/devel/cquery/work/cquery-20180718/third_party/rapidjson/include -I/wrkdirs/usr/ports/devel/cquery/work/cquery-20180718/third_party/sparsepp -isystem /usr/local/llvm90/include -O2 -pipe  -fstack-protector-strong -Wl,-rpath=/usr/local/lib/gcc10  -Wl,-rpath=/usr/local/lib/gcc10 -O2 -pipe  -fstack-protector-strong -Wl,-rpath=/usr/local/lib/gcc10  -Wl,-rpath=/usr/l
 ocal/lib/gcc10 -Wall -Wno-sign-compare -Wno-unknown-pragmas -Wno-return-type -Wno-unused-result -pthread -std=c++14 -MD -MT CMakeFiles/cquery.dir/src/file_consumer.cc.o -MF CMakeFiles/cquery.dir/src/file_consumer.cc.o.d -o CMakeFiles/cquery.dir/src/file_consumer.cc.o -c /wrkdirs/usr/ports/devel/cquery/work/cquery-20180718/src/file_consumer.cc
[20/91] /usr/local/bin/g++10 -DDEFAULT_RESOURCE_DIRECTORY=\"/usr/local/llvm90/lib/clang/9.0.1\" -DLOGURU_FILENAME_WIDTH=18 -DLOGURU_THREADNAME_WIDTH=13 -DLOGURU_WITH_STREAMS=1 -I/wrkdirs/usr/ports/devel/cquery/work/cquery-20180718/src -I/wrkdirs/usr/ports/devel/cquery/work/cquery-20180718/third_party -I/wrkdirs/usr/ports/devel/cquery/work/cquery-20180718/third_party/doctest -I/wrkdirs/usr/ports/devel/cquery/work/cquery-20180718/third_party/loguru -I/wrkdirs/usr/ports/devel/cquery/work/cquery-20180718/third_party/msgpack-c/include -I/wrkdirs/usr/ports/devel/cquery/work/cquery-20180718/third_party/pugixml/src -I/wrkdirs/usr/ports/devel/cquery/work/cquery-20180718/third_party/rapidjson/include -I/wrkdirs/usr/ports/devel/cquery/work/cquery-20180718/third_party/sparsepp -isystem /usr/local/llvm90/include -O2 -pipe  -fstack-protector-strong -Wl,-rpath=/usr/local/lib/gcc10  -Wl,-rpath=/usr/local/lib/gcc10 -O2 -pipe  -fstack-protector-strong -Wl,-rpath=/usr/local/lib/gcc10  -Wl,-rpath=/usr/l
 ocal/lib/gcc10 -Wall -Wno-sign-compare -Wno-unknown-pragmas -Wno-return-type -Wno-unused-result -pthread -std=c++14 -MD -MT CMakeFiles/cquery.dir/src/fuzzy_match.cc.o -MF CMakeFiles/cquery.dir/src/fuzzy_match.cc.o.d -o CMakeFiles/cquery.dir/src/fuzzy_match.cc.o -c /wrkdirs/usr/ports/devel/cquery/work/cquery-20180718/src/fuzzy_match.cc
[21/91] /usr/local/bin/g++10 -DDEFAULT_RESOURCE_DIRECTORY=\"/usr/local/llvm90/lib/clang/9.0.1\" -DLOGURU_FILENAME_WIDTH=18 -DLOGURU_THREADNAME_WIDTH=13 -DLOGURU_WITH_STREAMS=1 -I/wrkdirs/usr/ports/devel/cquery/work/cquery-20180718/src -I/wrkdirs/usr/ports/devel/cquery/work/cquery-20180718/third_party -I/wrkdirs/usr/ports/devel/cquery/work/cquery-20180718/third_party/doctest -I/wrkdirs/usr/ports/devel/cquery/work/cquery-20180718/third_party/loguru -I/wrkdirs/usr/ports/devel/cquery/work/cquery-20180718/third_party/msgpack-c/include -I/wrkdirs/usr/ports/devel/cquery/work/cquery-20180718/third_party/pugixml/src -I/wrkdirs/usr/ports/devel/cquery/work/cquery-20180718/third_party/rapidjson/include -I/wrkdirs/usr/ports/devel/cquery/work/cquery-20180718/third_party/sparsepp -isystem /usr/local/llvm90/include -O2 -pipe  -fstack-protector-strong -Wl,-rpath=/usr/local/lib/gcc10  -Wl,-rpath=/usr/local/lib/gcc10 -O2 -pipe  -fstack-protector-strong -Wl,-rpath=/usr/local/lib/gcc10  -Wl,-rpath=/usr/l
 ocal/lib/gcc10 -Wall -Wno-sign-compare -Wno-unknown-pragmas -Wno-return-type -Wno-unused-result -pthread -std=c++14 -MD -MT CMakeFiles/cquery.dir/src/import_manager.cc.o -MF CMakeFiles/cquery.dir/src/import_manager.cc.o.d -o CMakeFiles/cquery.dir/src/import_manager.cc.o -c /wrkdirs/usr/ports/devel/cquery/work/cquery-20180718/src/import_manager.cc
[22/91] /usr/local/bin/g++10 -DDEFAULT_RESOURCE_DIRECTORY=\"/usr/local/llvm90/lib/clang/9.0.1\" -DLOGURU_FILENAME_WIDTH=18 -DLOGURU_THREADNAME_WIDTH=13 -DLOGURU_WITH_STREAMS=1 -I/wrkdirs/usr/ports/devel/cquery/work/cquery-20180718/src -I/wrkdirs/usr/ports/devel/cquery/work/cquery-20180718/third_party -I/wrkdirs/usr/ports/devel/cquery/work/cquery-20180718/third_party/doctest -I/wrkdirs/usr/ports/devel/cquery/work/cquery-20180718/third_party/loguru -I/wrkdirs/usr/ports/devel/cquery/work/cquery-20180718/third_party/msgpack-c/include -I/wrkdirs/usr/ports/devel/cquery/work/cquery-20180718/third_party/pugixml/src -I/wrkdirs/usr/ports/devel/cquery/work/cquery-20180718/third_party/rapidjson/include -I/wrkdirs/usr/ports/devel/cquery/work/cquery-20180718/third_party/sparsepp -isystem /usr/local/llvm90/include -O2 -pipe  -fstack-protector-strong -Wl,-rpath=/usr/local/lib/gcc10  -Wl,-rpath=/usr/local/lib/gcc10 -O2 -pipe  -fstack-protector-strong -Wl,-rpath=/usr/local/lib/gcc10  -Wl,-rpath=/usr/l
 ocal/lib/gcc10 -Wall -Wno-sign-compare -Wno-unknown-pragmas -Wno-return-type -Wno-unused-result -pthread -std=c++14 -MD -MT CMakeFiles/cquery.dir/src/iindexer.cc.o -MF CMakeFiles/cquery.dir/src/iindexer.cc.o.d -o CMakeFiles/cquery.dir/src/iindexer.cc.o -c /wrkdirs/usr/ports/devel/cquery/work/cquery-20180718/src/iindexer.cc
[23/91] /usr/local/bin/g++10 -DDEFAULT_RESOURCE_DIRECTORY=\"/usr/local/llvm90/lib/clang/9.0.1\" -DLOGURU_FILENAME_WIDTH=18 -DLOGURU_THREADNAME_WIDTH=13 -DLOGURU_WITH_STREAMS=1 -I/wrkdirs/usr/ports/devel/cquery/work/cquery-20180718/src -I/wrkdirs/usr/ports/devel/cquery/work/cquery-20180718/third_party -I/wrkdirs/usr/ports/devel/cquery/work/cquery-20180718/third_party/doctest -I/wrkdirs/usr/ports/devel/cquery/work/cquery-20180718/third_party/loguru -I/wrkdirs/usr/ports/devel/cquery/work/cquery-20180718/third_party/msgpack-c/include -I/wrkdirs/usr/ports/devel/cquery/work/cquery-20180718/third_party/pugixml/src -I/wrkdirs/usr/ports/devel/cquery/work/cquery-20180718/third_party/rapidjson/include -I/wrkdirs/usr/ports/devel/cquery/work/cquery-20180718/third_party/sparsepp -isystem /usr/local/llvm90/include -O2 -pipe  -fstack-protector-strong -Wl,-rpath=/usr/local/lib/gcc10  -Wl,-rpath=/usr/local/lib/gcc10 -O2 -pipe  -fstack-protector-strong -Wl,-rpath=/usr/local/lib/gcc10  -Wl,-rpath=/usr/l
 ocal/lib/gcc10 -Wall -Wno-sign-compare -Wno-unknown-pragmas -Wno-return-type -Wno-unused-result -pthread -std=c++14 -MD -MT CMakeFiles/cquery.dir/src/include_complete.cc.o -MF CMakeFiles/cquery.dir/src/include_complete.cc.o.d -o CMakeFiles/cquery.dir/src/include_complete.cc.o -c /wrkdirs/usr/ports/devel/cquery/work/cquery-20180718/src/include_complete.cc
[24/91] /usr/local/bin/g++10 -DDEFAULT_RESOURCE_DIRECTORY=\"/usr/local/llvm90/lib/clang/9.0.1\" -DLOGURU_FILENAME_WIDTH=18 -DLOGURU_THREADNAME_WIDTH=13 -DLOGURU_WITH_STREAMS=1 -I/wrkdirs/usr/ports/devel/cquery/work/cquery-20180718/src -I/wrkdirs/usr/ports/devel/cquery/work/cquery-20180718/third_party -I/wrkdirs/usr/ports/devel/cquery/work/cquery-20180718/third_party/doctest -I/wrkdirs/usr/ports/devel/cquery/work/cquery-20180718/third_party/loguru -I/wrkdirs/usr/ports/devel/cquery/work/cquery-20180718/third_party/msgpack-c/include -I/wrkdirs/usr/ports/devel/cquery/work/cquery-20180718/third_party/pugixml/src -I/wrkdirs/usr/ports/devel/cquery/work/cquery-20180718/third_party/rapidjson/include -I/wrkdirs/usr/ports/devel/cquery/work/cquery-20180718/third_party/sparsepp -isystem /usr/local/llvm90/include -O2 -pipe  -fstack-protector-strong -Wl,-rpath=/usr/local/lib/gcc10  -Wl,-rpath=/usr/local/lib/gcc10 -O2 -pipe  -fstack-protector-strong -Wl,-rpath=/usr/local/lib/gcc10  -Wl,-rpath=/usr/l
 ocal/lib/gcc10 -Wall -Wno-sign-compare -Wno-unknown-pragmas -Wno-return-type -Wno-unused-result -pthread -std=c++14 -MD -MT CMakeFiles/cquery.dir/src/method.cc.o -MF CMakeFiles/cquery.dir/src/method.cc.o.d -o CMakeFiles/cquery.dir/src/method.cc.o -c /wrkdirs/usr/ports/devel/cquery/work/cquery-20180718/src/method.cc
[25/91] /usr/local/bin/g++10 -DDEFAULT_RESOURCE_DIRECTORY=\"/usr/local/llvm90/lib/clang/9.0.1\" -DLOGURU_FILENAME_WIDTH=18 -DLOGURU_THREADNAME_WIDTH=13 -DLOGURU_WITH_STREAMS=1 -I/wrkdirs/usr/ports/devel/cquery/work/cquery-20180718/src -I/wrkdirs/usr/ports/devel/cquery/work/cquery-20180718/third_party -I/wrkdirs/usr/ports/devel/cquery/work/cquery-20180718/third_party/doctest -I/wrkdirs/usr/ports/devel/cquery/work/cquery-20180718/third_party/loguru -I/wrkdirs/usr/ports/devel/cquery/work/cquery-20180718/third_party/msgpack-c/include -I/wrkdirs/usr/ports/devel/cquery/work/cquery-20180718/third_party/pugixml/src -I/wrkdirs/usr/ports/devel/cquery/work/cquery-20180718/third_party/rapidjson/include -I/wrkdirs/usr/ports/devel/cquery/work/cquery-20180718/third_party/sparsepp -isystem /usr/local/llvm90/include -O2 -pipe  -fstack-protector-strong -Wl,-rpath=/usr/local/lib/gcc10  -Wl,-rpath=/usr/local/lib/gcc10 -O2 -pipe  -fstack-protector-strong -Wl,-rpath=/usr/local/lib/gcc10  -Wl,-rpath=/usr/l
 ocal/lib/gcc10 -Wall -Wno-sign-compare -Wno-unknown-pragmas -Wno-return-type -Wno-unused-result -pthread -std=c++14 -MD -MT CMakeFiles/cquery.dir/src/import_pipeline.cc.o -MF CMakeFiles/cquery.dir/src/import_pipeline.cc.o.d -o CMakeFiles/cquery.dir/src/import_pipeline.cc.o -c /wrkdirs/usr/ports/devel/cquery/work/cquery-20180718/src/import_pipeline.cc
In file included from /wrkdirs/usr/ports/devel/cquery/work/cquery-20180718/src/queue_manager.h:5,
                 from /wrkdirs/usr/ports/devel/cquery/work/cquery-20180718/src/import_pipeline.cc:13:
/wrkdirs/usr/ports/devel/cquery/work/cquery-20180718/src/threaded_queue.h: In instantiation of 'std::experimental::optional<T> ThreadedQueue<T>::TryDequeue(bool) [with T = Index_Request]':
/wrkdirs/usr/ports/devel/cquery/work/cquery-20180718/src/import_pipeline.cc:455:56:   required from here
/wrkdirs/usr/ports/devel/cquery/work/cquery-20180718/src/threaded_queue.h:152:27: warning: moving a local object in a return statement prevents copy elision [-Wpessimizing-move]
  152 |       return std::move(val);
      |                           ^
/wrkdirs/usr/ports/devel/cquery/work/cquery-20180718/src/threaded_queue.h:152:27: note: remove 'std::move' call
/wrkdirs/usr/ports/devel/cquery/work/cquery-20180718/src/threaded_queue.h: In instantiation of 'std::experimental::optional<T> ThreadedQueue<T>::TryDequeue(bool) [with T = Index_OnIdMapped]':
/wrkdirs/usr/ports/devel/cquery/work/cquery-20180718/src/import_pipeline.cc:475:57:   required from here
/wrkdirs/usr/ports/devel/cquery/work/cquery-20180718/src/threaded_queue.h:152:27: warning: moving a local object in a return statement prevents copy elision [-Wpessimizing-move]
/wrkdirs/usr/ports/devel/cquery/work/cquery-20180718/src/threaded_queue.h:152:27: note: remove 'std::move' call
/wrkdirs/usr/ports/devel/cquery/work/cquery-20180718/src/threaded_queue.h: In instantiation of 'std::experimental::optional<T> ThreadedQueue<T>::TryDequeue(bool) [with T = Index_OnIndexed]':
/wrkdirs/usr/ports/devel/cquery/work/cquery-20180718/src/import_pipeline.cc:513:64:   required from here
/wrkdirs/usr/ports/devel/cquery/work/cquery-20180718/src/threaded_queue.h:152:27: warning: moving a local object in a return statement prevents copy elision [-Wpessimizing-move]
/wrkdirs/usr/ports/devel/cquery/work/cquery-20180718/src/threaded_queue.h:152:27: note: remove 'std::move' call
/wrkdirs/usr/ports/devel/cquery/work/cquery-20180718/src/threaded_queue.h: In instantiation of 'std::experimental::optional<T> ThreadedQueue<T>::TryDequeue(bool) [with T = Index_DoIdMap]':
/wrkdirs/usr/ports/devel/cquery/work/cquery-20180718/src/import_pipeline.cc:683:54:   required from here
/wrkdirs/usr/ports/devel/cquery/work/cquery-20180718/src/threaded_queue.h:152:27: warning: moving a local object in a return statement prevents copy elision [-Wpessimizing-move]
/wrkdirs/usr/ports/devel/cquery/work/cquery-20180718/src/threaded_queue.h:152:27: note: remove 'std::move' call
In file included from /wrkdirs/usr/ports/devel/cquery/work/cquery-20180718/src/project.h:7,
                 from /wrkdirs/usr/ports/devel/cquery/work/cquery-20180718/src/indexer.h:13,
                 from /wrkdirs/usr/ports/devel/cquery/work/cquery-20180718/src/query.h:3,
                 from /wrkdirs/usr/ports/devel/cquery/work/cquery-20180718/src/message_handler.h:5,
                 from /wrkdirs/usr/ports/devel/cquery/work/cquery-20180718/src/import_pipeline.cc:9:
/wrkdirs/usr/ports/devel/cquery/work/cquery-20180718/third_party/sparsepp/sparsepp/spp.h: In instantiation of 'void spp::sparsetable<T, Alloc>::resize(spp::sparsetable<T, Alloc>::size_type) [with T = std::pair<const AbsolutePath, Id<QueryFile> >; Alloc = spp::libc_allocator<std::pair<const AbsolutePath, Id<QueryFile> > >; spp::sparsetable<T, Alloc>::size_type = long unsigned int]':
/wrkdirs/usr/ports/devel/cquery/work/cquery-20180718/third_party/sparsepp/sparsepp/spp.h:2805:25:   required from 'void spp::sparse_hashtable<Value, Key, HashFcn, ExtractKey, SetKey, EqualKey, Alloc>::_move_from(spp::sparse_hashtable<Value, Key, HashFcn, ExtractKey, SetKey, EqualKey, Alloc>::MoveDontCopyT, spp::sparse_hashtable<Value, Key, HashFcn, ExtractKey, SetKey, EqualKey, Alloc>&, spp::sparse_hashtable<Value, Key, HashFcn, ExtractKey, SetKey, EqualKey, Alloc>::size_type) [with Value = std::pair<const AbsolutePath, Id<QueryFile> >; Key = AbsolutePath; HashFcn = spp::spp_hash<AbsolutePath>; ExtractKey = spp::sparse_hash_map<AbsolutePath, Id<QueryFile> >::SelectKey; SetKey = spp::sparse_hash_map<AbsolutePath, Id<QueryFile> >::SetKey; EqualKey = std::equal_to<AbsolutePath>; Alloc = spp::libc_allocator<std::pair<const AbsolutePath, Id<QueryFile> > >; spp::sparse_hashtable<Value, Key, HashFcn, ExtractKey, SetKey, EqualKey, Alloc>::size_type = long unsigned int]'
/wrkdirs/usr/ports/devel/cquery/work/cquery-20180718/third_party/sparsepp/sparsepp/spp.h:2949:9:   required from 'spp::sparse_hashtable<Value, Key, HashFcn, ExtractKey, SetKey, EqualKey, Alloc>::sparse_hashtable(spp::sparse_hashtable<Value, Key, HashFcn, ExtractKey, SetKey, EqualKey, Alloc>::MoveDontCopyT, spp::sparse_hashtable<Value, Key, HashFcn, ExtractKey, SetKey, EqualKey, Alloc>&, spp::sparse_hashtable<Value, Key, HashFcn, ExtractKey, SetKey, EqualKey, Alloc>::size_type) [with Value = std::pair<const AbsolutePath, Id<QueryFile> >; Key = AbsolutePath; HashFcn = spp::spp_hash<AbsolutePath>; ExtractKey = spp::sparse_hash_map<AbsolutePath, Id<QueryFile> >::SelectKey; SetKey = spp::sparse_hash_map<AbsolutePath, Id<QueryFile> >::SetKey; EqualKey = std::equal_to<AbsolutePath>; Alloc = spp::libc_allocator<std::pair<const AbsolutePath, Id<QueryFile> > >; spp::sparse_hashtable<Value, Key, HashFcn, ExtractKey, SetKey, EqualKey, Alloc>::size_type = long unsigned int]'
/wrkdirs/usr/ports/devel/cquery/work/cquery-20180718/third_party/sparsepp/sparsepp/spp.h:2744:26:   required from 'bool spp::sparse_hashtable<Value, Key, HashFcn, ExtractKey, SetKey, EqualKey, Alloc>::_resize_delta(spp::sparse_hashtable<Value, Key, HashFcn, ExtractKey, SetKey, EqualKey, Alloc>::size_type) [with Value = std::pair<const AbsolutePath, Id<QueryFile> >; Key = AbsolutePath; HashFcn = spp::spp_hash<AbsolutePath>; ExtractKey = spp::sparse_hash_map<AbsolutePath, Id<QueryFile> >::SelectKey; SetKey = spp::sparse_hash_map<AbsolutePath, Id<QueryFile> >::SetKey; EqualKey = std::equal_to<AbsolutePath>; Alloc = spp::libc_allocator<std::pair<const AbsolutePath, Id<QueryFile> > >; spp::sparse_hashtable<Value, Key, HashFcn, ExtractKey, SetKey, EqualKey, Alloc>::size_type = long unsigned int]'
/wrkdirs/usr/ports/devel/cquery/work/cquery-20180718/third_party/sparsepp/sparsepp/spp.h:3269:21:   required from 'spp::sparse_hashtable<Value, Key, HashFcn, ExtractKey, SetKey, EqualKey, Alloc>::value_type& spp::sparse_hashtable<Value, Key, HashFcn, ExtractKey, SetKey, EqualKey, Alloc>::find_or_insert(const key_type&) [with DefaultValue = spp::sparse_hash_map<AbsolutePath, Id<QueryFile> >::DefaultValue; Value = std::pair<const AbsolutePath, Id<QueryFile> >; Key = AbsolutePath; HashFcn = spp::spp_hash<AbsolutePath>; ExtractKey = spp::sparse_hash_map<AbsolutePath, Id<QueryFile> >::SelectKey; SetKey = spp::sparse_hash_map<AbsolutePath, Id<QueryFile> >::SetKey; EqualKey = std::equal_to<AbsolutePath>; Alloc = spp::libc_allocator<std::pair<const AbsolutePath, Id<QueryFile> > >; spp::sparse_hashtable<Value, Key, HashFcn, ExtractKey, SetKey, EqualKey, Alloc>::value_type = std::pair<const AbsolutePath, Id<QueryFile> >; spp::sparse_hashtable<Value, Key, HashFcn, ExtractKey, SetKey, EqualKey, 
 Alloc>::key_type = AbsolutePath]'
/wrkdirs/usr/ports/devel/cquery/work/cquery-20180718/third_party/sparsepp/sparsepp/spp.h:3792:57:   required from 'spp::sparse_hash_map<Key, T, HashFcn, EqualKey, Alloc>::mapped_type& spp::sparse_hash_map<Key, T, HashFcn, EqualKey, Alloc>::operator[](const key_type&) [with Key = AbsolutePath; T = Id<QueryFile>; HashFcn = spp::spp_hash<AbsolutePath>; EqualKey = std::equal_to<AbsolutePath>; Alloc = spp::libc_allocator<std::pair<const AbsolutePath, Id<QueryFile> > >; spp::sparse_hash_map<Key, T, HashFcn, EqualKey, Alloc>::mapped_type = Id<QueryFile>; spp::sparse_hash_map<Key, T, HashFcn, EqualKey, Alloc>::key_type = AbsolutePath]'
/wrkdirs/usr/ports/devel/cquery/work/cquery-20180718/src/import_pipeline.cc:655:69:   required from here
/wrkdirs/usr/ports/devel/cquery/work/cquery-20180718/third_party/sparsepp/sparsepp/spp.h:2090:23: warning: 'void* memcpy(void*, const void*, size_t)' writing to an object of type 'spp::sparsetable<std::pair<const AbsolutePath, Id<QueryFile> >, spp::libc_allocator<std::pair<const AbsolutePath, Id<QueryFile> > > >::group_type' {aka 'class spp::sparsegroup<std::pair<const AbsolutePath, Id<QueryFile> >, spp::libc_allocator<std::pair<const AbsolutePath, Id<QueryFile> > > >'} with no trivial copy-assignment; use copy-initialization instead [-Wclass-memaccess]
 2090 |                 memcpy(first, _first_group, sizeof(*first) * (std::min)(sz, old_sz));
      |                 ~~~~~~^~~~~~~~~~~~~~~~~~~~~~~~~~~~~~~~~~~~~~~~~~~~~~~~~~~~~~~~~~~~~~
In file included from /wrkdirs/usr/ports/devel/cquery/work/cquery-20180718/src/project.h:7,
                 from /wrkdirs/usr/ports/devel/cquery/work/cquery-20180718/src/indexer.h:13,
                 from /wrkdirs/usr/ports/devel/cquery/work/cquery-20180718/src/query.h:3,
                 from /wrkdirs/usr/ports/devel/cquery/work/cquery-20180718/src/message_handler.h:5,
                 from /wrkdirs/usr/ports/devel/cquery/work/cquery-20180718/src/import_pipeline.cc:9:
/wrkdirs/usr/ports/devel/cquery/work/cquery-20180718/third_party/sparsepp/sparsepp/spp.h:1027:7: note: 'spp::sparsetable<std::pair<const AbsolutePath, Id<QueryFile> >, spp::libc_allocator<std::pair<const AbsolutePath, Id<QueryFile> > > >::group_type' {aka 'class spp::sparsegroup<std::pair<const AbsolutePath, Id<QueryFile> >, spp::libc_allocator<std::pair<const AbsolutePath, Id<QueryFile> > > >'} declared here
 1027 | class sparsegroup
      |       ^~~~~~~~~~~
[26/91] /usr/local/bin/g++10 -DDEFAULT_RESOURCE_DIRECTORY=\"/usr/local/llvm90/lib/clang/9.0.1\" -DLOGURU_FILENAME_WIDTH=18 -DLOGURU_THREADNAME_WIDTH=13 -DLOGURU_WITH_STREAMS=1 -I/wrkdirs/usr/ports/devel/cquery/work/cquery-20180718/src -I/wrkdirs/usr/ports/devel/cquery/work/cquery-20180718/third_party -I/wrkdirs/usr/ports/devel/cquery/work/cquery-20180718/third_party/doctest -I/wrkdirs/usr/ports/devel/cquery/work/cquery-20180718/third_party/loguru -I/wrkdirs/usr/ports/devel/cquery/work/cquery-20180718/third_party/msgpack-c/include -I/wrkdirs/usr/ports/devel/cquery/work/cquery-20180718/third_party/pugixml/src -I/wrkdirs/usr/ports/devel/cquery/work/cquery-20180718/third_party/rapidjson/include -I/wrkdirs/usr/ports/devel/cquery/work/cquery-20180718/third_party/sparsepp -isystem /usr/local/llvm90/include -O2 -pipe  -fstack-protector-strong -Wl,-rpath=/usr/local/lib/gcc10  -Wl,-rpath=/usr/local/lib/gcc10 -O2 -pipe  -fstack-protector-strong -Wl,-rpath=/usr/local/lib/gcc10  -Wl,-rpath=/usr/l
 ocal/lib/gcc10 -Wall -Wno-sign-compare -Wno-unknown-pragmas -Wno-return-type -Wno-unused-result -pthread -std=c++14 -MD -MT CMakeFiles/cquery.dir/src/lex_utils.cc.o -MF CMakeFiles/cquery.dir/src/lex_utils.cc.o.d -o CMakeFiles/cquery.dir/src/lex_utils.cc.o -c /wrkdirs/usr/ports/devel/cquery/work/cquery-20180718/src/lex_utils.cc
[27/91] /usr/local/bin/g++10 -DDEFAULT_RESOURCE_DIRECTORY=\"/usr/local/llvm90/lib/clang/9.0.1\" -DLOGURU_FILENAME_WIDTH=18 -DLOGURU_THREADNAME_WIDTH=13 -DLOGURU_WITH_STREAMS=1 -I/wrkdirs/usr/ports/devel/cquery/work/cquery-20180718/src -I/wrkdirs/usr/ports/devel/cquery/work/cquery-20180718/third_party -I/wrkdirs/usr/ports/devel/cquery/work/cquery-20180718/third_party/doctest -I/wrkdirs/usr/ports/devel/cquery/work/cquery-20180718/third_party/loguru -I/wrkdirs/usr/ports/devel/cquery/work/cquery-20180718/third_party/msgpack-c/include -I/wrkdirs/usr/ports/devel/cquery/work/cquery-20180718/third_party/pugixml/src -I/wrkdirs/usr/ports/devel/cquery/work/cquery-20180718/third_party/rapidjson/include -I/wrkdirs/usr/ports/devel/cquery/work/cquery-20180718/third_party/sparsepp -isystem /usr/local/llvm90/include -O2 -pipe  -fstack-protector-strong -Wl,-rpath=/usr/local/lib/gcc10  -Wl,-rpath=/usr/local/lib/gcc10 -O2 -pipe  -fstack-protector-strong -Wl,-rpath=/usr/local/lib/gcc10  -Wl,-rpath=/usr/l
 ocal/lib/gcc10 -Wall -Wno-sign-compare -Wno-unknown-pragmas -Wno-return-type -Wno-unused-result -pthread -std=c++14 -MD -MT CMakeFiles/cquery.dir/src/lsp_diagnostic.cc.o -MF CMakeFiles/cquery.dir/src/lsp_diagnostic.cc.o.d -o CMakeFiles/cquery.dir/src/lsp_diagnostic.cc.o -c /wrkdirs/usr/ports/devel/cquery/work/cquery-20180718/src/lsp_diagnostic.cc
[28/91] /usr/local/bin/g++10 -DDEFAULT_RESOURCE_DIRECTORY=\"/usr/local/llvm90/lib/clang/9.0.1\" -DLOGURU_FILENAME_WIDTH=18 -DLOGURU_THREADNAME_WIDTH=13 -DLOGURU_WITH_STREAMS=1 -I/wrkdirs/usr/ports/devel/cquery/work/cquery-20180718/src -I/wrkdirs/usr/ports/devel/cquery/work/cquery-20180718/third_party -I/wrkdirs/usr/ports/devel/cquery/work/cquery-20180718/third_party/doctest -I/wrkdirs/usr/ports/devel/cquery/work/cquery-20180718/third_party/loguru -I/wrkdirs/usr/ports/devel/cquery/work/cquery-20180718/third_party/msgpack-c/include -I/wrkdirs/usr/ports/devel/cquery/work/cquery-20180718/third_party/pugixml/src -I/wrkdirs/usr/ports/devel/cquery/work/cquery-20180718/third_party/rapidjson/include -I/wrkdirs/usr/ports/devel/cquery/work/cquery-20180718/third_party/sparsepp -isystem /usr/local/llvm90/include -O2 -pipe  -fstack-protector-strong -Wl,-rpath=/usr/local/lib/gcc10  -Wl,-rpath=/usr/local/lib/gcc10 -O2 -pipe  -fstack-protector-strong -Wl,-rpath=/usr/local/lib/gcc10  -Wl,-rpath=/usr/l
 ocal/lib/gcc10 -Wall -Wno-sign-compare -Wno-unknown-pragmas -Wno-return-type -Wno-unused-result -pthread -std=c++14 -MD -MT CMakeFiles/cquery.dir/src/lsp.cc.o -MF CMakeFiles/cquery.dir/src/lsp.cc.o.d -o CMakeFiles/cquery.dir/src/lsp.cc.o -c /wrkdirs/usr/ports/devel/cquery/work/cquery-20180718/src/lsp.cc
In file included from /wrkdirs/usr/ports/devel/cquery/work/cquery-20180718/src/serializers/json.h:5,
                 from /wrkdirs/usr/ports/devel/cquery/work/cquery-20180718/src/lsp.cc:6:
/wrkdirs/usr/ports/devel/cquery/work/cquery-20180718/third_party/rapidjson/include/rapidjson/document.h: In instantiation of 'void rapidjson::GenericValue<Encoding, Allocator>::SetObjectRaw(rapidjson::GenericValue<Encoding, Allocator>::Member*, rapidjson::SizeType, Allocator&) [with Encoding = rapidjson::UTF8<>; Allocator = rapidjson::MemoryPoolAllocator<>; rapidjson::GenericValue<Encoding, Allocator>::Member = rapidjson::GenericMember<rapidjson::UTF8<>, rapidjson::MemoryPoolAllocator<> >; rapidjson::SizeType = unsigned int]':
/wrkdirs/usr/ports/devel/cquery/work/cquery-20180718/third_party/rapidjson/include/rapidjson/document.h:2445:55:   required from 'bool rapidjson::GenericDocument<Encoding, Allocator, StackAllocator>::EndObject(rapidjson::SizeType) [with Encoding = rapidjson::UTF8<>; Allocator = rapidjson::MemoryPoolAllocator<>; StackAllocator = rapidjson::CrtAllocator; rapidjson::SizeType = unsigned int]'
/wrkdirs/usr/ports/devel/cquery/work/cquery-20180718/third_party/rapidjson/include/rapidjson/reader.h:2070:40:   required from 'rapidjson::GenericReader<SourceEncoding, TargetEncoding, StackAllocator>::IterativeParsingState rapidjson::GenericReader<SourceEncoding, TargetEncoding, StackAllocator>::Transit(rapidjson::GenericReader<SourceEncoding, TargetEncoding, StackAllocator>::IterativeParsingState, rapidjson::GenericReader<SourceEncoding, TargetEncoding, StackAllocator>::Token, rapidjson::GenericReader<SourceEncoding, TargetEncoding, StackAllocator>::IterativeParsingState, InputStream&, Handler&) [with unsigned int parseFlags = 0; InputStream = rapidjson::EncodedInputStream<rapidjson::UTF8<>, rapidjson::MemoryStream>; Handler = rapidjson::GenericDocument<rapidjson::UTF8<> >; SourceEncoding = rapidjson::UTF8<>; TargetEncoding = rapidjson::UTF8<>; StackAllocator = rapidjson::CrtAllocator]'
/wrkdirs/usr/ports/devel/cquery/work/cquery-20180718/third_party/rapidjson/include/rapidjson/reader.h:2174:58:   required from 'rapidjson::ParseResult rapidjson::GenericReader<SourceEncoding, TargetEncoding, StackAllocator>::IterativeParse(InputStream&, Handler&) [with unsigned int parseFlags = 0; InputStream = rapidjson::EncodedInputStream<rapidjson::UTF8<>, rapidjson::MemoryStream>; Handler = rapidjson::GenericDocument<rapidjson::UTF8<> >; SourceEncoding = rapidjson::UTF8<>; TargetEncoding = rapidjson::UTF8<>; StackAllocator = rapidjson::CrtAllocator]'
/wrkdirs/usr/ports/devel/cquery/work/cquery-20180718/third_party/rapidjson/include/rapidjson/reader.h:561:46:   required from 'rapidjson::ParseResult rapidjson::GenericReader<SourceEncoding, TargetEncoding, StackAllocator>::Parse(InputStream&, Handler&) [with unsigned int parseFlags = 0; InputStream = rapidjson::EncodedInputStream<rapidjson::UTF8<>, rapidjson::MemoryStream>; Handler = rapidjson::GenericDocument<rapidjson::UTF8<> >; SourceEncoding = rapidjson::UTF8<>; TargetEncoding = rapidjson::UTF8<>; StackAllocator = rapidjson::CrtAllocator]'
/wrkdirs/usr/ports/devel/cquery/work/cquery-20180718/third_party/rapidjson/include/rapidjson/document.h:2241:57:   required from 'rapidjson::GenericDocument<Encoding, Allocator, StackAllocator>& rapidjson::GenericDocument<Encoding, Allocator, StackAllocator>::ParseStream(InputStream&) [with unsigned int parseFlags = 0; SourceEncoding = rapidjson::UTF8<>; InputStream = rapidjson::EncodedInputStream<rapidjson::UTF8<>, rapidjson::MemoryStream>; Encoding = rapidjson::UTF8<>; Allocator = rapidjson::MemoryPoolAllocator<>; StackAllocator = rapidjson::CrtAllocator]'
/wrkdirs/usr/ports/devel/cquery/work/cquery-20180718/third_party/rapidjson/include/rapidjson/document.h:2330:48:   required from 'rapidjson::GenericDocument<Encoding, Allocator, StackAllocator>& rapidjson::GenericDocument<Encoding, Allocator, StackAllocator>::Parse(const typename SourceEncoding::Ch*, std::size_t) [with unsigned int parseFlags = 0; SourceEncoding = rapidjson::UTF8<>; Encoding = rapidjson::UTF8<>; Allocator = rapidjson::MemoryPoolAllocator<>; StackAllocator = rapidjson::CrtAllocator; typename SourceEncoding::Ch = char; std::size_t = long unsigned int]'
/wrkdirs/usr/ports/devel/cquery/work/cquery-20180718/third_party/rapidjson/include/rapidjson/document.h:2336:43:   required from 'rapidjson::GenericDocument<Encoding, Allocator, StackAllocator>& rapidjson::GenericDocument<Encoding, Allocator, StackAllocator>::Parse(const Ch*, std::size_t) [with unsigned int parseFlags = 0; Encoding = rapidjson::UTF8<>; Allocator = rapidjson::MemoryPoolAllocator<>; StackAllocator = rapidjson::CrtAllocator; rapidjson::GenericDocument<Encoding, Allocator, StackAllocator>::Ch = char; std::size_t = long unsigned int]'
/wrkdirs/usr/ports/devel/cquery/work/cquery-20180718/third_party/rapidjson/include/rapidjson/document.h:2340:41:   required from 'rapidjson::GenericDocument<Encoding, Allocator, StackAllocator>& rapidjson::GenericDocument<Encoding, Allocator, StackAllocator>::Parse(const Ch*, std::size_t) [with Encoding = rapidjson::UTF8<>; Allocator = rapidjson::MemoryPoolAllocator<>; StackAllocator = rapidjson::CrtAllocator; rapidjson::GenericDocument<Encoding, Allocator, StackAllocator>::Ch = char; std::size_t = long unsigned int]'
/wrkdirs/usr/ports/devel/cquery/work/cquery-20180718/src/lsp.cc:180:53:   required from here
/wrkdirs/usr/ports/devel/cquery/work/cquery-20180718/third_party/rapidjson/include/rapidjson/document.h:2030:24: warning: 'void* memcpy(void*, const void*, size_t)' writing to an object of type 'rapidjson::GenericValue<rapidjson::UTF8<> >::Member' {aka 'struct rapidjson::GenericMember<rapidjson::UTF8<>, rapidjson::MemoryPoolAllocator<> >'} with no trivial copy-assignment; use copy-assignment instead [-Wclass-memaccess]
 2030 |             std::memcpy(m, members, count * sizeof(Member));
      |             ~~~~~~~~~~~^~~~~~~~~~~~~~~~~~~~~~~~~~~~~~~~~~~~
In file included from /wrkdirs/usr/ports/devel/cquery/work/cquery-20180718/src/serializers/json.h:5,
                 from /wrkdirs/usr/ports/devel/cquery/work/cquery-20180718/src/lsp.cc:6:
/wrkdirs/usr/ports/devel/cquery/work/cquery-20180718/third_party/rapidjson/include/rapidjson/document.h:71:8: note: 'rapidjson::GenericValue<rapidjson::UTF8<> >::Member' {aka 'struct rapidjson::GenericMember<rapidjson::UTF8<>, rapidjson::MemoryPoolAllocator<> >'} declared here
   71 | struct GenericMember {
      |        ^~~~~~~~~~~~~
In file included from /wrkdirs/usr/ports/devel/cquery/work/cquery-20180718/src/serializers/json.h:5,
                 from /wrkdirs/usr/ports/devel/cquery/work/cquery-20180718/src/lsp.cc:6:
/wrkdirs/usr/ports/devel/cquery/work/cquery-20180718/third_party/rapidjson/include/rapidjson/document.h: In instantiation of 'void rapidjson::GenericValue<Encoding, Allocator>::SetArrayRaw(rapidjson::GenericValue<Encoding, Allocator>*, rapidjson::SizeType, Allocator&) [with Encoding = rapidjson::UTF8<>; Allocator = rapidjson::MemoryPoolAllocator<>; rapidjson::SizeType = unsigned int]':
/wrkdirs/usr/ports/devel/cquery/work/cquery-20180718/third_party/rapidjson/include/rapidjson/document.h:2453:54:   required from 'bool rapidjson::GenericDocument<Encoding, Allocator, StackAllocator>::EndArray(rapidjson::SizeType) [with Encoding = rapidjson::UTF8<>; Allocator = rapidjson::MemoryPoolAllocator<>; StackAllocator = rapidjson::CrtAllocator; rapidjson::SizeType = unsigned int]'
/wrkdirs/usr/ports/devel/cquery/work/cquery-20180718/third_party/rapidjson/include/rapidjson/reader.h:2100:39:   required from 'rapidjson::GenericReader<SourceEncoding, TargetEncoding, StackAllocator>::IterativeParsingState rapidjson::GenericReader<SourceEncoding, TargetEncoding, StackAllocator>::Transit(rapidjson::GenericReader<SourceEncoding, TargetEncoding, StackAllocator>::IterativeParsingState, rapidjson::GenericReader<SourceEncoding, TargetEncoding, StackAllocator>::Token, rapidjson::GenericReader<SourceEncoding, TargetEncoding, StackAllocator>::IterativeParsingState, InputStream&, Handler&) [with unsigned int parseFlags = 0; InputStream = rapidjson::EncodedInputStream<rapidjson::UTF8<>, rapidjson::MemoryStream>; Handler = rapidjson::GenericDocument<rapidjson::UTF8<> >; SourceEncoding = rapidjson::UTF8<>; TargetEncoding = rapidjson::UTF8<>; StackAllocator = rapidjson::CrtAllocator]'
/wrkdirs/usr/ports/devel/cquery/work/cquery-20180718/third_party/rapidjson/include/rapidjson/reader.h:2174:58:   required from 'rapidjson::ParseResult rapidjson::GenericReader<SourceEncoding, TargetEncoding, StackAllocator>::IterativeParse(InputStream&, Handler&) [with unsigned int parseFlags = 0; InputStream = rapidjson::EncodedInputStream<rapidjson::UTF8<>, rapidjson::MemoryStream>; Handler = rapidjson::GenericDocument<rapidjson::UTF8<> >; SourceEncoding = rapidjson::UTF8<>; TargetEncoding = rapidjson::UTF8<>; StackAllocator = rapidjson::CrtAllocator]'
/wrkdirs/usr/ports/devel/cquery/work/cquery-20180718/third_party/rapidjson/include/rapidjson/reader.h:561:46:   required from 'rapidjson::ParseResult rapidjson::GenericReader<SourceEncoding, TargetEncoding, StackAllocator>::Parse(InputStream&, Handler&) [with unsigned int parseFlags = 0; InputStream = rapidjson::EncodedInputStream<rapidjson::UTF8<>, rapidjson::MemoryStream>; Handler = rapidjson::GenericDocument<rapidjson::UTF8<> >; SourceEncoding = rapidjson::UTF8<>; TargetEncoding = rapidjson::UTF8<>; StackAllocator = rapidjson::CrtAllocator]'
/wrkdirs/usr/ports/devel/cquery/work/cquery-20180718/third_party/rapidjson/include/rapidjson/document.h:2241:57:   required from 'rapidjson::GenericDocument<Encoding, Allocator, StackAllocator>& rapidjson::GenericDocument<Encoding, Allocator, StackAllocator>::ParseStream(InputStream&) [with unsigned int parseFlags = 0; SourceEncoding = rapidjson::UTF8<>; InputStream = rapidjson::EncodedInputStream<rapidjson::UTF8<>, rapidjson::MemoryStream>; Encoding = rapidjson::UTF8<>; Allocator = rapidjson::MemoryPoolAllocator<>; StackAllocator = rapidjson::CrtAllocator]'
/wrkdirs/usr/ports/devel/cquery/work/cquery-20180718/third_party/rapidjson/include/rapidjson/document.h:2330:48:   required from 'rapidjson::GenericDocument<Encoding, Allocator, StackAllocator>& rapidjson::GenericDocument<Encoding, Allocator, StackAllocator>::Parse(const typename SourceEncoding::Ch*, std::size_t) [with unsigned int parseFlags = 0; SourceEncoding = rapidjson::UTF8<>; Encoding = rapidjson::UTF8<>; Allocator = rapidjson::MemoryPoolAllocator<>; StackAllocator = rapidjson::CrtAllocator; typename SourceEncoding::Ch = char; std::size_t = long unsigned int]'
/wrkdirs/usr/ports/devel/cquery/work/cquery-20180718/third_party/rapidjson/include/rapidjson/document.h:2336:43:   required from 'rapidjson::GenericDocument<Encoding, Allocator, StackAllocator>& rapidjson::GenericDocument<Encoding, Allocator, StackAllocator>::Parse(const Ch*, std::size_t) [with unsigned int parseFlags = 0; Encoding = rapidjson::UTF8<>; Allocator = rapidjson::MemoryPoolAllocator<>; StackAllocator = rapidjson::CrtAllocator; rapidjson::GenericDocument<Encoding, Allocator, StackAllocator>::Ch = char; std::size_t = long unsigned int]'
/wrkdirs/usr/ports/devel/cquery/work/cquery-20180718/third_party/rapidjson/include/rapidjson/document.h:2340:41:   required from 'rapidjson::GenericDocument<Encoding, Allocator, StackAllocator>& rapidjson::GenericDocument<Encoding, Allocator, StackAllocator>::Parse(const Ch*, std::size_t) [with Encoding = rapidjson::UTF8<>; Allocator = rapidjson::MemoryPoolAllocator<>; StackAllocator = rapidjson::CrtAllocator; rapidjson::GenericDocument<Encoding, Allocator, StackAllocator>::Ch = char; std::size_t = long unsigned int]'
/wrkdirs/usr/ports/devel/cquery/work/cquery-20180718/src/lsp.cc:180:53:   required from here
/wrkdirs/usr/ports/devel/cquery/work/cquery-20180718/third_party/rapidjson/include/rapidjson/document.h:2017:24: warning: 'void* memcpy(void*, const void*, size_t)' writing to an object of type 'class rapidjson::GenericValue<rapidjson::UTF8<> >' with no trivial copy-assignment; use copy-assignment or copy-initialization instead [-Wclass-memaccess]
 2017 |             std::memcpy(e, values, count * sizeof(GenericValue));
      |             ~~~~~~~~~~~^~~~~~~~~~~~~~~~~~~~~~~~~~~~~~~~~~~~~~~~~
/wrkdirs/usr/ports/devel/cquery/work/cquery-20180718/third_party/rapidjson/include/rapidjson/document.h:557:7: note: 'class rapidjson::GenericValue<rapidjson::UTF8<> >' declared here
  557 | class GenericValue {
      |       ^~~~~~~~~~~~
[29/91] /usr/local/bin/g++10 -DDEFAULT_RESOURCE_DIRECTORY=\"/usr/local/llvm90/lib/clang/9.0.1\" -DLOGURU_FILENAME_WIDTH=18 -DLOGURU_THREADNAME_WIDTH=13 -DLOGURU_WITH_STREAMS=1 -I/wrkdirs/usr/ports/devel/cquery/work/cquery-20180718/src -I/wrkdirs/usr/ports/devel/cquery/work/cquery-20180718/third_party -I/wrkdirs/usr/ports/devel/cquery/work/cquery-20180718/third_party/doctest -I/wrkdirs/usr/ports/devel/cquery/work/cquery-20180718/third_party/loguru -I/wrkdirs/usr/ports/devel/cquery/work/cquery-20180718/third_party/msgpack-c/include -I/wrkdirs/usr/ports/devel/cquery/work/cquery-20180718/third_party/pugixml/src -I/wrkdirs/usr/ports/devel/cquery/work/cquery-20180718/third_party/rapidjson/include -I/wrkdirs/usr/ports/devel/cquery/work/cquery-20180718/third_party/sparsepp -isystem /usr/local/llvm90/include -O2 -pipe  -fstack-protector-strong -Wl,-rpath=/usr/local/lib/gcc10  -Wl,-rpath=/usr/local/lib/gcc10 -O2 -pipe  -fstack-protector-strong -Wl,-rpath=/usr/local/lib/gcc10  -Wl,-rpath=/usr/l
 ocal/lib/gcc10 -Wall -Wno-sign-compare -Wno-unknown-pragmas -Wno-return-type -Wno-unused-result -pthread -std=c++14 -MD -MT CMakeFiles/cquery.dir/src/message_handler.cc.o -MF CMakeFiles/cquery.dir/src/message_handler.cc.o.d -o CMakeFiles/cquery.dir/src/message_handler.cc.o -c /wrkdirs/usr/ports/devel/cquery/work/cquery-20180718/src/message_handler.cc
[30/91] /usr/local/bin/g++10 -DDEFAULT_RESOURCE_DIRECTORY=\"/usr/local/llvm90/lib/clang/9.0.1\" -DLOGURU_FILENAME_WIDTH=18 -DLOGURU_THREADNAME_WIDTH=13 -DLOGURU_WITH_STREAMS=1 -I/wrkdirs/usr/ports/devel/cquery/work/cquery-20180718/src -I/wrkdirs/usr/ports/devel/cquery/work/cquery-20180718/third_party -I/wrkdirs/usr/ports/devel/cquery/work/cquery-20180718/third_party/doctest -I/wrkdirs/usr/ports/devel/cquery/work/cquery-20180718/third_party/loguru -I/wrkdirs/usr/ports/devel/cquery/work/cquery-20180718/third_party/msgpack-c/include -I/wrkdirs/usr/ports/devel/cquery/work/cquery-20180718/third_party/pugixml/src -I/wrkdirs/usr/ports/devel/cquery/work/cquery-20180718/third_party/rapidjson/include -I/wrkdirs/usr/ports/devel/cquery/work/cquery-20180718/third_party/sparsepp -isystem /usr/local/llvm90/include -O2 -pipe  -fstack-protector-strong -Wl,-rpath=/usr/local/lib/gcc10  -Wl,-rpath=/usr/local/lib/gcc10 -O2 -pipe  -fstack-protector-strong -Wl,-rpath=/usr/local/lib/gcc10  -Wl,-rpath=/usr/l
 ocal/lib/gcc10 -Wall -Wno-sign-compare -Wno-unknown-pragmas -Wno-return-type -Wno-unused-result -pthread -std=c++14 -MD -MT CMakeFiles/cquery.dir/src/options.cc.o -MF CMakeFiles/cquery.dir/src/options.cc.o.d -o CMakeFiles/cquery.dir/src/options.cc.o -c /wrkdirs/usr/ports/devel/cquery/work/cquery-20180718/src/options.cc
FAILED: CMakeFiles/cquery.dir/src/options.cc.o 
/usr/local/bin/g++10 -DDEFAULT_RESOURCE_DIRECTORY=\"/usr/local/llvm90/lib/clang/9.0.1\" -DLOGURU_FILENAME_WIDTH=18 -DLOGURU_THREADNAME_WIDTH=13 -DLOGURU_WITH_STREAMS=1 -I/wrkdirs/usr/ports/devel/cquery/work/cquery-20180718/src -I/wrkdirs/usr/ports/devel/cquery/work/cquery-20180718/third_party -I/wrkdirs/usr/ports/devel/cquery/work/cquery-20180718/third_party/doctest -I/wrkdirs/usr/ports/devel/cquery/work/cquery-20180718/third_party/loguru -I/wrkdirs/usr/ports/devel/cquery/work/cquery-20180718/third_party/msgpack-c/include -I/wrkdirs/usr/ports/devel/cquery/work/cquery-20180718/third_party/pugixml/src -I/wrkdirs/usr/ports/devel/cquery/work/cquery-20180718/third_party/rapidjson/include -I/wrkdirs/usr/ports/devel/cquery/work/cquery-20180718/third_party/sparsepp -isystem /usr/local/llvm90/include -O2 -pipe  -fstack-protector-strong -Wl,-rpath=/usr/local/lib/gcc10  -Wl,-rpath=/usr/local/lib/gcc10 -O2 -pipe  -fstack-protector-strong -Wl,-rpath=/usr/local/lib/gcc10  -Wl,-rpath=/usr/local/lib
 /gcc10 -Wall -Wno-sign-compare -Wno-unknown-pragmas -Wno-return-type -Wno-unused-result -pthread -std=c++14 -MD -MT CMakeFiles/cquery.dir/src/options.cc.o -MF CMakeFiles/cquery.dir/src/options.cc.o.d -o CMakeFiles/cquery.dir/src/options.cc.o -c /wrkdirs/usr/ports/devel/cquery/work/cquery-20180718/src/options.cc
In file included from /wrkdirs/usr/ports/devel/cquery/work/cquery-20180718/src/options.cc:1:
/wrkdirs/usr/ports/devel/cquery/work/cquery-20180718/src/options.h:5:25: error: 'string' is not a member of 'std'
    5 | std::unordered_map<std::string, std::string> ParseOptions(int argc,
      |                         ^~~~~~
/wrkdirs/usr/ports/devel/cquery/work/cquery-20180718/src/options.h:4:1: note: 'std::string' is defined in header '<string>'; did you forget to '#include <string>'?
    3 | #include <unordered_map>
  +++ |+#include <string>
    4 | 
/wrkdirs/usr/ports/devel/cquery/work/cquery-20180718/src/options.h:5:25: error: 'string' is not a member of 'std'
    5 | std::unordered_map<std::string, std::string> ParseOptions(int argc,
      |                         ^~~~~~
/wrkdirs/usr/ports/devel/cquery/work/cquery-20180718/src/options.h:5:25: note: 'std::string' is defined in header '<string>'; did you forget to '#include <string>'?
/wrkdirs/usr/ports/devel/cquery/work/cquery-20180718/src/options.h:5:38: error: 'string' is not a member of 'std'
    5 | std::unordered_map<std::string, std::string> ParseOptions(int argc,
      |                                      ^~~~~~
/wrkdirs/usr/ports/devel/cquery/work/cquery-20180718/src/options.h:5:38: note: 'std::string' is defined in header '<string>'; did you forget to '#include <string>'?
/wrkdirs/usr/ports/devel/cquery/work/cquery-20180718/src/options.h:5:38: error: 'string' is not a member of 'std'
/wrkdirs/usr/ports/devel/cquery/work/cquery-20180718/src/options.h:5:38: note: 'std::string' is defined in header '<string>'; did you forget to '#include <string>'?
/wrkdirs/usr/ports/devel/cquery/work/cquery-20180718/src/options.h:5:44: error: template argument 1 is invalid
    5 | std::unordered_map<std::string, std::string> ParseOptions(int argc,
      |                                            ^
/wrkdirs/usr/ports/devel/cquery/work/cquery-20180718/src/options.h:5:44: error: template argument 2 is invalid
/wrkdirs/usr/ports/devel/cquery/work/cquery-20180718/src/options.h:5:44: error: template argument 3 is invalid
/wrkdirs/usr/ports/devel/cquery/work/cquery-20180718/src/options.h:5:44: error: template argument 4 is invalid
/wrkdirs/usr/ports/devel/cquery/work/cquery-20180718/src/options.h:5:44: error: template argument 5 is invalid
/wrkdirs/usr/ports/devel/cquery/work/cquery-20180718/src/options.h:8:46: error: 'string' is not a member of 'std'
    8 | bool HasOption(const std::unordered_map<std::string, std::string>& options,
      |                                              ^~~~~~
/wrkdirs/usr/ports/devel/cquery/work/cquery-20180718/src/options.h:8:46: note: 'std::string' is defined in header '<string>'; did you forget to '#include <string>'?
/wrkdirs/usr/ports/devel/cquery/work/cquery-20180718/src/options.h:8:46: error: 'string' is not a member of 'std'
/wrkdirs/usr/ports/devel/cquery/work/cquery-20180718/src/options.h:8:46: note: 'std::string' is defined in header '<string>'; did you forget to '#include <string>'?
/wrkdirs/usr/ports/devel/cquery/work/cquery-20180718/src/options.h:8:59: error: 'string' is not a member of 'std'
    8 | bool HasOption(const std::unordered_map<std::string, std::string>& options,
      |                                                           ^~~~~~
/wrkdirs/usr/ports/devel/cquery/work/cquery-20180718/src/options.h:8:59: note: 'std::string' is defined in header '<string>'; did you forget to '#include <string>'?
/wrkdirs/usr/ports/devel/cquery/work/cquery-20180718/src/options.h:8:59: error: 'string' is not a member of 'std'
/wrkdirs/usr/ports/devel/cquery/work/cquery-20180718/src/options.h:8:59: note: 'std::string' is defined in header '<string>'; did you forget to '#include <string>'?
/wrkdirs/usr/ports/devel/cquery/work/cquery-20180718/src/options.h:8:65: error: template argument 1 is invalid
    8 | bool HasOption(const std::unordered_map<std::string, std::string>& options,
      |                                                                 ^
/wrkdirs/usr/ports/devel/cquery/work/cquery-20180718/src/options.h:8:65: error: template argument 2 is invalid
/wrkdirs/usr/ports/devel/cquery/work/cquery-20180718/src/options.h:8:65: error: template argument 3 is invalid
/wrkdirs/usr/ports/devel/cquery/work/cquery-20180718/src/options.h:8:65: error: template argument 4 is invalid
/wrkdirs/usr/ports/devel/cquery/work/cquery-20180718/src/options.h:8:65: error: template argument 5 is invalid
/wrkdirs/usr/ports/devel/cquery/work/cquery-20180718/src/options.h:9:27: error: 'string' in namespace 'std' does not name a type
    9 |                const std::string& option);
      |                           ^~~~~~
/wrkdirs/usr/ports/devel/cquery/work/cquery-20180718/src/options.h:9:22: note: 'std::string' is defined in header '<string>'; did you forget to '#include <string>'?
    9 |                const std::string& option);
      |                      ^~~
/wrkdirs/usr/ports/devel/cquery/work/cquery-20180718/src/options.cc:7:46: error: ambiguating new declaration of 'std::unordered_map<std::__cxx11::basic_string<char>, std::__cxx11::basic_string<char> > ParseOptions(int, char**)'
    7 | std::unordered_map<std::string, std::string> ParseOptions(int argc,
      |                                              ^~~~~~~~~~~~
In file included from /wrkdirs/usr/ports/devel/cquery/work/cquery-20180718/src/options.cc:1:
/wrkdirs/usr/ports/devel/cquery/work/cquery-20180718/src/options.h:5:46: note: old declaration 'int ParseOptions(int, char**)'
    5 | std::unordered_map<std::string, std::string> ParseOptions(int argc,
      |                                              ^~~~~~~~~~~~
[31/91] /usr/local/bin/g++10 -DDEFAULT_RESOURCE_DIRECTORY=\"/usr/local/llvm90/lib/clang/9.0.1\" -DLOGURU_FILENAME_WIDTH=18 -DLOGURU_THREADNAME_WIDTH=13 -DLOGURU_WITH_STREAMS=1 -I/wrkdirs/usr/ports/devel/cquery/work/cquery-20180718/src -I/wrkdirs/usr/ports/devel/cquery/work/cquery-20180718/third_party -I/wrkdirs/usr/ports/devel/cquery/work/cquery-20180718/third_party/doctest -I/wrkdirs/usr/ports/devel/cquery/work/cquery-20180718/third_party/loguru -I/wrkdirs/usr/ports/devel/cquery/work/cquery-20180718/third_party/msgpack-c/include -I/wrkdirs/usr/ports/devel/cquery/work/cquery-20180718/third_party/pugixml/src -I/wrkdirs/usr/ports/devel/cquery/work/cquery-20180718/third_party/rapidjson/include -I/wrkdirs/usr/ports/devel/cquery/work/cquery-20180718/third_party/sparsepp -isystem /usr/local/llvm90/include -O2 -pipe  -fstack-protector-strong -Wl,-rpath=/usr/local/lib/gcc10  -Wl,-rpath=/usr/local/lib/gcc10 -O2 -pipe  -fstack-protector-strong -Wl,-rpath=/usr/local/lib/gcc10  -Wl,-rpath=/usr/l
 ocal/lib/gcc10 -Wall -Wno-sign-compare -Wno-unknown-pragmas -Wno-return-type -Wno-unused-result -pthread -std=c++14 -MD -MT CMakeFiles/cquery.dir/src/match.cc.o -MF CMakeFiles/cquery.dir/src/match.cc.o.d -o CMakeFiles/cquery.dir/src/match.cc.o -c /wrkdirs/usr/ports/devel/cquery/work/cquery-20180718/src/match.cc
/wrkdirs/usr/ports/devel/cquery/work/cquery-20180718/src/match.cc: In static member function 'static std::experimental::optional<Matcher> Matcher::Create(const string&)':
/wrkdirs/usr/ports/devel/cquery/work/cquery-20180718/src/match.cc:29:27: warning: catching polymorphic type 'class std::exception' by value [-Wcatch-value=]
   29 |   } catch (std::exception e) {
      |                           ^
ninja: build stopped: subcommand failed.
===> Compilation failed unexpectedly.
Try to set MAKE_JOBS_UNSAFE=yes and rebuild before reporting the failure to
the maintainer.
*** Error code 1

Stop.
make: stopped in /usr/ports/devel/cquery
Received on Tue Jun 29 2021 - 04:23:49 UTC

Original text of this message