[package - 122powerpc64-quarterly][lang/hermes] Failed for hermes-javascript-engine-0.7.2.20210322 in build

From: <pkg-fallout_at_FreeBSD.org>
Date: Tue, 29 Jun 2021 04:04:36 GMT
You are receiving this mail as a port that you maintain
is failing to build on the FreeBSD package build server.
Please investigate the failure and submit a PR to fix
build.

Maintainer:     yuri_at_FreeBSD.org
Log URL:        http://foul1.nyi.freebsd.org/data/122powerpc64-quarterly/ae162bd98935/logs/hermes-javascript-engine-0.7.2.20210322.log
Build URL:      http://foul1.nyi.freebsd.org/build.html?mastername=122powerpc64-quarterly&build=ae162bd98935
Log:

=>> Building lang/hermes
build started at Tue Jun 29 04:01:24 UTC 2021
port directory: /usr/ports/lang/hermes
package name: hermes-javascript-engine-0.7.2.20210322
building for: FreeBSD 122powerpc64-quarterly-job-02 12.2-RELEASE FreeBSD 12.2-RELEASE powerpc
maintained by: yuri_at_FreeBSD.org
Makefile ident: 
Poudriere version: 3.2.8-8-gaf08dbda
Host OSVERSION: 1400008
Jail OSVERSION: 1202000
Job Id: 02

---Begin Environment---
SHELL=/bin/csh
OSVERSION=1202000
UNAME_v=FreeBSD 12.2-RELEASE
UNAME_r=12.2-RELEASE
BLOCKSIZE=K
MAIL=/var/mail/root
STATUS=1
HOME=/root
PATH=/sbin:/bin:/usr/sbin:/usr/bin:/usr/local/sbin:/usr/local/bin:/root/bin
LOCALBASE=/usr/local
USER=root
LIBEXECPREFIX=/usr/local/libexec/poudriere
POUDRIERE_VERSION=3.2.8-8-gaf08dbda
MASTERMNT=/usr/local/poudriere/data/.m/122powerpc64-quarterly/ref
POUDRIERE_BUILD_TYPE=bulk
PACKAGE_BUILDING=yes
SAVED_TERM=
PWD=/usr/local/poudriere/data/.m/122powerpc64-quarterly/ref/.p/pool
P_PORTS_FEATURES=FLAVORS SELECTED_OPTIONS
MASTERNAME=122powerpc64-quarterly
SCRIPTPREFIX=/usr/local/share/poudriere
OLDPWD=/usr/local/poudriere/data/.m/122powerpc64-quarterly/ref/.p
SCRIPTPATH=/usr/local/share/poudriere/bulk.sh
POUDRIEREPATH=/usr/local/bin/poudriere
---End Environment---

---Begin Poudriere Port Flags/Env---
PORT_FLAGS=
PKGENV=
FLAVOR=
DEPENDS_ARGS=
MAKE_ARGS=
---End Poudriere Port Flags/Env---

---Begin OPTIONS List---
---End OPTIONS List---

--MAINTAINER--
yuri_at_FreeBSD.org
--End MAINTAINER--

--CONFIGURE_ARGS--

--End CONFIGURE_ARGS--

--CONFIGURE_ENV--
PYTHON="/usr/local/bin/python3.7" XDG_DATA_HOME=/wrkdirs/usr/ports/lang/hermes/work  XDG_CONFIG_HOME=/wrkdirs/usr/ports/lang/hermes/work  HOME=/wrkdirs/usr/ports/lang/hermes/work TMPDIR="/tmp" PATH=/wrkdirs/usr/ports/lang/hermes/work/.bin:/sbin:/bin:/usr/sbin:/usr/bin:/usr/local/sbin:/usr/local/bin:/root/bin SHELL=/bin/sh CONFIG_SHELL=/bin/sh
--End CONFIGURE_ENV--

--MAKE_ENV--
XDG_DATA_HOME=/wrkdirs/usr/ports/lang/hermes/work  XDG_CONFIG_HOME=/wrkdirs/usr/ports/lang/hermes/work  HOME=/wrkdirs/usr/ports/lang/hermes/work TMPDIR="/tmp" PATH=/wrkdirs/usr/ports/lang/hermes/work/.bin:/sbin:/bin:/usr/sbin:/usr/bin:/usr/local/sbin:/usr/local/bin:/root/bin NO_PIE=yes MK_DEBUG_FILES=no MK_KERNEL_SYMBOLS=no SHELL=/bin/sh NO_LINT=YES ADDR2LINE="/usr/local/bin/addr2line" AR="/usr/local/bin/ar" AS="/usr/local/bin/as" CPPFILT="/usr/local/bin/c++filt" GPROF="/usr/local/bin/gprof" LD="/usr/local/bin/ld" NM="/usr/local/bin/nm" OBJCOPY="/usr/local/bin/objcopy" OBJDUMP="/usr/local/bin/objdump" RANLIB="/usr/local/bin/ranlib" READELF="/usr/local/bin/readelf" SIZE="/usr/local/bin/size" STRINGS="/usr/local/bin/strings" DESTDIR=/wrkdirs/usr/ports/lang/hermes/work/stage PREFIX=/usr/local  LOCALBASE=/usr/local  CC="gcc10" CFLAGS="-O2 -pipe  -fstack-protector-strong -Wl,-rpath=/usr/local/lib/gcc10 -fno-strict-aliasing "  CPP="cpp10" CPPFLAGS="-I/usr/local/include"  LDFLAGS=" -L/usr/l
 ocal/lib -fstack-protector-strong -Wl,-rpath=/usr/local/lib/gcc10 -L/usr/local/lib/gcc10 " LIBS=""  CXX="g++10" CXXFLAGS="-O2 -pipe  -fstack-protector-strong -Wl,-rpath=/usr/local/lib/gcc10  -Wl,-rpath=/usr/local/lib/gcc10 "  MANPREFIX="/usr/local" BSD_INSTALL_PROGRAM="install  -s -m 555"  BSD_INSTALL_LIB="install  -s -m 0644"  BSD_INSTALL_SCRIPT="install  -m 555"  BSD_INSTALL_DATA="install  -m 0644"  BSD_INSTALL_MAN="install  -m 444"
--End MAKE_ENV--

--PLIST_SUB--
CMAKE_BUILD_TYPE="release" PYTHON_INCLUDEDIR=include/python3.7m  PYTHON_LIBDIR=lib/python3.7  PYTHON_PLATFORM=freebsd12  PYTHON_SITELIBDIR=lib/python3.7/site-packages  PYTHON_SUFFIX=37  PYTHON_EXT_SUFFIX=  PYTHON_VER=3.7  PYTHON_VERSION=python3.7 PYTHON2="_at_comment " PYTHON3="" OSREL=12.2 PREFIX=%D LOCALBASE=/usr/local  RESETPREFIX=/usr/local LIB32DIR=lib DOCSDIR="share/doc/hermes"  EXAMPLESDIR="share/examples/hermes"  DATADIR="share/hermes"  WWWDIR="www/hermes"  ETCDIR="etc/hermes"
--End PLIST_SUB--

--SUB_LIST--
PREFIX=/usr/local LOCALBASE=/usr/local  DATADIR=/usr/local/share/hermes DOCSDIR=/usr/local/share/doc/hermes EXAMPLESDIR=/usr/local/share/examples/hermes  WWWDIR=/usr/local/www/hermes ETCDIR=/usr/local/etc/hermes
--End SUB_LIST--

---Begin make.conf---
USE_PACKAGE_DEPENDS=yes
BATCH=yes
WRKDIRPREFIX=/wrkdirs
PORTSDIR=/usr/ports
PACKAGES=/packages
DISTDIR=/distfiles
PACKAGE_BUILDING=yes
PACKAGE_BUILDING_FLAVORS=yes
#### /usr/local/etc/poudriere.d/make.conf ####
# XXX: We really need this but cannot use it while 'make checksum' does not
# try the next mirror on checksum failure.  It currently retries the same
# failed mirror and then fails rather then trying another.  It *does*
# try the next if the size is mismatched though.
#MASTER_SITE_FREEBSD=yes
# Build ALLOW_MAKE_JOBS_PACKAGES with 2 jobs
MAKE_JOBS_NUMBER=2
#### /usr/ports/Mk/Scripts/ports_env.sh ####
_CCVERSION_921dbbb2=cc (GCC) 4.2.1 20070831 patched [FreeBSD] Copyright (C) 2007 Free Software Foundation, Inc. This is free software; see the source for copying conditions. There is NO warranty; not even for MERCHANTABILITY or FITNESS FOR A PARTICULAR PURPOSE.
_ALTCCVERSION_921dbbb2=none
_CXXINTERNAL_acaad9ca=Using built-in specs. Target: powerpc64-undermydesk-freebsd Configured with: FreeBSD/powerpc64 system compiler Thread model: posix gcc version 4.2.1 20070831 patched [FreeBSD] "/usr/bin/ld" "--eh-frame-hdr" "-Qy" "-melf64ppc_fbsd" "--enable-new-dtags" "-dynamic-linker" "/libexec/ld-elf.so.1" "/usr/lib/crt1.o" "/usr/lib/crti.o" "/usr/lib/crtbegin.o" "-L/usr/lib" "-L/usr/lib" "/dev/null" "-lstdc++" "-lm" "-lgcc_s" "-lgcc" "-lc" "-lgcc_s" "-lgcc" "/usr/lib/crtsavres.o" "/usr/lib/crtend.o" "/usr/lib/crtn.o"
CC_OUTPUT_921dbbb2_58173849=yes
CC_OUTPUT_921dbbb2_9bdba57c=yes
CC_OUTPUT_921dbbb2_6a4fe7f5=cc1: error: unrecognized command line option "-std=c11"
CC_OUTPUT_921dbbb2_6bcac02b=yes
CC_OUTPUT_921dbbb2_67d20829=yes
CC_OUTPUT_921dbbb2_bfa62e83=cc1: error: unrecognized command line option "-std=gnu11"
CC_OUTPUT_921dbbb2_f0b4d593=yes
CC_OUTPUT_921dbbb2_308abb44=cc1plus: error: unrecognized command line option "-std=c++0x"
CC_OUTPUT_921dbbb2_f00456e5=cc1plus: error: unrecognized command line option "-std=c++11"
CC_OUTPUT_921dbbb2_65ad290d=cc1plus: error: unrecognized command line option "-std=c++14"
CC_OUTPUT_921dbbb2_f2776b26=cc1plus: error: unrecognized command line option "-std=c++17"
CC_OUTPUT_921dbbb2_b2657cc3=yes
CC_OUTPUT_921dbbb2_380987f7=cc1plus: error: unrecognized command line option "-std=gnu++11"
CC_OUTPUT_921dbbb2_160933ec=cc1plus: error: unrecognized command line option "-std=gnu++14"
CC_OUTPUT_921dbbb2_fb62803b=cc1plus: error: unrecognized command line option "-std=gnu++17"
_OBJC_CCVERSION_921dbbb2=cc (GCC) 4.2.1 20070831 patched [FreeBSD] Copyright (C) 2007 Free Software Foundation, Inc. This is free software; see the source for copying conditions. There is NO warranty; not even for MERCHANTABILITY or FITNESS FOR A PARTICULAR PURPOSE.
_OBJC_ALTCCVERSION_921dbbb2=none
ARCH=powerpc64
PPC_ABI=ELFv1
OPSYS=FreeBSD
_OSRELEASE=12.2-RELEASE
OSREL=12.2
OSVERSION=1202000
PYTHONBASE=/usr/local
CONFIGURE_MAX_CMD_LEN=524288
HAVE_PORTS_ENV=1
#### Misc Poudriere ####
GID=0
UID=0
---End make.conf---
--Resource limits--
cpu time               (seconds, -t)  unlimited
file size           (512-blocks, -f)  unlimited
data seg size           (kbytes, -d)  33554432
stack size              (kbytes, -s)  524288
core file size      (512-blocks, -c)  unlimited
max memory size         (kbytes, -m)  unlimited
locked memory           (kbytes, -l)  unlimited
max user processes              (-u)  89999
open files                      (-n)  1024
virtual mem size        (kbytes, -v)  unlimited
swap limit              (kbytes, -w)  unlimited
socket buffer size       (bytes, -b)  unlimited
pseudo-terminals                (-p)  unlimited
kqueues                         (-k)  unlimited
umtx shared locks               (-o)  unlimited
--End resource limits--
=======================<phase: check-sanity   >============================
===>  License MIT accepted by the user
===========================================================================
=======================<phase: pkg-depends    >============================
===>   hermes-javascript-engine-0.7.2.20210322 depends on file: /usr/local/sbin/pkg - not found
===>   Installing existing package /packages/All/pkg-1.16.3.txz
[122powerpc64-quarterly-job-02] Installing pkg-1.16.3...
[122powerpc64-quarterly-job-02] Extracting pkg-1.16.3: .......... done
===>   hermes-javascript-engine-0.7.2.20210322 depends on file: /usr/local/sbin/pkg - found
===>   Returning to build of hermes-javascript-engine-0.7.2.20210322
===========================================================================
=======================<phase: fetch-depends  >============================
===========================================================================
=======================<phase: fetch          >============================
===>  License MIT accepted by the user
===> Fetching all distfiles required by hermes-javascript-engine-0.7.2.20210322 for building
===========================================================================
=======================<phase: checksum       >============================
===>  License MIT accepted by the user
===> Fetching all distfiles required by hermes-javascript-engine-0.7.2.20210322 for building
=> SHA256 Checksum OK for facebook-hermes-v0.7.2.20210322-1ed8051_GH0.tar.gz.
===========================================================================
=======================<phase: extract-depends>============================
===========================================================================
=======================<phase: extract        >============================
===>  License MIT accepted by the user
===> Fetching all distfiles required by hermes-javascript-engine-0.7.2.20210322 for building
===>  Extracting for hermes-javascript-engine-0.7.2.20210322
=> SHA256 Checksum OK for facebook-hermes-v0.7.2.20210322-1ed8051_GH0.tar.gz.
===========================================================================
=======================<phase: patch-depends  >============================
===========================================================================
=======================<phase: patch          >============================
===>  Patching for hermes-javascript-engine-0.7.2.20210322
===>  Applying FreeBSD patches for hermes-javascript-engine-0.7.2.20210322 from /usr/ports/lang/hermes/files
===========================================================================
=======================<phase: build-depends  >============================
===>   hermes-javascript-engine-0.7.2.20210322 depends on file: /usr/local/bin/cmake - not found
===>   Installing existing package /packages/All/cmake-3.19.6.txz
[122powerpc64-quarterly-job-02] Installing cmake-3.19.6...
[122powerpc64-quarterly-job-02] `-- Installing curl-7.76.0...
[122powerpc64-quarterly-job-02] |   `-- Installing ca_root_nss-3.63...
[122powerpc64-quarterly-job-02] |   `-- Extracting ca_root_nss-3.63: ........ done
[122powerpc64-quarterly-job-02] |   `-- Installing libnghttp2-1.43.0...
[122powerpc64-quarterly-job-02] |   | `-- Installing gcc10-10.2.0_1...
[122powerpc64-quarterly-job-02] |   |   `-- Installing binutils-2.33.1_4,1...
[122powerpc64-quarterly-job-02] |   |   | `-- Installing gettext-runtime-0.21...
[122powerpc64-quarterly-job-02] |   |   |   `-- Installing indexinfo-0.3.1...
[122powerpc64-quarterly-job-02] |   |   |   `-- Extracting indexinfo-0.3.1: .... done
[122powerpc64-quarterly-job-02] |   |   | `-- Extracting gettext-runtime-0.21: .......... done
[122powerpc64-quarterly-job-02] |   |   `-- Extracting binutils-2.33.1_4,1: .......... done
[122powerpc64-quarterly-job-02] |   |   `-- Installing gcc9-9.3.0_3...
[122powerpc64-quarterly-job-02] |   |   | `-- Installing gmp-6.2.1...
[122powerpc64-quarterly-job-02] |   |   | `-- Extracting gmp-6.2.1: .......... done
[122powerpc64-quarterly-job-02] |   |   | `-- Installing mpc-1.2.0...
[122powerpc64-quarterly-job-02] |   |   |   `-- Installing mpfr-4.1.0...
[122powerpc64-quarterly-job-02] |   |   |   `-- Extracting mpfr-4.1.0: .......... done
<snip>
-- Looking for xar_open in xar - not found
-- Looking for arc4random
-- Looking for arc4random - found
-- Looking for backtrace
-- Looking for backtrace - not found
-- Found Backtrace: /usr/lib/libexecinfo.so  
-- Performing Test C_SUPPORTS_WERROR_UNGUARDED_AVAILABILITY_NEW
-- Performing Test C_SUPPORTS_WERROR_UNGUARDED_AVAILABILITY_NEW - Failed
-- Looking for _Unwind_Backtrace
-- Looking for _Unwind_Backtrace - found
-- Looking for getpagesize
-- Looking for getpagesize - found
-- Looking for sysconf
-- Looking for sysconf - found
-- Looking for getrusage
-- Looking for getrusage - found
-- Looking for setrlimit
-- Looking for setrlimit - found
-- Looking for isatty
-- Looking for isatty - found
-- Looking for futimens
-- Looking for futimens - found
-- Looking for futimes
-- Looking for futimes - found
-- Looking for posix_fallocate
-- Looking for posix_fallocate - found
-- Looking for sigaltstack
-- Looking for sigaltstack - found
-- Looking for lseek64
-- Looking for lseek64 - not found
-- Looking for mallctl
-- Looking for mallctl - found
-- Looking for mallinfo
-- Looking for mallinfo - not found
-- Looking for malloc_zone_statistics
-- Looking for malloc_zone_statistics - not found
-- Looking for getrlimit
-- Looking for getrlimit - found
-- Looking for posix_spawn
-- Looking for posix_spawn - found
-- Looking for pread
-- Looking for pread - found
-- Looking for realpath
-- Looking for realpath - found
-- Looking for sbrk
-- Looking for sbrk - found
-- Looking for strerror
-- Looking for strerror - found
-- Looking for strerror_r
-- Looking for strerror_r - found
-- Looking for strerror_s
-- Looking for strerror_s - not found
-- Looking for setenv
-- Looking for setenv - found
-- Looking for dlopen
-- Looking for dlopen - found
-- Looking for dladdr
-- Looking for dladdr - found
-- Looking for __GLIBC__
-- Looking for __GLIBC__ - not found
-- Looking for sched_getaffinity
-- Looking for sched_getaffinity - not found
-- Looking for CPU_COUNT
-- Looking for CPU_COUNT - not found
-- Looking for pthread_getname_np
-- Looking for pthread_getname_np - found
-- Looking for pthread_setname_np
-- Looking for pthread_setname_np - found
-- Performing Test HAVE_CXX_ATOMICS_WITHOUT_LIB
-- Performing Test HAVE_CXX_ATOMICS_WITHOUT_LIB - Success
-- Performing Test HAVE_CXX_ATOMICS64_WITHOUT_LIB
-- Performing Test HAVE_CXX_ATOMICS64_WITHOUT_LIB - Success
-- Performing Test LLVM_HAS_ATOMICS
-- Performing Test LLVM_HAS_ATOMICS - Success
-- Performing Test SUPPORTS_NO_PIE_FLAG
-- Performing Test SUPPORTS_NO_PIE_FLAG - Success
-- Performing Test SUPPORTS_VARIADIC_MACROS_FLAG
-- Performing Test SUPPORTS_VARIADIC_MACROS_FLAG - Success
-- Performing Test SUPPORTS_GNU_ZERO_VARIADIC_MACRO_ARGUMENTS_FLAG
-- Performing Test SUPPORTS_GNU_ZERO_VARIADIC_MACRO_ARGUMENTS_FLAG - Failed
-- Performing Test HAS_MAYBE_UNINITIALIZED
-- Performing Test HAS_MAYBE_UNINITIALIZED - Success
-- Threads enabled.
-- Doxygen disabled.
-- Go bindings disabled.
-- Could NOT find Python module pygments
-- Could NOT find Python module pygments.lexers.c_cpp
-- Could NOT find Python module yaml
-- Performing Test HAVE_IS_TRIVIALLY_COPYABLE
-- Performing Test HAVE_IS_TRIVIALLY_COPYABLE - Success
-- CMAKE_HOST_SYSTEM_NAME = FreeBSD
-- CMAKE_SYSTEM_NAME = FreeBSD
-- HERMES_APPLE_TARGET_PLATFORM = 
-- CMAKE_CROSSCOMPILING = FALSE
-- Configuring done
-- Generating done
CMake Warning:
  Manually-specified variables were not used by the project:

    BOOST_PYTHON_SUFFIX
    CMAKE_COLOR_MAKEFILE
    CMAKE_MODULE_LINKER_FLAGS
    CMAKE_VERBOSE_MAKEFILE


-- Build files have been written to: /wrkdirs/usr/ports/lang/hermes/work/.build
===========================================================================
=======================<phase: build          >============================
===>  Building for hermes-javascript-engine-0.7.2.20210322
[1/394] /usr/local/bin/g++10 -DHERMESVM_ALLOW_COMPRESSED_POINTERS -DHERMESVM_ALLOW_CONCURRENT_GC -DHERMESVM_GC_NONCONTIG_GENERATIONAL -DHERMESVM_HEAP_SEGMENT_SIZE_KB=4096 -DHERMES_ENABLE_DEBUGGER -DHERMES_LLVM -DHERMES_RELEASE_VERSION=\"0.7.0\" -I/wrkdirs/usr/ports/lang/hermes/work/hermes-1ed8051/external -I/wrkdirs/usr/ports/lang/hermes/work/hermes-1ed8051/external/flowparser/include -I/wrkdirs/usr/ports/lang/hermes/work/hermes-1ed8051/public -I/wrkdirs/usr/ports/lang/hermes/work/hermes-1ed8051/include -Iinclude -I/wrkdirs/usr/ports/lang/hermes/work/hermes-1ed8051/external/llvh/include -I/wrkdirs/usr/ports/lang/hermes/work/hermes-1ed8051/external/llvh/gen/include -Iexternal/llvh/include -O2 -pipe  -fstack-protector-strong -Wl,-rpath=/usr/local/lib/gcc10  -Wl,-rpath=/usr/local/lib/gcc10 -Wall -Wextra -Wno-unused-parameter -Wwrite-strings -Wcast-qual -Wno-missing-field-initializers -Wno-maybe-uninitialized -Wno-class-memaccess -Wno-noexcept-type -Wdelete-non-virtual-dtor -Wno-init-lis
 t-lifetime -Wno-redundant-move -fvisibility=hidden -O2 -pipe  -fstack-protector-strong -Wl,-rpath=/usr/local/lib/gcc10  -Wl,-rpath=/usr/local/lib/gcc10 -fPIC -std=c++14  -fno-exceptions -fno-rtti -MD -MT external/llvh/lib/Support/CMakeFiles/LLVHSupport.dir/APFloat.cpp.o -MF external/llvh/lib/Support/CMakeFiles/LLVHSupport.dir/APFloat.cpp.o.d -o external/llvh/lib/Support/CMakeFiles/LLVHSupport.dir/APFloat.cpp.o -c /wrkdirs/usr/ports/lang/hermes/work/hermes-1ed8051/external/llvh/lib/Support/APFloat.cpp
[2/394] /usr/local/bin/g++10 -DHERMESVM_ALLOW_COMPRESSED_POINTERS -DHERMESVM_ALLOW_CONCURRENT_GC -DHERMESVM_GC_NONCONTIG_GENERATIONAL -DHERMESVM_HEAP_SEGMENT_SIZE_KB=4096 -DHERMES_ENABLE_DEBUGGER -DHERMES_LLVM -DHERMES_RELEASE_VERSION=\"0.7.0\" -I/wrkdirs/usr/ports/lang/hermes/work/hermes-1ed8051/external -I/wrkdirs/usr/ports/lang/hermes/work/hermes-1ed8051/external/flowparser/include -I/wrkdirs/usr/ports/lang/hermes/work/hermes-1ed8051/public -I/wrkdirs/usr/ports/lang/hermes/work/hermes-1ed8051/include -Iinclude -I/wrkdirs/usr/ports/lang/hermes/work/hermes-1ed8051/external/llvh/include -I/wrkdirs/usr/ports/lang/hermes/work/hermes-1ed8051/external/llvh/gen/include -Iexternal/llvh/include -O2 -pipe  -fstack-protector-strong -Wl,-rpath=/usr/local/lib/gcc10  -Wl,-rpath=/usr/local/lib/gcc10 -Wall -Wextra -Wno-unused-parameter -Wwrite-strings -Wcast-qual -Wno-missing-field-initializers -Wno-maybe-uninitialized -Wno-class-memaccess -Wno-noexcept-type -Wdelete-non-virtual-dtor -Wno-init-lis
 t-lifetime -Wno-redundant-move -fvisibility=hidden -O2 -pipe  -fstack-protector-strong -Wl,-rpath=/usr/local/lib/gcc10  -Wl,-rpath=/usr/local/lib/gcc10 -fPIC -std=c++14  -fno-exceptions -fno-rtti -MD -MT external/llvh/lib/Support/CMakeFiles/LLVHSupport.dir/APInt.cpp.o -MF external/llvh/lib/Support/CMakeFiles/LLVHSupport.dir/APInt.cpp.o.d -o external/llvh/lib/Support/CMakeFiles/LLVHSupport.dir/APInt.cpp.o -c /wrkdirs/usr/ports/lang/hermes/work/hermes-1ed8051/external/llvh/lib/Support/APInt.cpp
[3/394] /usr/local/bin/g++10 -DHERMESVM_ALLOW_COMPRESSED_POINTERS -DHERMESVM_ALLOW_CONCURRENT_GC -DHERMESVM_GC_NONCONTIG_GENERATIONAL -DHERMESVM_HEAP_SEGMENT_SIZE_KB=4096 -DHERMES_ENABLE_DEBUGGER -DHERMES_LLVM -DHERMES_RELEASE_VERSION=\"0.7.0\" -I/wrkdirs/usr/ports/lang/hermes/work/hermes-1ed8051/external -I/wrkdirs/usr/ports/lang/hermes/work/hermes-1ed8051/external/flowparser/include -I/wrkdirs/usr/ports/lang/hermes/work/hermes-1ed8051/public -I/wrkdirs/usr/ports/lang/hermes/work/hermes-1ed8051/include -Iinclude -I/wrkdirs/usr/ports/lang/hermes/work/hermes-1ed8051/external/llvh/include -I/wrkdirs/usr/ports/lang/hermes/work/hermes-1ed8051/external/llvh/gen/include -Iexternal/llvh/include -O2 -pipe  -fstack-protector-strong -Wl,-rpath=/usr/local/lib/gcc10  -Wl,-rpath=/usr/local/lib/gcc10 -Wall -Wextra -Wno-unused-parameter -Wwrite-strings -Wcast-qual -Wno-missing-field-initializers -Wno-maybe-uninitialized -Wno-class-memaccess -Wno-noexcept-type -Wdelete-non-virtual-dtor -Wno-init-lis
 t-lifetime -Wno-redundant-move -fvisibility=hidden -O2 -pipe  -fstack-protector-strong -Wl,-rpath=/usr/local/lib/gcc10  -Wl,-rpath=/usr/local/lib/gcc10 -fPIC -std=c++14  -fno-exceptions -fno-rtti -MD -MT external/llvh/lib/Support/CMakeFiles/LLVHSupport.dir/circular_raw_ostream.cpp.o -MF external/llvh/lib/Support/CMakeFiles/LLVHSupport.dir/circular_raw_ostream.cpp.o.d -o external/llvh/lib/Support/CMakeFiles/LLVHSupport.dir/circular_raw_ostream.cpp.o -c /wrkdirs/usr/ports/lang/hermes/work/hermes-1ed8051/external/llvh/lib/Support/circular_raw_ostream.cpp
[4/394] /usr/local/bin/g++10 -DHERMESVM_ALLOW_COMPRESSED_POINTERS -DHERMESVM_ALLOW_CONCURRENT_GC -DHERMESVM_GC_NONCONTIG_GENERATIONAL -DHERMESVM_HEAP_SEGMENT_SIZE_KB=4096 -DHERMES_ENABLE_DEBUGGER -DHERMES_LLVM -DHERMES_RELEASE_VERSION=\"0.7.0\" -I/wrkdirs/usr/ports/lang/hermes/work/hermes-1ed8051/external -I/wrkdirs/usr/ports/lang/hermes/work/hermes-1ed8051/external/flowparser/include -I/wrkdirs/usr/ports/lang/hermes/work/hermes-1ed8051/public -I/wrkdirs/usr/ports/lang/hermes/work/hermes-1ed8051/include -Iinclude -I/wrkdirs/usr/ports/lang/hermes/work/hermes-1ed8051/external/llvh/include -I/wrkdirs/usr/ports/lang/hermes/work/hermes-1ed8051/external/llvh/gen/include -Iexternal/llvh/include -O2 -pipe  -fstack-protector-strong -Wl,-rpath=/usr/local/lib/gcc10  -Wl,-rpath=/usr/local/lib/gcc10 -Wall -Wextra -Wno-unused-parameter -Wwrite-strings -Wcast-qual -Wno-missing-field-initializers -Wno-maybe-uninitialized -Wno-class-memaccess -Wno-noexcept-type -Wdelete-non-virtual-dtor -Wno-init-lis
 t-lifetime -Wno-redundant-move -fvisibility=hidden -O2 -pipe  -fstack-protector-strong -Wl,-rpath=/usr/local/lib/gcc10  -Wl,-rpath=/usr/local/lib/gcc10 -fPIC -std=c++14  -fno-exceptions -fno-rtti -MD -MT external/llvh/lib/Support/CMakeFiles/LLVHSupport.dir/ConvertUTF.cpp.o -MF external/llvh/lib/Support/CMakeFiles/LLVHSupport.dir/ConvertUTF.cpp.o.d -o external/llvh/lib/Support/CMakeFiles/LLVHSupport.dir/ConvertUTF.cpp.o -c /wrkdirs/usr/ports/lang/hermes/work/hermes-1ed8051/external/llvh/lib/Support/ConvertUTF.cpp
[5/394] /usr/local/bin/g++10 -DHERMESVM_ALLOW_COMPRESSED_POINTERS -DHERMESVM_ALLOW_CONCURRENT_GC -DHERMESVM_GC_NONCONTIG_GENERATIONAL -DHERMESVM_HEAP_SEGMENT_SIZE_KB=4096 -DHERMES_ENABLE_DEBUGGER -DHERMES_LLVM -DHERMES_RELEASE_VERSION=\"0.7.0\" -I/wrkdirs/usr/ports/lang/hermes/work/hermes-1ed8051/external -I/wrkdirs/usr/ports/lang/hermes/work/hermes-1ed8051/external/flowparser/include -I/wrkdirs/usr/ports/lang/hermes/work/hermes-1ed8051/public -I/wrkdirs/usr/ports/lang/hermes/work/hermes-1ed8051/include -Iinclude -I/wrkdirs/usr/ports/lang/hermes/work/hermes-1ed8051/external/llvh/include -I/wrkdirs/usr/ports/lang/hermes/work/hermes-1ed8051/external/llvh/gen/include -Iexternal/llvh/include -O2 -pipe  -fstack-protector-strong -Wl,-rpath=/usr/local/lib/gcc10  -Wl,-rpath=/usr/local/lib/gcc10 -Wall -Wextra -Wno-unused-parameter -Wwrite-strings -Wcast-qual -Wno-missing-field-initializers -Wno-maybe-uninitialized -Wno-class-memaccess -Wno-noexcept-type -Wdelete-non-virtual-dtor -Wno-init-lis
 t-lifetime -Wno-redundant-move -fvisibility=hidden -O2 -pipe  -fstack-protector-strong -Wl,-rpath=/usr/local/lib/gcc10  -Wl,-rpath=/usr/local/lib/gcc10 -fPIC -std=c++14  -fno-exceptions -fno-rtti -MD -MT external/llvh/lib/Support/CMakeFiles/LLVHSupport.dir/ConvertUTFWrapper.cpp.o -MF external/llvh/lib/Support/CMakeFiles/LLVHSupport.dir/ConvertUTFWrapper.cpp.o.d -o external/llvh/lib/Support/CMakeFiles/LLVHSupport.dir/ConvertUTFWrapper.cpp.o -c /wrkdirs/usr/ports/lang/hermes/work/hermes-1ed8051/external/llvh/lib/Support/ConvertUTFWrapper.cpp
[6/394] /usr/local/bin/g++10 -DHERMESVM_ALLOW_COMPRESSED_POINTERS -DHERMESVM_ALLOW_CONCURRENT_GC -DHERMESVM_GC_NONCONTIG_GENERATIONAL -DHERMESVM_HEAP_SEGMENT_SIZE_KB=4096 -DHERMES_ENABLE_DEBUGGER -DHERMES_LLVM -DHERMES_RELEASE_VERSION=\"0.7.0\" -I/wrkdirs/usr/ports/lang/hermes/work/hermes-1ed8051/external -I/wrkdirs/usr/ports/lang/hermes/work/hermes-1ed8051/external/flowparser/include -I/wrkdirs/usr/ports/lang/hermes/work/hermes-1ed8051/public -I/wrkdirs/usr/ports/lang/hermes/work/hermes-1ed8051/include -Iinclude -I/wrkdirs/usr/ports/lang/hermes/work/hermes-1ed8051/external/llvh/include -I/wrkdirs/usr/ports/lang/hermes/work/hermes-1ed8051/external/llvh/gen/include -Iexternal/llvh/include -O2 -pipe  -fstack-protector-strong -Wl,-rpath=/usr/local/lib/gcc10  -Wl,-rpath=/usr/local/lib/gcc10 -Wall -Wextra -Wno-unused-parameter -Wwrite-strings -Wcast-qual -Wno-missing-field-initializers -Wno-maybe-uninitialized -Wno-class-memaccess -Wno-noexcept-type -Wdelete-non-virtual-dtor -Wno-init-lis
 t-lifetime -Wno-redundant-move -fvisibility=hidden -O2 -pipe  -fstack-protector-strong -Wl,-rpath=/usr/local/lib/gcc10  -Wl,-rpath=/usr/local/lib/gcc10 -fPIC -std=c++14  -fno-exceptions -fno-rtti -MD -MT external/llvh/lib/Support/CMakeFiles/LLVHSupport.dir/Debug.cpp.o -MF external/llvh/lib/Support/CMakeFiles/LLVHSupport.dir/Debug.cpp.o.d -o external/llvh/lib/Support/CMakeFiles/LLVHSupport.dir/Debug.cpp.o -c /wrkdirs/usr/ports/lang/hermes/work/hermes-1ed8051/external/llvh/lib/Support/Debug.cpp
[7/394] /usr/local/bin/g++10 -DHERMESVM_ALLOW_COMPRESSED_POINTERS -DHERMESVM_ALLOW_CONCURRENT_GC -DHERMESVM_GC_NONCONTIG_GENERATIONAL -DHERMESVM_HEAP_SEGMENT_SIZE_KB=4096 -DHERMES_ENABLE_DEBUGGER -DHERMES_LLVM -DHERMES_RELEASE_VERSION=\"0.7.0\" -I/wrkdirs/usr/ports/lang/hermes/work/hermes-1ed8051/external -I/wrkdirs/usr/ports/lang/hermes/work/hermes-1ed8051/external/flowparser/include -I/wrkdirs/usr/ports/lang/hermes/work/hermes-1ed8051/public -I/wrkdirs/usr/ports/lang/hermes/work/hermes-1ed8051/include -Iinclude -I/wrkdirs/usr/ports/lang/hermes/work/hermes-1ed8051/external/llvh/include -I/wrkdirs/usr/ports/lang/hermes/work/hermes-1ed8051/external/llvh/gen/include -Iexternal/llvh/include -O2 -pipe  -fstack-protector-strong -Wl,-rpath=/usr/local/lib/gcc10  -Wl,-rpath=/usr/local/lib/gcc10 -Wall -Wextra -Wno-unused-parameter -Wwrite-strings -Wcast-qual -Wno-missing-field-initializers -Wno-maybe-uninitialized -Wno-class-memaccess -Wno-noexcept-type -Wdelete-non-virtual-dtor -Wno-init-lis
 t-lifetime -Wno-redundant-move -fvisibility=hidden -O2 -pipe  -fstack-protector-strong -Wl,-rpath=/usr/local/lib/gcc10  -Wl,-rpath=/usr/local/lib/gcc10 -fPIC -std=c++14  -fno-exceptions -fno-rtti -MD -MT external/llvh/lib/Support/CMakeFiles/LLVHSupport.dir/CommandLine.cpp.o -MF external/llvh/lib/Support/CMakeFiles/LLVHSupport.dir/CommandLine.cpp.o.d -o external/llvh/lib/Support/CMakeFiles/LLVHSupport.dir/CommandLine.cpp.o -c /wrkdirs/usr/ports/lang/hermes/work/hermes-1ed8051/external/llvh/lib/Support/CommandLine.cpp
[8/394] /usr/local/bin/g++10 -DHERMESVM_ALLOW_COMPRESSED_POINTERS -DHERMESVM_ALLOW_CONCURRENT_GC -DHERMESVM_GC_NONCONTIG_GENERATIONAL -DHERMESVM_HEAP_SEGMENT_SIZE_KB=4096 -DHERMES_ENABLE_DEBUGGER -DHERMES_LLVM -DHERMES_RELEASE_VERSION=\"0.7.0\" -I/wrkdirs/usr/ports/lang/hermes/work/hermes-1ed8051/external -I/wrkdirs/usr/ports/lang/hermes/work/hermes-1ed8051/external/flowparser/include -I/wrkdirs/usr/ports/lang/hermes/work/hermes-1ed8051/public -I/wrkdirs/usr/ports/lang/hermes/work/hermes-1ed8051/include -Iinclude -I/wrkdirs/usr/ports/lang/hermes/work/hermes-1ed8051/external/llvh/include -I/wrkdirs/usr/ports/lang/hermes/work/hermes-1ed8051/external/llvh/gen/include -Iexternal/llvh/include -O2 -pipe  -fstack-protector-strong -Wl,-rpath=/usr/local/lib/gcc10  -Wl,-rpath=/usr/local/lib/gcc10 -Wall -Wextra -Wno-unused-parameter -Wwrite-strings -Wcast-qual -Wno-missing-field-initializers -Wno-maybe-uninitialized -Wno-class-memaccess -Wno-noexcept-type -Wdelete-non-virtual-dtor -Wno-init-lis
 t-lifetime -Wno-redundant-move -fvisibility=hidden -O2 -pipe  -fstack-protector-strong -Wl,-rpath=/usr/local/lib/gcc10  -Wl,-rpath=/usr/local/lib/gcc10 -fPIC -std=c++14  -fno-exceptions -fno-rtti -MD -MT external/llvh/lib/Support/CMakeFiles/LLVHSupport.dir/Errno.cpp.o -MF external/llvh/lib/Support/CMakeFiles/LLVHSupport.dir/Errno.cpp.o.d -o external/llvh/lib/Support/CMakeFiles/LLVHSupport.dir/Errno.cpp.o -c /wrkdirs/usr/ports/lang/hermes/work/hermes-1ed8051/external/llvh/lib/Support/Errno.cpp
[9/394] /usr/local/bin/g++10 -DHERMESVM_ALLOW_COMPRESSED_POINTERS -DHERMESVM_ALLOW_CONCURRENT_GC -DHERMESVM_GC_NONCONTIG_GENERATIONAL -DHERMESVM_HEAP_SEGMENT_SIZE_KB=4096 -DHERMES_ENABLE_DEBUGGER -DHERMES_LLVM -DHERMES_RELEASE_VERSION=\"0.7.0\" -I/wrkdirs/usr/ports/lang/hermes/work/hermes-1ed8051/external -I/wrkdirs/usr/ports/lang/hermes/work/hermes-1ed8051/external/flowparser/include -I/wrkdirs/usr/ports/lang/hermes/work/hermes-1ed8051/public -I/wrkdirs/usr/ports/lang/hermes/work/hermes-1ed8051/include -Iinclude -I/wrkdirs/usr/ports/lang/hermes/work/hermes-1ed8051/external/llvh/include -I/wrkdirs/usr/ports/lang/hermes/work/hermes-1ed8051/external/llvh/gen/include -Iexternal/llvh/include -O2 -pipe  -fstack-protector-strong -Wl,-rpath=/usr/local/lib/gcc10  -Wl,-rpath=/usr/local/lib/gcc10 -Wall -Wextra -Wno-unused-parameter -Wwrite-strings -Wcast-qual -Wno-missing-field-initializers -Wno-maybe-uninitialized -Wno-class-memaccess -Wno-noexcept-type -Wdelete-non-virtual-dtor -Wno-init-lis
 t-lifetime -Wno-redundant-move -fvisibility=hidden -O2 -pipe  -fstack-protector-strong -Wl,-rpath=/usr/local/lib/gcc10  -Wl,-rpath=/usr/local/lib/gcc10 -fPIC -std=c++14  -fno-exceptions -fno-rtti -MD -MT external/llvh/lib/Support/CMakeFiles/LLVHSupport.dir/Error.cpp.o -MF external/llvh/lib/Support/CMakeFiles/LLVHSupport.dir/Error.cpp.o.d -o external/llvh/lib/Support/CMakeFiles/LLVHSupport.dir/Error.cpp.o -c /wrkdirs/usr/ports/lang/hermes/work/hermes-1ed8051/external/llvh/lib/Support/Error.cpp
[10/394] /usr/local/bin/g++10 -DHERMESVM_ALLOW_COMPRESSED_POINTERS -DHERMESVM_ALLOW_CONCURRENT_GC -DHERMESVM_GC_NONCONTIG_GENERATIONAL -DHERMESVM_HEAP_SEGMENT_SIZE_KB=4096 -DHERMES_ENABLE_DEBUGGER -DHERMES_LLVM -DHERMES_RELEASE_VERSION=\"0.7.0\" -I/wrkdirs/usr/ports/lang/hermes/work/hermes-1ed8051/external -I/wrkdirs/usr/ports/lang/hermes/work/hermes-1ed8051/external/flowparser/include -I/wrkdirs/usr/ports/lang/hermes/work/hermes-1ed8051/public -I/wrkdirs/usr/ports/lang/hermes/work/hermes-1ed8051/include -Iinclude -I/wrkdirs/usr/ports/lang/hermes/work/hermes-1ed8051/external/llvh/include -I/wrkdirs/usr/ports/lang/hermes/work/hermes-1ed8051/external/llvh/gen/include -Iexternal/llvh/include -O2 -pipe  -fstack-protector-strong -Wl,-rpath=/usr/local/lib/gcc10  -Wl,-rpath=/usr/local/lib/gcc10 -Wall -Wextra -Wno-unused-parameter -Wwrite-strings -Wcast-qual -Wno-missing-field-initializers -Wno-maybe-uninitialized -Wno-class-memaccess -Wno-noexcept-type -Wdelete-non-virtual-dtor -Wno-init-li
 st-lifetime -Wno-redundant-move -fvisibility=hidden -O2 -pipe  -fstack-protector-strong -Wl,-rpath=/usr/local/lib/gcc10  -Wl,-rpath=/usr/local/lib/gcc10 -fPIC -std=c++14  -fno-exceptions -fno-rtti -MD -MT external/llvh/lib/Support/CMakeFiles/LLVHSupport.dir/ErrorHandling.cpp.o -MF external/llvh/lib/Support/CMakeFiles/LLVHSupport.dir/ErrorHandling.cpp.o.d -o external/llvh/lib/Support/CMakeFiles/LLVHSupport.dir/ErrorHandling.cpp.o -c /wrkdirs/usr/ports/lang/hermes/work/hermes-1ed8051/external/llvh/lib/Support/ErrorHandling.cpp
[11/394] /usr/local/bin/g++10 -DHERMESVM_ALLOW_COMPRESSED_POINTERS -DHERMESVM_ALLOW_CONCURRENT_GC -DHERMESVM_GC_NONCONTIG_GENERATIONAL -DHERMESVM_HEAP_SEGMENT_SIZE_KB=4096 -DHERMES_ENABLE_DEBUGGER -DHERMES_LLVM -DHERMES_RELEASE_VERSION=\"0.7.0\" -I/wrkdirs/usr/ports/lang/hermes/work/hermes-1ed8051/external -I/wrkdirs/usr/ports/lang/hermes/work/hermes-1ed8051/external/flowparser/include -I/wrkdirs/usr/ports/lang/hermes/work/hermes-1ed8051/public -I/wrkdirs/usr/ports/lang/hermes/work/hermes-1ed8051/include -Iinclude -I/wrkdirs/usr/ports/lang/hermes/work/hermes-1ed8051/external/llvh/include -I/wrkdirs/usr/ports/lang/hermes/work/hermes-1ed8051/external/llvh/gen/include -Iexternal/llvh/include -O2 -pipe  -fstack-protector-strong -Wl,-rpath=/usr/local/lib/gcc10  -Wl,-rpath=/usr/local/lib/gcc10 -Wall -Wextra -Wno-unused-parameter -Wwrite-strings -Wcast-qual -Wno-missing-field-initializers -Wno-maybe-uninitialized -Wno-class-memaccess -Wno-noexcept-type -Wdelete-non-virtual-dtor -Wno-init-li
 st-lifetime -Wno-redundant-move -fvisibility=hidden -O2 -pipe  -fstack-protector-strong -Wl,-rpath=/usr/local/lib/gcc10  -Wl,-rpath=/usr/local/lib/gcc10 -fPIC -std=c++14  -fno-exceptions -fno-rtti -MD -MT external/llvh/lib/Support/CMakeFiles/LLVHSupport.dir/FoldingSet.cpp.o -MF external/llvh/lib/Support/CMakeFiles/LLVHSupport.dir/FoldingSet.cpp.o.d -o external/llvh/lib/Support/CMakeFiles/LLVHSupport.dir/FoldingSet.cpp.o -c /wrkdirs/usr/ports/lang/hermes/work/hermes-1ed8051/external/llvh/lib/Support/FoldingSet.cpp
[12/394] /usr/local/bin/g++10 -DHERMESVM_ALLOW_COMPRESSED_POINTERS -DHERMESVM_ALLOW_CONCURRENT_GC -DHERMESVM_GC_NONCONTIG_GENERATIONAL -DHERMESVM_HEAP_SEGMENT_SIZE_KB=4096 -DHERMES_ENABLE_DEBUGGER -DHERMES_LLVM -DHERMES_RELEASE_VERSION=\"0.7.0\" -I/wrkdirs/usr/ports/lang/hermes/work/hermes-1ed8051/external -I/wrkdirs/usr/ports/lang/hermes/work/hermes-1ed8051/external/flowparser/include -I/wrkdirs/usr/ports/lang/hermes/work/hermes-1ed8051/public -I/wrkdirs/usr/ports/lang/hermes/work/hermes-1ed8051/include -Iinclude -I/wrkdirs/usr/ports/lang/hermes/work/hermes-1ed8051/external/llvh/include -I/wrkdirs/usr/ports/lang/hermes/work/hermes-1ed8051/external/llvh/gen/include -Iexternal/llvh/include -O2 -pipe  -fstack-protector-strong -Wl,-rpath=/usr/local/lib/gcc10  -Wl,-rpath=/usr/local/lib/gcc10 -Wall -Wextra -Wno-unused-parameter -Wwrite-strings -Wcast-qual -Wno-missing-field-initializers -Wno-maybe-uninitialized -Wno-class-memaccess -Wno-noexcept-type -Wdelete-non-virtual-dtor -Wno-init-li
 st-lifetime -Wno-redundant-move -fvisibility=hidden -O2 -pipe  -fstack-protector-strong -Wl,-rpath=/usr/local/lib/gcc10  -Wl,-rpath=/usr/local/lib/gcc10 -fPIC -std=c++14  -fno-exceptions -fno-rtti -MD -MT external/llvh/lib/Support/CMakeFiles/LLVHSupport.dir/GraphWriter.cpp.o -MF external/llvh/lib/Support/CMakeFiles/LLVHSupport.dir/GraphWriter.cpp.o.d -o external/llvh/lib/Support/CMakeFiles/LLVHSupport.dir/GraphWriter.cpp.o -c /wrkdirs/usr/ports/lang/hermes/work/hermes-1ed8051/external/llvh/lib/Support/GraphWriter.cpp
[13/394] /usr/local/bin/g++10 -DHERMESVM_ALLOW_COMPRESSED_POINTERS -DHERMESVM_ALLOW_CONCURRENT_GC -DHERMESVM_GC_NONCONTIG_GENERATIONAL -DHERMESVM_HEAP_SEGMENT_SIZE_KB=4096 -DHERMES_ENABLE_DEBUGGER -DHERMES_LLVM -DHERMES_RELEASE_VERSION=\"0.7.0\" -I/wrkdirs/usr/ports/lang/hermes/work/hermes-1ed8051/external -I/wrkdirs/usr/ports/lang/hermes/work/hermes-1ed8051/external/flowparser/include -I/wrkdirs/usr/ports/lang/hermes/work/hermes-1ed8051/public -I/wrkdirs/usr/ports/lang/hermes/work/hermes-1ed8051/include -Iinclude -I/wrkdirs/usr/ports/lang/hermes/work/hermes-1ed8051/external/llvh/include -I/wrkdirs/usr/ports/lang/hermes/work/hermes-1ed8051/external/llvh/gen/include -Iexternal/llvh/include -O2 -pipe  -fstack-protector-strong -Wl,-rpath=/usr/local/lib/gcc10  -Wl,-rpath=/usr/local/lib/gcc10 -Wall -Wextra -Wno-unused-parameter -Wwrite-strings -Wcast-qual -Wno-missing-field-initializers -Wno-maybe-uninitialized -Wno-class-memaccess -Wno-noexcept-type -Wdelete-non-virtual-dtor -Wno-init-li
 st-lifetime -Wno-redundant-move -fvisibility=hidden -O2 -pipe  -fstack-protector-strong -Wl,-rpath=/usr/local/lib/gcc10  -Wl,-rpath=/usr/local/lib/gcc10 -fPIC -std=c++14  -fno-exceptions -fno-rtti -MD -MT external/llvh/lib/Support/CMakeFiles/LLVHSupport.dir/Hashing.cpp.o -MF external/llvh/lib/Support/CMakeFiles/LLVHSupport.dir/Hashing.cpp.o.d -o external/llvh/lib/Support/CMakeFiles/LLVHSupport.dir/Hashing.cpp.o -c /wrkdirs/usr/ports/lang/hermes/work/hermes-1ed8051/external/llvh/lib/Support/Hashing.cpp
[14/394] /usr/local/bin/g++10 -DHERMESVM_ALLOW_COMPRESSED_POINTERS -DHERMESVM_ALLOW_CONCURRENT_GC -DHERMESVM_GC_NONCONTIG_GENERATIONAL -DHERMESVM_HEAP_SEGMENT_SIZE_KB=4096 -DHERMES_ENABLE_DEBUGGER -DHERMES_LLVM -DHERMES_RELEASE_VERSION=\"0.7.0\" -I/wrkdirs/usr/ports/lang/hermes/work/hermes-1ed8051/external -I/wrkdirs/usr/ports/lang/hermes/work/hermes-1ed8051/external/flowparser/include -I/wrkdirs/usr/ports/lang/hermes/work/hermes-1ed8051/public -I/wrkdirs/usr/ports/lang/hermes/work/hermes-1ed8051/include -Iinclude -I/wrkdirs/usr/ports/lang/hermes/work/hermes-1ed8051/external/llvh/include -I/wrkdirs/usr/ports/lang/hermes/work/hermes-1ed8051/external/llvh/gen/include -Iexternal/llvh/include -O2 -pipe  -fstack-protector-strong -Wl,-rpath=/usr/local/lib/gcc10  -Wl,-rpath=/usr/local/lib/gcc10 -Wall -Wextra -Wno-unused-parameter -Wwrite-strings -Wcast-qual -Wno-missing-field-initializers -Wno-maybe-uninitialized -Wno-class-memaccess -Wno-noexcept-type -Wdelete-non-virtual-dtor -Wno-init-li
 st-lifetime -Wno-redundant-move -fvisibility=hidden -O2 -pipe  -fstack-protector-strong -Wl,-rpath=/usr/local/lib/gcc10  -Wl,-rpath=/usr/local/lib/gcc10 -fPIC -std=c++14  -fno-exceptions -fno-rtti -MD -MT external/llvh/lib/Support/CMakeFiles/LLVHSupport.dir/FileCheck.cpp.o -MF external/llvh/lib/Support/CMakeFiles/LLVHSupport.dir/FileCheck.cpp.o.d -o external/llvh/lib/Support/CMakeFiles/LLVHSupport.dir/FileCheck.cpp.o -c /wrkdirs/usr/ports/lang/hermes/work/hermes-1ed8051/external/llvh/lib/Support/FileCheck.cpp
[15/394] /usr/local/bin/g++10 -DHERMESVM_ALLOW_COMPRESSED_POINTERS -DHERMESVM_ALLOW_CONCURRENT_GC -DHERMESVM_GC_NONCONTIG_GENERATIONAL -DHERMESVM_HEAP_SEGMENT_SIZE_KB=4096 -DHERMES_ENABLE_DEBUGGER -DHERMES_LLVM -DHERMES_RELEASE_VERSION=\"0.7.0\" -I/wrkdirs/usr/ports/lang/hermes/work/hermes-1ed8051/external -I/wrkdirs/usr/ports/lang/hermes/work/hermes-1ed8051/external/flowparser/include -I/wrkdirs/usr/ports/lang/hermes/work/hermes-1ed8051/public -I/wrkdirs/usr/ports/lang/hermes/work/hermes-1ed8051/include -Iinclude -I/wrkdirs/usr/ports/lang/hermes/work/hermes-1ed8051/external/llvh/include -I/wrkdirs/usr/ports/lang/hermes/work/hermes-1ed8051/external/llvh/gen/include -Iexternal/llvh/include -O2 -pipe  -fstack-protector-strong -Wl,-rpath=/usr/local/lib/gcc10  -Wl,-rpath=/usr/local/lib/gcc10 -Wall -Wextra -Wno-unused-parameter -Wwrite-strings -Wcast-qual -Wno-missing-field-initializers -Wno-maybe-uninitialized -Wno-class-memaccess -Wno-noexcept-type -Wdelete-non-virtual-dtor -Wno-init-li
 st-lifetime -Wno-redundant-move -fvisibility=hidden -O2 -pipe  -fstack-protector-strong -Wl,-rpath=/usr/local/lib/gcc10  -Wl,-rpath=/usr/local/lib/gcc10 -fPIC -std=c++14  -fno-exceptions -fno-rtti -MD -MT external/llvh/lib/Support/CMakeFiles/LLVHSupport.dir/InitLLVM.cpp.o -MF external/llvh/lib/Support/CMakeFiles/LLVHSupport.dir/InitLLVM.cpp.o.d -o external/llvh/lib/Support/CMakeFiles/LLVHSupport.dir/InitLLVM.cpp.o -c /wrkdirs/usr/ports/lang/hermes/work/hermes-1ed8051/external/llvh/lib/Support/InitLLVM.cpp
[16/394] /usr/local/bin/g++10 -DHERMESVM_ALLOW_COMPRESSED_POINTERS -DHERMESVM_ALLOW_CONCURRENT_GC -DHERMESVM_GC_NONCONTIG_GENERATIONAL -DHERMESVM_HEAP_SEGMENT_SIZE_KB=4096 -DHERMES_ENABLE_DEBUGGER -DHERMES_LLVM -DHERMES_RELEASE_VERSION=\"0.7.0\" -I/wrkdirs/usr/ports/lang/hermes/work/hermes-1ed8051/external -I/wrkdirs/usr/ports/lang/hermes/work/hermes-1ed8051/external/flowparser/include -I/wrkdirs/usr/ports/lang/hermes/work/hermes-1ed8051/public -I/wrkdirs/usr/ports/lang/hermes/work/hermes-1ed8051/include -Iinclude -I/wrkdirs/usr/ports/lang/hermes/work/hermes-1ed8051/external/llvh/include -I/wrkdirs/usr/ports/lang/hermes/work/hermes-1ed8051/external/llvh/gen/include -Iexternal/llvh/include -O2 -pipe  -fstack-protector-strong -Wl,-rpath=/usr/local/lib/gcc10  -Wl,-rpath=/usr/local/lib/gcc10 -Wall -Wextra -Wno-unused-parameter -Wwrite-strings -Wcast-qual -Wno-missing-field-initializers -Wno-maybe-uninitialized -Wno-class-memaccess -Wno-noexcept-type -Wdelete-non-virtual-dtor -Wno-init-li
 st-lifetime -Wno-redundant-move -fvisibility=hidden -O2 -pipe  -fstack-protector-strong -Wl,-rpath=/usr/local/lib/gcc10  -Wl,-rpath=/usr/local/lib/gcc10 -fPIC -std=c++14  -fno-exceptions -fno-rtti -MD -MT external/llvh/lib/Support/CMakeFiles/LLVHSupport.dir/Host.cpp.o -MF external/llvh/lib/Support/CMakeFiles/LLVHSupport.dir/Host.cpp.o.d -o external/llvh/lib/Support/CMakeFiles/LLVHSupport.dir/Host.cpp.o -c /wrkdirs/usr/ports/lang/hermes/work/hermes-1ed8051/external/llvh/lib/Support/Host.cpp
[17/394] /usr/local/bin/g++10 -DHERMESVM_ALLOW_COMPRESSED_POINTERS -DHERMESVM_ALLOW_CONCURRENT_GC -DHERMESVM_GC_NONCONTIG_GENERATIONAL -DHERMESVM_HEAP_SEGMENT_SIZE_KB=4096 -DHERMES_ENABLE_DEBUGGER -DHERMES_LLVM -DHERMES_RELEASE_VERSION=\"0.7.0\" -I/wrkdirs/usr/ports/lang/hermes/work/hermes-1ed8051/external -I/wrkdirs/usr/ports/lang/hermes/work/hermes-1ed8051/external/flowparser/include -I/wrkdirs/usr/ports/lang/hermes/work/hermes-1ed8051/public -I/wrkdirs/usr/ports/lang/hermes/work/hermes-1ed8051/include -Iinclude -I/wrkdirs/usr/ports/lang/hermes/work/hermes-1ed8051/external/llvh/include -I/wrkdirs/usr/ports/lang/hermes/work/hermes-1ed8051/external/llvh/gen/include -Iexternal/llvh/include -O2 -pipe  -fstack-protector-strong -Wl,-rpath=/usr/local/lib/gcc10  -Wl,-rpath=/usr/local/lib/gcc10 -Wall -Wextra -Wno-unused-parameter -Wwrite-strings -Wcast-qual -Wno-missing-field-initializers -Wno-maybe-uninitialized -Wno-class-memaccess -Wno-noexcept-type -Wdelete-non-virtual-dtor -Wno-init-li
 st-lifetime -Wno-redundant-move -fvisibility=hidden -O2 -pipe  -fstack-protector-strong -Wl,-rpath=/usr/local/lib/gcc10  -Wl,-rpath=/usr/local/lib/gcc10 -fPIC -std=c++14  -fno-exceptions -fno-rtti -MD -MT external/llvh/lib/Support/CMakeFiles/LLVHSupport.dir/LineIterator.cpp.o -MF external/llvh/lib/Support/CMakeFiles/LLVHSupport.dir/LineIterator.cpp.o.d -o external/llvh/lib/Support/CMakeFiles/LLVHSupport.dir/LineIterator.cpp.o -c /wrkdirs/usr/ports/lang/hermes/work/hermes-1ed8051/external/llvh/lib/Support/LineIterator.cpp
[18/394] /usr/local/bin/g++10 -DHERMESVM_ALLOW_COMPRESSED_POINTERS -DHERMESVM_ALLOW_CONCURRENT_GC -DHERMESVM_GC_NONCONTIG_GENERATIONAL -DHERMESVM_HEAP_SEGMENT_SIZE_KB=4096 -DHERMES_ENABLE_DEBUGGER -DHERMES_LLVM -DHERMES_RELEASE_VERSION=\"0.7.0\" -I/wrkdirs/usr/ports/lang/hermes/work/hermes-1ed8051/external -I/wrkdirs/usr/ports/lang/hermes/work/hermes-1ed8051/external/flowparser/include -I/wrkdirs/usr/ports/lang/hermes/work/hermes-1ed8051/public -I/wrkdirs/usr/ports/lang/hermes/work/hermes-1ed8051/include -Iinclude -I/wrkdirs/usr/ports/lang/hermes/work/hermes-1ed8051/external/llvh/include -I/wrkdirs/usr/ports/lang/hermes/work/hermes-1ed8051/external/llvh/gen/include -Iexternal/llvh/include -O2 -pipe  -fstack-protector-strong -Wl,-rpath=/usr/local/lib/gcc10  -Wl,-rpath=/usr/local/lib/gcc10 -Wall -Wextra -Wno-unused-parameter -Wwrite-strings -Wcast-qual -Wno-missing-field-initializers -Wno-maybe-uninitialized -Wno-class-memaccess -Wno-noexcept-type -Wdelete-non-virtual-dtor -Wno-init-li
 st-lifetime -Wno-redundant-move -fvisibility=hidden -O2 -pipe  -fstack-protector-strong -Wl,-rpath=/usr/local/lib/gcc10  -Wl,-rpath=/usr/local/lib/gcc10 -fPIC -std=c++14  -fno-exceptions -fno-rtti -MD -MT external/llvh/lib/Support/CMakeFiles/LLVHSupport.dir/Locale.cpp.o -MF external/llvh/lib/Support/CMakeFiles/LLVHSupport.dir/Locale.cpp.o.d -o external/llvh/lib/Support/CMakeFiles/LLVHSupport.dir/Locale.cpp.o -c /wrkdirs/usr/ports/lang/hermes/work/hermes-1ed8051/external/llvh/lib/Support/Locale.cpp
[19/394] /usr/local/bin/g++10 -DHERMESVM_ALLOW_COMPRESSED_POINTERS -DHERMESVM_ALLOW_CONCURRENT_GC -DHERMESVM_GC_NONCONTIG_GENERATIONAL -DHERMESVM_HEAP_SEGMENT_SIZE_KB=4096 -DHERMES_ENABLE_DEBUGGER -DHERMES_LLVM -DHERMES_RELEASE_VERSION=\"0.7.0\" -I/wrkdirs/usr/ports/lang/hermes/work/hermes-1ed8051/external -I/wrkdirs/usr/ports/lang/hermes/work/hermes-1ed8051/external/flowparser/include -I/wrkdirs/usr/ports/lang/hermes/work/hermes-1ed8051/public -I/wrkdirs/usr/ports/lang/hermes/work/hermes-1ed8051/include -Iinclude -I/wrkdirs/usr/ports/lang/hermes/work/hermes-1ed8051/external/llvh/include -I/wrkdirs/usr/ports/lang/hermes/work/hermes-1ed8051/external/llvh/gen/include -Iexternal/llvh/include -O2 -pipe  -fstack-protector-strong -Wl,-rpath=/usr/local/lib/gcc10  -Wl,-rpath=/usr/local/lib/gcc10 -Wall -Wextra -Wno-unused-parameter -Wwrite-strings -Wcast-qual -Wno-missing-field-initializers -Wno-maybe-uninitialized -Wno-class-memaccess -Wno-noexcept-type -Wdelete-non-virtual-dtor -Wno-init-li
 st-lifetime -Wno-redundant-move -fvisibility=hidden -O2 -pipe  -fstack-protector-strong -Wl,-rpath=/usr/local/lib/gcc10  -Wl,-rpath=/usr/local/lib/gcc10 -fPIC -std=c++14  -fno-exceptions -fno-rtti -MD -MT external/llvh/lib/Support/CMakeFiles/LLVHSupport.dir/ManagedStatic.cpp.o -MF external/llvh/lib/Support/CMakeFiles/LLVHSupport.dir/ManagedStatic.cpp.o.d -o external/llvh/lib/Support/CMakeFiles/LLVHSupport.dir/ManagedStatic.cpp.o -c /wrkdirs/usr/ports/lang/hermes/work/hermes-1ed8051/external/llvh/lib/Support/ManagedStatic.cpp
[20/394] /usr/local/bin/g++10 -DHERMESVM_ALLOW_COMPRESSED_POINTERS -DHERMESVM_ALLOW_CONCURRENT_GC -DHERMESVM_GC_NONCONTIG_GENERATIONAL -DHERMESVM_HEAP_SEGMENT_SIZE_KB=4096 -DHERMES_ENABLE_DEBUGGER -DHERMES_LLVM -DHERMES_RELEASE_VERSION=\"0.7.0\" -I/wrkdirs/usr/ports/lang/hermes/work/hermes-1ed8051/external -I/wrkdirs/usr/ports/lang/hermes/work/hermes-1ed8051/external/flowparser/include -I/wrkdirs/usr/ports/lang/hermes/work/hermes-1ed8051/public -I/wrkdirs/usr/ports/lang/hermes/work/hermes-1ed8051/include -Iinclude -I/wrkdirs/usr/ports/lang/hermes/work/hermes-1ed8051/external/llvh/include -I/wrkdirs/usr/ports/lang/hermes/work/hermes-1ed8051/external/llvh/gen/include -Iexternal/llvh/include -O2 -pipe  -fstack-protector-strong -Wl,-rpath=/usr/local/lib/gcc10  -Wl,-rpath=/usr/local/lib/gcc10 -Wall -Wextra -Wno-unused-parameter -Wwrite-strings -Wcast-qual -Wno-missing-field-initializers -Wno-maybe-uninitialized -Wno-class-memaccess -Wno-noexcept-type -Wdelete-non-virtual-dtor -Wno-init-li
 st-lifetime -Wno-redundant-move -fvisibility=hidden -O2 -pipe  -fstack-protector-strong -Wl,-rpath=/usr/local/lib/gcc10  -Wl,-rpath=/usr/local/lib/gcc10 -fPIC -std=c++14  -fno-exceptions -fno-rtti -MD -MT external/llvh/lib/Support/CMakeFiles/LLVHSupport.dir/MD5.cpp.o -MF external/llvh/lib/Support/CMakeFiles/LLVHSupport.dir/MD5.cpp.o.d -o external/llvh/lib/Support/CMakeFiles/LLVHSupport.dir/MD5.cpp.o -c /wrkdirs/usr/ports/lang/hermes/work/hermes-1ed8051/external/llvh/lib/Support/MD5.cpp
[21/394] /usr/local/bin/g++10 -DHERMESVM_ALLOW_COMPRESSED_POINTERS -DHERMESVM_ALLOW_CONCURRENT_GC -DHERMESVM_GC_NONCONTIG_GENERATIONAL -DHERMESVM_HEAP_SEGMENT_SIZE_KB=4096 -DHERMES_ENABLE_DEBUGGER -DHERMES_LLVM -DHERMES_RELEASE_VERSION=\"0.7.0\" -I/wrkdirs/usr/ports/lang/hermes/work/hermes-1ed8051/external -I/wrkdirs/usr/ports/lang/hermes/work/hermes-1ed8051/external/flowparser/include -I/wrkdirs/usr/ports/lang/hermes/work/hermes-1ed8051/public -I/wrkdirs/usr/ports/lang/hermes/work/hermes-1ed8051/include -Iinclude -I/wrkdirs/usr/ports/lang/hermes/work/hermes-1ed8051/external/llvh/include -I/wrkdirs/usr/ports/lang/hermes/work/hermes-1ed8051/external/llvh/gen/include -Iexternal/llvh/include -O2 -pipe  -fstack-protector-strong -Wl,-rpath=/usr/local/lib/gcc10  -Wl,-rpath=/usr/local/lib/gcc10 -Wall -Wextra -Wno-unused-parameter -Wwrite-strings -Wcast-qual -Wno-missing-field-initializers -Wno-maybe-uninitialized -Wno-class-memaccess -Wno-noexcept-type -Wdelete-non-virtual-dtor -Wno-init-li
 st-lifetime -Wno-redundant-move -fvisibility=hidden -O2 -pipe  -fstack-protector-strong -Wl,-rpath=/usr/local/lib/gcc10  -Wl,-rpath=/usr/local/lib/gcc10 -fPIC -std=c++14  -fno-exceptions -fno-rtti -MD -MT external/llvh/lib/Support/CMakeFiles/LLVHSupport.dir/Memory.cpp.o -MF external/llvh/lib/Support/CMakeFiles/LLVHSupport.dir/Memory.cpp.o.d -o external/llvh/lib/Support/CMakeFiles/LLVHSupport.dir/Memory.cpp.o -c /wrkdirs/usr/ports/lang/hermes/work/hermes-1ed8051/external/llvh/lib/Support/Memory.cpp
[22/394] /usr/local/bin/g++10 -DHERMESVM_ALLOW_COMPRESSED_POINTERS -DHERMESVM_ALLOW_CONCURRENT_GC -DHERMESVM_GC_NONCONTIG_GENERATIONAL -DHERMESVM_HEAP_SEGMENT_SIZE_KB=4096 -DHERMES_ENABLE_DEBUGGER -DHERMES_LLVM -DHERMES_RELEASE_VERSION=\"0.7.0\" -I/wrkdirs/usr/ports/lang/hermes/work/hermes-1ed8051/external -I/wrkdirs/usr/ports/lang/hermes/work/hermes-1ed8051/external/flowparser/include -I/wrkdirs/usr/ports/lang/hermes/work/hermes-1ed8051/public -I/wrkdirs/usr/ports/lang/hermes/work/hermes-1ed8051/include -Iinclude -I/wrkdirs/usr/ports/lang/hermes/work/hermes-1ed8051/external/llvh/include -I/wrkdirs/usr/ports/lang/hermes/work/hermes-1ed8051/external/llvh/gen/include -Iexternal/llvh/include -O2 -pipe  -fstack-protector-strong -Wl,-rpath=/usr/local/lib/gcc10  -Wl,-rpath=/usr/local/lib/gcc10 -Wall -Wextra -Wno-unused-parameter -Wwrite-strings -Wcast-qual -Wno-missing-field-initializers -Wno-maybe-uninitialized -Wno-class-memaccess -Wno-noexcept-type -Wdelete-non-virtual-dtor -Wno-init-li
 st-lifetime -Wno-redundant-move -fvisibility=hidden -O2 -pipe  -fstack-protector-strong -Wl,-rpath=/usr/local/lib/gcc10  -Wl,-rpath=/usr/local/lib/gcc10 -fPIC -std=c++14  -fno-exceptions -fno-rtti -MD -MT external/llvh/lib/Support/CMakeFiles/LLVHSupport.dir/MemoryBuffer.cpp.o -MF external/llvh/lib/Support/CMakeFiles/LLVHSupport.dir/MemoryBuffer.cpp.o.d -o external/llvh/lib/Support/CMakeFiles/LLVHSupport.dir/MemoryBuffer.cpp.o -c /wrkdirs/usr/ports/lang/hermes/work/hermes-1ed8051/external/llvh/lib/Support/MemoryBuffer.cpp
[23/394] /usr/local/bin/g++10 -DHERMESVM_ALLOW_COMPRESSED_POINTERS -DHERMESVM_ALLOW_CONCURRENT_GC -DHERMESVM_GC_NONCONTIG_GENERATIONAL -DHERMESVM_HEAP_SEGMENT_SIZE_KB=4096 -DHERMES_ENABLE_DEBUGGER -DHERMES_LLVM -DHERMES_RELEASE_VERSION=\"0.7.0\" -I/wrkdirs/usr/ports/lang/hermes/work/hermes-1ed8051/external -I/wrkdirs/usr/ports/lang/hermes/work/hermes-1ed8051/external/flowparser/include -I/wrkdirs/usr/ports/lang/hermes/work/hermes-1ed8051/public -I/wrkdirs/usr/ports/lang/hermes/work/hermes-1ed8051/include -Iinclude -I/wrkdirs/usr/ports/lang/hermes/work/hermes-1ed8051/external/llvh/include -I/wrkdirs/usr/ports/lang/hermes/work/hermes-1ed8051/external/llvh/gen/include -Iexternal/llvh/include -O2 -pipe  -fstack-protector-strong -Wl,-rpath=/usr/local/lib/gcc10  -Wl,-rpath=/usr/local/lib/gcc10 -Wall -Wextra -Wno-unused-parameter -Wwrite-strings -Wcast-qual -Wno-missing-field-initializers -Wno-maybe-uninitialized -Wno-class-memaccess -Wno-noexcept-type -Wdelete-non-virtual-dtor -Wno-init-li
 st-lifetime -Wno-redundant-move -fvisibility=hidden -O2 -pipe  -fstack-protector-strong -Wl,-rpath=/usr/local/lib/gcc10  -Wl,-rpath=/usr/local/lib/gcc10 -fPIC -std=c++14  -fno-exceptions -fno-rtti -MD -MT external/llvh/lib/Support/CMakeFiles/LLVHSupport.dir/Mutex.cpp.o -MF external/llvh/lib/Support/CMakeFiles/LLVHSupport.dir/Mutex.cpp.o.d -o external/llvh/lib/Support/CMakeFiles/LLVHSupport.dir/Mutex.cpp.o -c /wrkdirs/usr/ports/lang/hermes/work/hermes-1ed8051/external/llvh/lib/Support/Mutex.cpp
[24/394] /usr/local/bin/g++10 -DHERMESVM_ALLOW_COMPRESSED_POINTERS -DHERMESVM_ALLOW_CONCURRENT_GC -DHERMESVM_GC_NONCONTIG_GENERATIONAL -DHERMESVM_HEAP_SEGMENT_SIZE_KB=4096 -DHERMES_ENABLE_DEBUGGER -DHERMES_LLVM -DHERMES_RELEASE_VERSION=\"0.7.0\" -I/wrkdirs/usr/ports/lang/hermes/work/hermes-1ed8051/external -I/wrkdirs/usr/ports/lang/hermes/work/hermes-1ed8051/external/flowparser/include -I/wrkdirs/usr/ports/lang/hermes/work/hermes-1ed8051/public -I/wrkdirs/usr/ports/lang/hermes/work/hermes-1ed8051/include -Iinclude -I/wrkdirs/usr/ports/lang/hermes/work/hermes-1ed8051/external/llvh/include -I/wrkdirs/usr/ports/lang/hermes/work/hermes-1ed8051/external/llvh/gen/include -Iexternal/llvh/include -O2 -pipe  -fstack-protector-strong -Wl,-rpath=/usr/local/lib/gcc10  -Wl,-rpath=/usr/local/lib/gcc10 -Wall -Wextra -Wno-unused-parameter -Wwrite-strings -Wcast-qual -Wno-missing-field-initializers -Wno-maybe-uninitialized -Wno-class-memaccess -Wno-noexcept-type -Wdelete-non-virtual-dtor -Wno-init-li
 st-lifetime -Wno-redundant-move -fvisibility=hidden -O2 -pipe  -fstack-protector-strong -Wl,-rpath=/usr/local/lib/gcc10  -Wl,-rpath=/usr/local/lib/gcc10 -fPIC -std=c++14  -fno-exceptions -fno-rtti -MD -MT external/llvh/lib/Support/CMakeFiles/LLVHSupport.dir/NativeFormatting.cpp.o -MF external/llvh/lib/Support/CMakeFiles/LLVHSupport.dir/NativeFormatting.cpp.o.d -o external/llvh/lib/Support/CMakeFiles/LLVHSupport.dir/NativeFormatting.cpp.o -c /wrkdirs/usr/ports/lang/hermes/work/hermes-1ed8051/external/llvh/lib/Support/NativeFormatting.cpp
[25/394] /usr/local/bin/g++10 -DHERMESVM_ALLOW_COMPRESSED_POINTERS -DHERMESVM_ALLOW_CONCURRENT_GC -DHERMESVM_GC_NONCONTIG_GENERATIONAL -DHERMESVM_HEAP_SEGMENT_SIZE_KB=4096 -DHERMES_ENABLE_DEBUGGER -DHERMES_LLVM -DHERMES_RELEASE_VERSION=\"0.7.0\" -I/wrkdirs/usr/ports/lang/hermes/work/hermes-1ed8051/external -I/wrkdirs/usr/ports/lang/hermes/work/hermes-1ed8051/external/flowparser/include -I/wrkdirs/usr/ports/lang/hermes/work/hermes-1ed8051/public -I/wrkdirs/usr/ports/lang/hermes/work/hermes-1ed8051/include -Iinclude -I/wrkdirs/usr/ports/lang/hermes/work/hermes-1ed8051/external/llvh/include -I/wrkdirs/usr/ports/lang/hermes/work/hermes-1ed8051/external/llvh/gen/include -Iexternal/llvh/include -O2 -pipe  -fstack-protector-strong -Wl,-rpath=/usr/local/lib/gcc10  -Wl,-rpath=/usr/local/lib/gcc10 -Wall -Wextra -Wno-unused-parameter -Wwrite-strings -Wcast-qual -Wno-missing-field-initializers -Wno-maybe-uninitialized -Wno-class-memaccess -Wno-noexcept-type -Wdelete-non-virtual-dtor -Wno-init-li
 st-lifetime -Wno-redundant-move -fvisibility=hidden -O2 -pipe  -fstack-protector-strong -Wl,-rpath=/usr/local/lib/gcc10  -Wl,-rpath=/usr/local/lib/gcc10 -fPIC -std=c++14  -fno-exceptions -fno-rtti -MD -MT external/llvh/lib/Support/CMakeFiles/LLVHSupport.dir/PrettyStackTrace.cpp.o -MF external/llvh/lib/Support/CMakeFiles/LLVHSupport.dir/PrettyStackTrace.cpp.o.d -o external/llvh/lib/Support/CMakeFiles/LLVHSupport.dir/PrettyStackTrace.cpp.o -c /wrkdirs/usr/ports/lang/hermes/work/hermes-1ed8051/external/llvh/lib/Support/PrettyStackTrace.cpp
[26/394] /usr/local/bin/g++10 -DHERMESVM_ALLOW_COMPRESSED_POINTERS -DHERMESVM_ALLOW_CONCURRENT_GC -DHERMESVM_GC_NONCONTIG_GENERATIONAL -DHERMESVM_HEAP_SEGMENT_SIZE_KB=4096 -DHERMES_ENABLE_DEBUGGER -DHERMES_LLVM -DHERMES_RELEASE_VERSION=\"0.7.0\" -I/wrkdirs/usr/ports/lang/hermes/work/hermes-1ed8051/external -I/wrkdirs/usr/ports/lang/hermes/work/hermes-1ed8051/external/flowparser/include -I/wrkdirs/usr/ports/lang/hermes/work/hermes-1ed8051/public -I/wrkdirs/usr/ports/lang/hermes/work/hermes-1ed8051/include -Iinclude -I/wrkdirs/usr/ports/lang/hermes/work/hermes-1ed8051/external/llvh/include -I/wrkdirs/usr/ports/lang/hermes/work/hermes-1ed8051/external/llvh/gen/include -Iexternal/llvh/include -O2 -pipe  -fstack-protector-strong -Wl,-rpath=/usr/local/lib/gcc10  -Wl,-rpath=/usr/local/lib/gcc10 -Wall -Wextra -Wno-unused-parameter -Wwrite-strings -Wcast-qual -Wno-missing-field-initializers -Wno-maybe-uninitialized -Wno-class-memaccess -Wno-noexcept-type -Wdelete-non-virtual-dtor -Wno-init-li
 st-lifetime -Wno-redundant-move -fvisibility=hidden -O2 -pipe  -fstack-protector-strong -Wl,-rpath=/usr/local/lib/gcc10  -Wl,-rpath=/usr/local/lib/gcc10 -fPIC -std=c++14  -fno-exceptions -fno-rtti -MD -MT external/llvh/lib/Support/CMakeFiles/LLVHSupport.dir/Path.cpp.o -MF external/llvh/lib/Support/CMakeFiles/LLVHSupport.dir/Path.cpp.o.d -o external/llvh/lib/Support/CMakeFiles/LLVHSupport.dir/Path.cpp.o -c /wrkdirs/usr/ports/lang/hermes/work/hermes-1ed8051/external/llvh/lib/Support/Path.cpp
In file included from /wrkdirs/usr/ports/lang/hermes/work/hermes-1ed8051/external/llvh/lib/Support/Path.cpp:1111:
/wrkdirs/usr/ports/lang/hermes/work/hermes-1ed8051/external/llvh/lib/Support/Unix/Path.inc: In function 'std::string llvh::sys::fs::getMainExecutable(const char*, void*)':
/wrkdirs/usr/ports/lang/hermes/work/hermes-1ed8051/external/llvh/lib/Support/Unix/Path.inc:108:38: warning: 'snprintf' output may be truncated before the last format character [-Wformat-truncation=]
  108 |   snprintf(fullpath, PATH_MAX, "%s/%s", dir, bin);
      |                                      ^
/wrkdirs/usr/ports/lang/hermes/work/hermes-1ed8051/external/llvh/lib/Support/Unix/Path.inc:108:11: note: 'snprintf' output 2 or more bytes (assuming 1025) into a destination of size 1024
  108 |   snprintf(fullpath, PATH_MAX, "%s/%s", dir, bin);
      |   ~~~~~~~~^~~~~~~~~~~~~~~~~~~~~~~~~~~~~~~~~~~~~~~
[27/394] /usr/local/bin/g++10 -DHERMESVM_ALLOW_COMPRESSED_POINTERS -DHERMESVM_ALLOW_CONCURRENT_GC -DHERMESVM_GC_NONCONTIG_GENERATIONAL -DHERMESVM_HEAP_SEGMENT_SIZE_KB=4096 -DHERMES_ENABLE_DEBUGGER -DHERMES_LLVM -DHERMES_RELEASE_VERSION=\"0.7.0\" -I/wrkdirs/usr/ports/lang/hermes/work/hermes-1ed8051/external -I/wrkdirs/usr/ports/lang/hermes/work/hermes-1ed8051/external/flowparser/include -I/wrkdirs/usr/ports/lang/hermes/work/hermes-1ed8051/public -I/wrkdirs/usr/ports/lang/hermes/work/hermes-1ed8051/include -Iinclude -I/wrkdirs/usr/ports/lang/hermes/work/hermes-1ed8051/external/llvh/include -I/wrkdirs/usr/ports/lang/hermes/work/hermes-1ed8051/external/llvh/gen/include -Iexternal/llvh/include -O2 -pipe  -fstack-protector-strong -Wl,-rpath=/usr/local/lib/gcc10  -Wl,-rpath=/usr/local/lib/gcc10 -Wall -Wextra -Wno-unused-parameter -Wwrite-strings -Wcast-qual -Wno-missing-field-initializers -Wno-maybe-uninitialized -Wno-class-memaccess -Wno-noexcept-type -Wdelete-non-virtual-dtor -Wno-init-li
 st-lifetime -Wno-redundant-move -fvisibility=hidden -O2 -pipe  -fstack-protector-strong -Wl,-rpath=/usr/local/lib/gcc10  -Wl,-rpath=/usr/local/lib/gcc10 -fPIC -std=c++14  -fno-exceptions -fno-rtti -MD -MT external/llvh/lib/Support/CMakeFiles/LLVHSupport.dir/Process.cpp.o -MF external/llvh/lib/Support/CMakeFiles/LLVHSupport.dir/Process.cpp.o.d -o external/llvh/lib/Support/CMakeFiles/LLVHSupport.dir/Process.cpp.o -c /wrkdirs/usr/ports/lang/hermes/work/hermes-1ed8051/external/llvh/lib/Support/Process.cpp
[28/394] /usr/local/bin/g++10 -DHERMESVM_ALLOW_COMPRESSED_POINTERS -DHERMESVM_ALLOW_CONCURRENT_GC -DHERMESVM_GC_NONCONTIG_GENERATIONAL -DHERMESVM_HEAP_SEGMENT_SIZE_KB=4096 -DHERMES_ENABLE_DEBUGGER -DHERMES_LLVM -DHERMES_RELEASE_VERSION=\"0.7.0\" -I/wrkdirs/usr/ports/lang/hermes/work/hermes-1ed8051/external -I/wrkdirs/usr/ports/lang/hermes/work/hermes-1ed8051/external/flowparser/include -I/wrkdirs/usr/ports/lang/hermes/work/hermes-1ed8051/public -I/wrkdirs/usr/ports/lang/hermes/work/hermes-1ed8051/include -Iinclude -I/wrkdirs/usr/ports/lang/hermes/work/hermes-1ed8051/external/llvh/include -I/wrkdirs/usr/ports/lang/hermes/work/hermes-1ed8051/external/llvh/gen/include -Iexternal/llvh/include -O2 -pipe  -fstack-protector-strong -Wl,-rpath=/usr/local/lib/gcc10  -Wl,-rpath=/usr/local/lib/gcc10 -Wall -Wextra -Wno-unused-parameter -Wwrite-strings -Wcast-qual -Wno-missing-field-initializers -Wno-maybe-uninitialized -Wno-class-memaccess -Wno-noexcept-type -Wdelete-non-virtual-dtor -Wno-init-li
 st-lifetime -Wno-redundant-move -fvisibility=hidden -O2 -pipe  -fstack-protector-strong -Wl,-rpath=/usr/local/lib/gcc10  -Wl,-rpath=/usr/local/lib/gcc10 -fPIC -std=c++14  -fno-exceptions -fno-rtti -MD -MT external/llvh/lib/Support/CMakeFiles/LLVHSupport.dir/Program.cpp.o -MF external/llvh/lib/Support/CMakeFiles/LLVHSupport.dir/Program.cpp.o.d -o external/llvh/lib/Support/CMakeFiles/LLVHSupport.dir/Program.cpp.o -c /wrkdirs/usr/ports/lang/hermes/work/hermes-1ed8051/external/llvh/lib/Support/Program.cpp
[29/394] /usr/local/bin/g++10 -DHERMESVM_ALLOW_COMPRESSED_POINTERS -DHERMESVM_ALLOW_CONCURRENT_GC -DHERMESVM_GC_NONCONTIG_GENERATIONAL -DHERMESVM_HEAP_SEGMENT_SIZE_KB=4096 -DHERMES_ENABLE_DEBUGGER -DHERMES_LLVM -DHERMES_RELEASE_VERSION=\"0.7.0\" -I/wrkdirs/usr/ports/lang/hermes/work/hermes-1ed8051/external -I/wrkdirs/usr/ports/lang/hermes/work/hermes-1ed8051/external/flowparser/include -I/wrkdirs/usr/ports/lang/hermes/work/hermes-1ed8051/public -I/wrkdirs/usr/ports/lang/hermes/work/hermes-1ed8051/include -Iinclude -I/wrkdirs/usr/ports/lang/hermes/work/hermes-1ed8051/external/llvh/include -I/wrkdirs/usr/ports/lang/hermes/work/hermes-1ed8051/external/llvh/gen/include -Iexternal/llvh/include -O2 -pipe  -fstack-protector-strong -Wl,-rpath=/usr/local/lib/gcc10  -Wl,-rpath=/usr/local/lib/gcc10 -Wall -Wextra -Wno-unused-parameter -Wwrite-strings -Wcast-qual -Wno-missing-field-initializers -Wno-maybe-uninitialized -Wno-class-memaccess -Wno-noexcept-type -Wdelete-non-virtual-dtor -Wno-init-li
 st-lifetime -Wno-redundant-move -fvisibility=hidden -O2 -pipe  -fstack-protector-strong -Wl,-rpath=/usr/local/lib/gcc10  -Wl,-rpath=/usr/local/lib/gcc10 -fPIC -std=c++14  -fno-exceptions -fno-rtti -MD -MT external/llvh/lib/Support/CMakeFiles/LLVHSupport.dir/raw_os_ostream.cpp.o -MF external/llvh/lib/Support/CMakeFiles/LLVHSupport.dir/raw_os_ostream.cpp.o.d -o external/llvh/lib/Support/CMakeFiles/LLVHSupport.dir/raw_os_ostream.cpp.o -c /wrkdirs/usr/ports/lang/hermes/work/hermes-1ed8051/external/llvh/lib/Support/raw_os_ostream.cpp
[30/394] /usr/local/bin/g++10 -DHERMESVM_ALLOW_COMPRESSED_POINTERS -DHERMESVM_ALLOW_CONCURRENT_GC -DHERMESVM_GC_NONCONTIG_GENERATIONAL -DHERMESVM_HEAP_SEGMENT_SIZE_KB=4096 -DHERMES_ENABLE_DEBUGGER -DHERMES_LLVM -DHERMES_RELEASE_VERSION=\"0.7.0\" -I/wrkdirs/usr/ports/lang/hermes/work/hermes-1ed8051/external -I/wrkdirs/usr/ports/lang/hermes/work/hermes-1ed8051/external/flowparser/include -I/wrkdirs/usr/ports/lang/hermes/work/hermes-1ed8051/public -I/wrkdirs/usr/ports/lang/hermes/work/hermes-1ed8051/include -Iinclude -I/wrkdirs/usr/ports/lang/hermes/work/hermes-1ed8051/external/llvh/include -I/wrkdirs/usr/ports/lang/hermes/work/hermes-1ed8051/external/llvh/gen/include -Iexternal/llvh/include -O2 -pipe  -fstack-protector-strong -Wl,-rpath=/usr/local/lib/gcc10  -Wl,-rpath=/usr/local/lib/gcc10 -Wall -Wextra -Wno-unused-parameter -Wwrite-strings -Wcast-qual -Wno-missing-field-initializers -Wno-maybe-uninitialized -Wno-class-memaccess -Wno-noexcept-type -Wdelete-non-virtual-dtor -Wno-init-li
 st-lifetime -Wno-redundant-move -fvisibility=hidden -O2 -pipe  -fstack-protector-strong -Wl,-rpath=/usr/local/lib/gcc10  -Wl,-rpath=/usr/local/lib/gcc10 -fPIC -std=c++14  -fno-exceptions -fno-rtti -MD -MT external/llvh/lib/Support/CMakeFiles/LLVHSupport.dir/raw_ostream.cpp.o -MF external/llvh/lib/Support/CMakeFiles/LLVHSupport.dir/raw_ostream.cpp.o.d -o external/llvh/lib/Support/CMakeFiles/LLVHSupport.dir/raw_ostream.cpp.o -c /wrkdirs/usr/ports/lang/hermes/work/hermes-1ed8051/external/llvh/lib/Support/raw_ostream.cpp
[31/394] /usr/local/bin/gcc10 -DHERMESVM_ALLOW_COMPRESSED_POINTERS -DHERMESVM_ALLOW_CONCURRENT_GC -DHERMESVM_GC_NONCONTIG_GENERATIONAL -DHERMESVM_HEAP_SEGMENT_SIZE_KB=4096 -DHERMES_ENABLE_DEBUGGER -DHERMES_LLVM -DHERMES_RELEASE_VERSION=\"0.7.0\" -I/wrkdirs/usr/ports/lang/hermes/work/hermes-1ed8051/external -I/wrkdirs/usr/ports/lang/hermes/work/hermes-1ed8051/external/flowparser/include -I/wrkdirs/usr/ports/lang/hermes/work/hermes-1ed8051/public -I/wrkdirs/usr/ports/lang/hermes/work/hermes-1ed8051/include -Iinclude -I/wrkdirs/usr/ports/lang/hermes/work/hermes-1ed8051/external/llvh/include -I/wrkdirs/usr/ports/lang/hermes/work/hermes-1ed8051/external/llvh/gen/include -Iexternal/llvh/include -O2 -pipe  -fstack-protector-strong -Wl,-rpath=/usr/local/lib/gcc10 -fno-strict-aliasing -Wall -Wextra -Wno-unused-parameter -Wwrite-strings -Wno-missing-field-initializers -O2 -pipe  -fstack-protector-strong -Wl,-rpath=/usr/local/lib/gcc10 -fno-strict-aliasing -fPIC -MD -MT external/llvh/lib/Suppor
 t/CMakeFiles/LLVHSupport.dir/regerror.c.o -MF external/llvh/lib/Support/CMakeFiles/LLVHSupport.dir/regerror.c.o.d -o external/llvh/lib/Support/CMakeFiles/LLVHSupport.dir/regerror.c.o -c /wrkdirs/usr/ports/lang/hermes/work/hermes-1ed8051/external/llvh/lib/Support/regerror.c
[32/394] /usr/local/bin/gcc10 -DHERMESVM_ALLOW_COMPRESSED_POINTERS -DHERMESVM_ALLOW_CONCURRENT_GC -DHERMESVM_GC_NONCONTIG_GENERATIONAL -DHERMESVM_HEAP_SEGMENT_SIZE_KB=4096 -DHERMES_ENABLE_DEBUGGER -DHERMES_LLVM -DHERMES_RELEASE_VERSION=\"0.7.0\" -I/wrkdirs/usr/ports/lang/hermes/work/hermes-1ed8051/external -I/wrkdirs/usr/ports/lang/hermes/work/hermes-1ed8051/external/flowparser/include -I/wrkdirs/usr/ports/lang/hermes/work/hermes-1ed8051/public -I/wrkdirs/usr/ports/lang/hermes/work/hermes-1ed8051/include -Iinclude -I/wrkdirs/usr/ports/lang/hermes/work/hermes-1ed8051/external/llvh/include -I/wrkdirs/usr/ports/lang/hermes/work/hermes-1ed8051/external/llvh/gen/include -Iexternal/llvh/include -O2 -pipe  -fstack-protector-strong -Wl,-rpath=/usr/local/lib/gcc10 -fno-strict-aliasing -Wall -Wextra -Wno-unused-parameter -Wwrite-strings -Wno-missing-field-initializers -O2 -pipe  -fstack-protector-strong -Wl,-rpath=/usr/local/lib/gcc10 -fno-strict-aliasing -fPIC -MD -MT external/llvh/lib/Suppor
 t/CMakeFiles/LLVHSupport.dir/regfree.c.o -MF external/llvh/lib/Support/CMakeFiles/LLVHSupport.dir/regfree.c.o.d -o external/llvh/lib/Support/CMakeFiles/LLVHSupport.dir/regfree.c.o -c /wrkdirs/usr/ports/lang/hermes/work/hermes-1ed8051/external/llvh/lib/Support/regfree.c
[33/394] /usr/local/bin/gcc10 -DHERMESVM_ALLOW_COMPRESSED_POINTERS -DHERMESVM_ALLOW_CONCURRENT_GC -DHERMESVM_GC_NONCONTIG_GENERATIONAL -DHERMESVM_HEAP_SEGMENT_SIZE_KB=4096 -DHERMES_ENABLE_DEBUGGER -DHERMES_LLVM -DHERMES_RELEASE_VERSION=\"0.7.0\" -I/wrkdirs/usr/ports/lang/hermes/work/hermes-1ed8051/external -I/wrkdirs/usr/ports/lang/hermes/work/hermes-1ed8051/external/flowparser/include -I/wrkdirs/usr/ports/lang/hermes/work/hermes-1ed8051/public -I/wrkdirs/usr/ports/lang/hermes/work/hermes-1ed8051/include -Iinclude -I/wrkdirs/usr/ports/lang/hermes/work/hermes-1ed8051/external/llvh/include -I/wrkdirs/usr/ports/lang/hermes/work/hermes-1ed8051/external/llvh/gen/include -Iexternal/llvh/include -O2 -pipe  -fstack-protector-strong -Wl,-rpath=/usr/local/lib/gcc10 -fno-strict-aliasing -Wall -Wextra -Wno-unused-parameter -Wwrite-strings -Wno-missing-field-initializers -O2 -pipe  -fstack-protector-strong -Wl,-rpath=/usr/local/lib/gcc10 -fno-strict-aliasing -fPIC -MD -MT external/llvh/lib/Suppor
 t/CMakeFiles/LLVHSupport.dir/regcomp.c.o -MF external/llvh/lib/Support/CMakeFiles/LLVHSupport.dir/regcomp.c.o.d -o external/llvh/lib/Support/CMakeFiles/LLVHSupport.dir/regcomp.c.o -c /wrkdirs/usr/ports/lang/hermes/work/hermes-1ed8051/external/llvh/lib/Support/regcomp.c
[34/394] /usr/local/bin/g++10 -DHERMESVM_ALLOW_COMPRESSED_POINTERS -DHERMESVM_ALLOW_CONCURRENT_GC -DHERMESVM_GC_NONCONTIG_GENERATIONAL -DHERMESVM_HEAP_SEGMENT_SIZE_KB=4096 -DHERMES_ENABLE_DEBUGGER -DHERMES_LLVM -DHERMES_RELEASE_VERSION=\"0.7.0\" -I/wrkdirs/usr/ports/lang/hermes/work/hermes-1ed8051/external -I/wrkdirs/usr/ports/lang/hermes/work/hermes-1ed8051/external/flowparser/include -I/wrkdirs/usr/ports/lang/hermes/work/hermes-1ed8051/public -I/wrkdirs/usr/ports/lang/hermes/work/hermes-1ed8051/include -Iinclude -I/wrkdirs/usr/ports/lang/hermes/work/hermes-1ed8051/external/llvh/include -I/wrkdirs/usr/ports/lang/hermes/work/hermes-1ed8051/external/llvh/gen/include -Iexternal/llvh/include -O2 -pipe  -fstack-protector-strong -Wl,-rpath=/usr/local/lib/gcc10  -Wl,-rpath=/usr/local/lib/gcc10 -Wall -Wextra -Wno-unused-parameter -Wwrite-strings -Wcast-qual -Wno-missing-field-initializers -Wno-maybe-uninitialized -Wno-class-memaccess -Wno-noexcept-type -Wdelete-non-virtual-dtor -Wno-init-li
 st-lifetime -Wno-redundant-move -fvisibility=hidden -O2 -pipe  -fstack-protector-strong -Wl,-rpath=/usr/local/lib/gcc10  -Wl,-rpath=/usr/local/lib/gcc10 -fPIC -std=c++14  -fno-exceptions -fno-rtti -MD -MT external/llvh/lib/Support/CMakeFiles/LLVHSupport.dir/Regex.cpp.o -MF external/llvh/lib/Support/CMakeFiles/LLVHSupport.dir/Regex.cpp.o.d -o external/llvh/lib/Support/CMakeFiles/LLVHSupport.dir/Regex.cpp.o -c /wrkdirs/usr/ports/lang/hermes/work/hermes-1ed8051/external/llvh/lib/Support/Regex.cpp
[35/394] /usr/local/bin/gcc10 -DHERMESVM_ALLOW_COMPRESSED_POINTERS -DHERMESVM_ALLOW_CONCURRENT_GC -DHERMESVM_GC_NONCONTIG_GENERATIONAL -DHERMESVM_HEAP_SEGMENT_SIZE_KB=4096 -DHERMES_ENABLE_DEBUGGER -DHERMES_LLVM -DHERMES_RELEASE_VERSION=\"0.7.0\" -I/wrkdirs/usr/ports/lang/hermes/work/hermes-1ed8051/external -I/wrkdirs/usr/ports/lang/hermes/work/hermes-1ed8051/external/flowparser/include -I/wrkdirs/usr/ports/lang/hermes/work/hermes-1ed8051/public -I/wrkdirs/usr/ports/lang/hermes/work/hermes-1ed8051/include -Iinclude -I/wrkdirs/usr/ports/lang/hermes/work/hermes-1ed8051/external/llvh/include -I/wrkdirs/usr/ports/lang/hermes/work/hermes-1ed8051/external/llvh/gen/include -Iexternal/llvh/include -O2 -pipe  -fstack-protector-strong -Wl,-rpath=/usr/local/lib/gcc10 -fno-strict-aliasing -Wall -Wextra -Wno-unused-parameter -Wwrite-strings -Wno-missing-field-initializers -O2 -pipe  -fstack-protector-strong -Wl,-rpath=/usr/local/lib/gcc10 -fno-strict-aliasing -fPIC -MD -MT external/llvh/lib/Suppor
 t/CMakeFiles/LLVHSupport.dir/regstrlcpy.c.o -MF external/llvh/lib/Support/CMakeFiles/LLVHSupport.dir/regstrlcpy.c.o.d -o external/llvh/lib/Support/CMakeFiles/LLVHSupport.dir/regstrlcpy.c.o -c /wrkdirs/usr/ports/lang/hermes/work/hermes-1ed8051/external/llvh/lib/Support/regstrlcpy.c
[36/394] /usr/local/bin/gcc10 -DHERMESVM_ALLOW_COMPRESSED_POINTERS -DHERMESVM_ALLOW_CONCURRENT_GC -DHERMESVM_GC_NONCONTIG_GENERATIONAL -DHERMESVM_HEAP_SEGMENT_SIZE_KB=4096 -DHERMES_ENABLE_DEBUGGER -DHERMES_LLVM -DHERMES_RELEASE_VERSION=\"0.7.0\" -I/wrkdirs/usr/ports/lang/hermes/work/hermes-1ed8051/external -I/wrkdirs/usr/ports/lang/hermes/work/hermes-1ed8051/external/flowparser/include -I/wrkdirs/usr/ports/lang/hermes/work/hermes-1ed8051/public -I/wrkdirs/usr/ports/lang/hermes/work/hermes-1ed8051/include -Iinclude -I/wrkdirs/usr/ports/lang/hermes/work/hermes-1ed8051/external/llvh/include -I/wrkdirs/usr/ports/lang/hermes/work/hermes-1ed8051/external/llvh/gen/include -Iexternal/llvh/include -O2 -pipe  -fstack-protector-strong -Wl,-rpath=/usr/local/lib/gcc10 -fno-strict-aliasing -Wall -Wextra -Wno-unused-parameter -Wwrite-strings -Wno-missing-field-initializers -O2 -pipe  -fstack-protector-strong -Wl,-rpath=/usr/local/lib/gcc10 -fno-strict-aliasing -fPIC -MD -MT external/llvh/lib/Suppor
 t/CMakeFiles/LLVHSupport.dir/regexec.c.o -MF external/llvh/lib/Support/CMakeFiles/LLVHSupport.dir/regexec.c.o.d -o external/llvh/lib/Support/CMakeFiles/LLVHSupport.dir/regexec.c.o -c /wrkdirs/usr/ports/lang/hermes/work/hermes-1ed8051/external/llvh/lib/Support/regexec.c
[37/394] /usr/local/bin/g++10 -DHERMESVM_ALLOW_COMPRESSED_POINTERS -DHERMESVM_ALLOW_CONCURRENT_GC -DHERMESVM_GC_NONCONTIG_GENERATIONAL -DHERMESVM_HEAP_SEGMENT_SIZE_KB=4096 -DHERMES_ENABLE_DEBUGGER -DHERMES_LLVM -DHERMES_RELEASE_VERSION=\"0.7.0\" -I/wrkdirs/usr/ports/lang/hermes/work/hermes-1ed8051/external -I/wrkdirs/usr/ports/lang/hermes/work/hermes-1ed8051/external/flowparser/include -I/wrkdirs/usr/ports/lang/hermes/work/hermes-1ed8051/public -I/wrkdirs/usr/ports/lang/hermes/work/hermes-1ed8051/include -Iinclude -I/wrkdirs/usr/ports/lang/hermes/work/hermes-1ed8051/external/llvh/include -I/wrkdirs/usr/ports/lang/hermes/work/hermes-1ed8051/external/llvh/gen/include -Iexternal/llvh/include -O2 -pipe  -fstack-protector-strong -Wl,-rpath=/usr/local/lib/gcc10  -Wl,-rpath=/usr/local/lib/gcc10 -Wall -Wextra -Wno-unused-parameter -Wwrite-strings -Wcast-qual -Wno-missing-field-initializers -Wno-maybe-uninitialized -Wno-class-memaccess -Wno-noexcept-type -Wdelete-non-virtual-dtor -Wno-init-li
 st-lifetime -Wno-redundant-move -fvisibility=hidden -O2 -pipe  -fstack-protector-strong -Wl,-rpath=/usr/local/lib/gcc10  -Wl,-rpath=/usr/local/lib/gcc10 -fPIC -std=c++14  -fno-exceptions -fno-rtti -MD -MT external/llvh/lib/Support/CMakeFiles/LLVHSupport.dir/SHA1.cpp.o -MF external/llvh/lib/Support/CMakeFiles/LLVHSupport.dir/SHA1.cpp.o.d -o external/llvh/lib/Support/CMakeFiles/LLVHSupport.dir/SHA1.cpp.o -c /wrkdirs/usr/ports/lang/hermes/work/hermes-1ed8051/external/llvh/lib/Support/SHA1.cpp
[38/394] /usr/local/bin/g++10 -DHERMESVM_ALLOW_COMPRESSED_POINTERS -DHERMESVM_ALLOW_CONCURRENT_GC -DHERMESVM_GC_NONCONTIG_GENERATIONAL -DHERMESVM_HEAP_SEGMENT_SIZE_KB=4096 -DHERMES_ENABLE_DEBUGGER -DHERMES_LLVM -DHERMES_RELEASE_VERSION=\"0.7.0\" -I/wrkdirs/usr/ports/lang/hermes/work/hermes-1ed8051/external -I/wrkdirs/usr/ports/lang/hermes/work/hermes-1ed8051/external/flowparser/include -I/wrkdirs/usr/ports/lang/hermes/work/hermes-1ed8051/public -I/wrkdirs/usr/ports/lang/hermes/work/hermes-1ed8051/include -Iinclude -I/wrkdirs/usr/ports/lang/hermes/work/hermes-1ed8051/external/llvh/include -I/wrkdirs/usr/ports/lang/hermes/work/hermes-1ed8051/external/llvh/gen/include -Iexternal/llvh/include -O2 -pipe  -fstack-protector-strong -Wl,-rpath=/usr/local/lib/gcc10  -Wl,-rpath=/usr/local/lib/gcc10 -Wall -Wextra -Wno-unused-parameter -Wwrite-strings -Wcast-qual -Wno-missing-field-initializers -Wno-maybe-uninitialized -Wno-class-memaccess -Wno-noexcept-type -Wdelete-non-virtual-dtor -Wno-init-li
 st-lifetime -Wno-redundant-move -fvisibility=hidden -O2 -pipe  -fstack-protector-strong -Wl,-rpath=/usr/local/lib/gcc10  -Wl,-rpath=/usr/local/lib/gcc10 -fPIC -std=c++14  -fno-exceptions -fno-rtti -MD -MT external/llvh/lib/Support/CMakeFiles/LLVHSupport.dir/SmallVector.cpp.o -MF external/llvh/lib/Support/CMakeFiles/LLVHSupport.dir/SmallVector.cpp.o.d -o external/llvh/lib/Support/CMakeFiles/LLVHSupport.dir/SmallVector.cpp.o -c /wrkdirs/usr/ports/lang/hermes/work/hermes-1ed8051/external/llvh/lib/Support/SmallVector.cpp
[39/394] /usr/local/bin/g++10 -DHERMESVM_ALLOW_COMPRESSED_POINTERS -DHERMESVM_ALLOW_CONCURRENT_GC -DHERMESVM_GC_NONCONTIG_GENERATIONAL -DHERMESVM_HEAP_SEGMENT_SIZE_KB=4096 -DHERMES_ENABLE_DEBUGGER -DHERMES_LLVM -DHERMES_RELEASE_VERSION=\"0.7.0\" -I/wrkdirs/usr/ports/lang/hermes/work/hermes-1ed8051/external -I/wrkdirs/usr/ports/lang/hermes/work/hermes-1ed8051/external/flowparser/include -I/wrkdirs/usr/ports/lang/hermes/work/hermes-1ed8051/public -I/wrkdirs/usr/ports/lang/hermes/work/hermes-1ed8051/include -Iinclude -I/wrkdirs/usr/ports/lang/hermes/work/hermes-1ed8051/external/llvh/include -I/wrkdirs/usr/ports/lang/hermes/work/hermes-1ed8051/external/llvh/gen/include -Iexternal/llvh/include -O2 -pipe  -fstack-protector-strong -Wl,-rpath=/usr/local/lib/gcc10  -Wl,-rpath=/usr/local/lib/gcc10 -Wall -Wextra -Wno-unused-parameter -Wwrite-strings -Wcast-qual -Wno-missing-field-initializers -Wno-maybe-uninitialized -Wno-class-memaccess -Wno-noexcept-type -Wdelete-non-virtual-dtor -Wno-init-li
 st-lifetime -Wno-redundant-move -fvisibility=hidden -O2 -pipe  -fstack-protector-strong -Wl,-rpath=/usr/local/lib/gcc10  -Wl,-rpath=/usr/local/lib/gcc10 -fPIC -std=c++14  -fno-exceptions -fno-rtti -MD -MT external/llvh/lib/Support/CMakeFiles/LLVHSupport.dir/Signals.cpp.o -MF external/llvh/lib/Support/CMakeFiles/LLVHSupport.dir/Signals.cpp.o.d -o external/llvh/lib/Support/CMakeFiles/LLVHSupport.dir/Signals.cpp.o -c /wrkdirs/usr/ports/lang/hermes/work/hermes-1ed8051/external/llvh/lib/Support/Signals.cpp
[40/394] /usr/local/bin/g++10 -DHERMESVM_ALLOW_COMPRESSED_POINTERS -DHERMESVM_ALLOW_CONCURRENT_GC -DHERMESVM_GC_NONCONTIG_GENERATIONAL -DHERMESVM_HEAP_SEGMENT_SIZE_KB=4096 -DHERMES_ENABLE_DEBUGGER -DHERMES_LLVM -DHERMES_RELEASE_VERSION=\"0.7.0\" -I/wrkdirs/usr/ports/lang/hermes/work/hermes-1ed8051/external -I/wrkdirs/usr/ports/lang/hermes/work/hermes-1ed8051/external/flowparser/include -I/wrkdirs/usr/ports/lang/hermes/work/hermes-1ed8051/public -I/wrkdirs/usr/ports/lang/hermes/work/hermes-1ed8051/include -Iinclude -I/wrkdirs/usr/ports/lang/hermes/work/hermes-1ed8051/external/llvh/include -I/wrkdirs/usr/ports/lang/hermes/work/hermes-1ed8051/external/llvh/gen/include -Iexternal/llvh/include -O2 -pipe  -fstack-protector-strong -Wl,-rpath=/usr/local/lib/gcc10  -Wl,-rpath=/usr/local/lib/gcc10 -Wall -Wextra -Wno-unused-parameter -Wwrite-strings -Wcast-qual -Wno-missing-field-initializers -Wno-maybe-uninitialized -Wno-class-memaccess -Wno-noexcept-type -Wdelete-non-virtual-dtor -Wno-init-li
 st-lifetime -Wno-redundant-move -fvisibility=hidden -O2 -pipe  -fstack-protector-strong -Wl,-rpath=/usr/local/lib/gcc10  -Wl,-rpath=/usr/local/lib/gcc10 -fPIC -std=c++14  -fno-exceptions -fno-rtti -MD -MT external/llvh/lib/Support/CMakeFiles/LLVHSupport.dir/SmallPtrSet.cpp.o -MF external/llvh/lib/Support/CMakeFiles/LLVHSupport.dir/SmallPtrSet.cpp.o.d -o external/llvh/lib/Support/CMakeFiles/LLVHSupport.dir/SmallPtrSet.cpp.o -c /wrkdirs/usr/ports/lang/hermes/work/hermes-1ed8051/external/llvh/lib/Support/SmallPtrSet.cpp
[41/394] /usr/local/bin/g++10 -DHERMESVM_ALLOW_COMPRESSED_POINTERS -DHERMESVM_ALLOW_CONCURRENT_GC -DHERMESVM_GC_NONCONTIG_GENERATIONAL -DHERMESVM_HEAP_SEGMENT_SIZE_KB=4096 -DHERMES_ENABLE_DEBUGGER -DHERMES_LLVM -DHERMES_RELEASE_VERSION=\"0.7.0\" -I/wrkdirs/usr/ports/lang/hermes/work/hermes-1ed8051/external -I/wrkdirs/usr/ports/lang/hermes/work/hermes-1ed8051/external/flowparser/include -I/wrkdirs/usr/ports/lang/hermes/work/hermes-1ed8051/public -I/wrkdirs/usr/ports/lang/hermes/work/hermes-1ed8051/include -Iinclude -I/wrkdirs/usr/ports/lang/hermes/work/hermes-1ed8051/external/llvh/include -I/wrkdirs/usr/ports/lang/hermes/work/hermes-1ed8051/external/llvh/gen/include -Iexternal/llvh/include -O2 -pipe  -fstack-protector-strong -Wl,-rpath=/usr/local/lib/gcc10  -Wl,-rpath=/usr/local/lib/gcc10 -Wall -Wextra -Wno-unused-parameter -Wwrite-strings -Wcast-qual -Wno-missing-field-initializers -Wno-maybe-uninitialized -Wno-class-memaccess -Wno-noexcept-type -Wdelete-non-virtual-dtor -Wno-init-li
 st-lifetime -Wno-redundant-move -fvisibility=hidden -O2 -pipe  -fstack-protector-strong -Wl,-rpath=/usr/local/lib/gcc10  -Wl,-rpath=/usr/local/lib/gcc10 -fPIC -std=c++14  -fno-exceptions -fno-rtti -MD -MT external/llvh/lib/Support/CMakeFiles/LLVHSupport.dir/SourceMgr.cpp.o -MF external/llvh/lib/Support/CMakeFiles/LLVHSupport.dir/SourceMgr.cpp.o.d -o external/llvh/lib/Support/CMakeFiles/LLVHSupport.dir/SourceMgr.cpp.o -c /wrkdirs/usr/ports/lang/hermes/work/hermes-1ed8051/external/llvh/lib/Support/SourceMgr.cpp
[42/394] /usr/local/bin/g++10 -DHERMESVM_ALLOW_COMPRESSED_POINTERS -DHERMESVM_ALLOW_CONCURRENT_GC -DHERMESVM_GC_NONCONTIG_GENERATIONAL -DHERMESVM_HEAP_SEGMENT_SIZE_KB=4096 -DHERMES_ENABLE_DEBUGGER -DHERMES_LLVM -DHERMES_RELEASE_VERSION=\"0.7.0\" -I/wrkdirs/usr/ports/lang/hermes/work/hermes-1ed8051/external -I/wrkdirs/usr/ports/lang/hermes/work/hermes-1ed8051/external/flowparser/include -I/wrkdirs/usr/ports/lang/hermes/work/hermes-1ed8051/public -I/wrkdirs/usr/ports/lang/hermes/work/hermes-1ed8051/include -Iinclude -I/wrkdirs/usr/ports/lang/hermes/work/hermes-1ed8051/external/llvh/include -I/wrkdirs/usr/ports/lang/hermes/work/hermes-1ed8051/external/llvh/gen/include -Iexternal/llvh/include -O2 -pipe  -fstack-protector-strong -Wl,-rpath=/usr/local/lib/gcc10  -Wl,-rpath=/usr/local/lib/gcc10 -Wall -Wextra -Wno-unused-parameter -Wwrite-strings -Wcast-qual -Wno-missing-field-initializers -Wno-maybe-uninitialized -Wno-class-memaccess -Wno-noexcept-type -Wdelete-non-virtual-dtor -Wno-init-li
 st-lifetime -Wno-redundant-move -fvisibility=hidden -O2 -pipe  -fstack-protector-strong -Wl,-rpath=/usr/local/lib/gcc10  -Wl,-rpath=/usr/local/lib/gcc10 -fPIC -std=c++14  -fno-exceptions -fno-rtti -MD -MT external/llvh/lib/Support/CMakeFiles/LLVHSupport.dir/StringExtras.cpp.o -MF external/llvh/lib/Support/CMakeFiles/LLVHSupport.dir/StringExtras.cpp.o.d -o external/llvh/lib/Support/CMakeFiles/LLVHSupport.dir/StringExtras.cpp.o -c /wrkdirs/usr/ports/lang/hermes/work/hermes-1ed8051/external/llvh/lib/Support/StringExtras.cpp
[43/394] /usr/local/bin/g++10 -DHERMESVM_ALLOW_COMPRESSED_POINTERS -DHERMESVM_ALLOW_CONCURRENT_GC -DHERMESVM_GC_NONCONTIG_GENERATIONAL -DHERMESVM_HEAP_SEGMENT_SIZE_KB=4096 -DHERMES_ENABLE_DEBUGGER -DHERMES_LLVM -DHERMES_RELEASE_VERSION=\"0.7.0\" -I/wrkdirs/usr/ports/lang/hermes/work/hermes-1ed8051/external -I/wrkdirs/usr/ports/lang/hermes/work/hermes-1ed8051/external/flowparser/include -I/wrkdirs/usr/ports/lang/hermes/work/hermes-1ed8051/public -I/wrkdirs/usr/ports/lang/hermes/work/hermes-1ed8051/include -Iinclude -I/wrkdirs/usr/ports/lang/hermes/work/hermes-1ed8051/external/llvh/include -I/wrkdirs/usr/ports/lang/hermes/work/hermes-1ed8051/external/llvh/gen/include -Iexternal/llvh/include -O2 -pipe  -fstack-protector-strong -Wl,-rpath=/usr/local/lib/gcc10  -Wl,-rpath=/usr/local/lib/gcc10 -Wall -Wextra -Wno-unused-parameter -Wwrite-strings -Wcast-qual -Wno-missing-field-initializers -Wno-maybe-uninitialized -Wno-class-memaccess -Wno-noexcept-type -Wdelete-non-virtual-dtor -Wno-init-li
 st-lifetime -Wno-redundant-move -fvisibility=hidden -O2 -pipe  -fstack-protector-strong -Wl,-rpath=/usr/local/lib/gcc10  -Wl,-rpath=/usr/local/lib/gcc10 -fPIC -std=c++14  -fno-exceptions -fno-rtti -MD -MT external/llvh/lib/Support/CMakeFiles/LLVHSupport.dir/Statistic.cpp.o -MF external/llvh/lib/Support/CMakeFiles/LLVHSupport.dir/Statistic.cpp.o.d -o external/llvh/lib/Support/CMakeFiles/LLVHSupport.dir/Statistic.cpp.o -c /wrkdirs/usr/ports/lang/hermes/work/hermes-1ed8051/external/llvh/lib/Support/Statistic.cpp
[44/394] /usr/local/bin/g++10 -DHERMESVM_ALLOW_COMPRESSED_POINTERS -DHERMESVM_ALLOW_CONCURRENT_GC -DHERMESVM_GC_NONCONTIG_GENERATIONAL -DHERMESVM_HEAP_SEGMENT_SIZE_KB=4096 -DHERMES_ENABLE_DEBUGGER -DHERMES_LLVM -DHERMES_RELEASE_VERSION=\"0.7.0\" -I/wrkdirs/usr/ports/lang/hermes/work/hermes-1ed8051/external -I/wrkdirs/usr/ports/lang/hermes/work/hermes-1ed8051/external/flowparser/include -I/wrkdirs/usr/ports/lang/hermes/work/hermes-1ed8051/public -I/wrkdirs/usr/ports/lang/hermes/work/hermes-1ed8051/include -Iinclude -I/wrkdirs/usr/ports/lang/hermes/work/hermes-1ed8051/external/llvh/include -I/wrkdirs/usr/ports/lang/hermes/work/hermes-1ed8051/external/llvh/gen/include -Iexternal/llvh/include -O2 -pipe  -fstack-protector-strong -Wl,-rpath=/usr/local/lib/gcc10  -Wl,-rpath=/usr/local/lib/gcc10 -Wall -Wextra -Wno-unused-parameter -Wwrite-strings -Wcast-qual -Wno-missing-field-initializers -Wno-maybe-uninitialized -Wno-class-memaccess -Wno-noexcept-type -Wdelete-non-virtual-dtor -Wno-init-li
 st-lifetime -Wno-redundant-move -fvisibility=hidden -O2 -pipe  -fstack-protector-strong -Wl,-rpath=/usr/local/lib/gcc10  -Wl,-rpath=/usr/local/lib/gcc10 -fPIC -std=c++14  -fno-exceptions -fno-rtti -MD -MT external/llvh/lib/Support/CMakeFiles/LLVHSupport.dir/StringMap.cpp.o -MF external/llvh/lib/Support/CMakeFiles/LLVHSupport.dir/StringMap.cpp.o.d -o external/llvh/lib/Support/CMakeFiles/LLVHSupport.dir/StringMap.cpp.o -c /wrkdirs/usr/ports/lang/hermes/work/hermes-1ed8051/external/llvh/lib/Support/StringMap.cpp
[45/394] /usr/local/bin/g++10 -DHERMESVM_ALLOW_COMPRESSED_POINTERS -DHERMESVM_ALLOW_CONCURRENT_GC -DHERMESVM_GC_NONCONTIG_GENERATIONAL -DHERMESVM_HEAP_SEGMENT_SIZE_KB=4096 -DHERMES_ENABLE_DEBUGGER -DHERMES_LLVM -DHERMES_RELEASE_VERSION=\"0.7.0\" -I/wrkdirs/usr/ports/lang/hermes/work/hermes-1ed8051/external -I/wrkdirs/usr/ports/lang/hermes/work/hermes-1ed8051/external/flowparser/include -I/wrkdirs/usr/ports/lang/hermes/work/hermes-1ed8051/public -I/wrkdirs/usr/ports/lang/hermes/work/hermes-1ed8051/include -Iinclude -I/wrkdirs/usr/ports/lang/hermes/work/hermes-1ed8051/external/llvh/include -I/wrkdirs/usr/ports/lang/hermes/work/hermes-1ed8051/external/llvh/gen/include -Iexternal/llvh/include -O2 -pipe  -fstack-protector-strong -Wl,-rpath=/usr/local/lib/gcc10  -Wl,-rpath=/usr/local/lib/gcc10 -Wall -Wextra -Wno-unused-parameter -Wwrite-strings -Wcast-qual -Wno-missing-field-initializers -Wno-maybe-uninitialized -Wno-class-memaccess -Wno-noexcept-type -Wdelete-non-virtual-dtor -Wno-init-li
 st-lifetime -Wno-redundant-move -fvisibility=hidden -O2 -pipe  -fstack-protector-strong -Wl,-rpath=/usr/local/lib/gcc10  -Wl,-rpath=/usr/local/lib/gcc10 -fPIC -std=c++14  -fno-exceptions -fno-rtti -MD -MT external/llvh/lib/Support/CMakeFiles/LLVHSupport.dir/StringRef.cpp.o -MF external/llvh/lib/Support/CMakeFiles/LLVHSupport.dir/StringRef.cpp.o.d -o external/llvh/lib/Support/CMakeFiles/LLVHSupport.dir/StringRef.cpp.o -c /wrkdirs/usr/ports/lang/hermes/work/hermes-1ed8051/external/llvh/lib/Support/StringRef.cpp
[46/394] /usr/local/bin/g++10 -DHERMESVM_ALLOW_COMPRESSED_POINTERS -DHERMESVM_ALLOW_CONCURRENT_GC -DHERMESVM_GC_NONCONTIG_GENERATIONAL -DHERMESVM_HEAP_SEGMENT_SIZE_KB=4096 -DHERMES_ENABLE_DEBUGGER -DHERMES_LLVM -DHERMES_RELEASE_VERSION=\"0.7.0\" -I/wrkdirs/usr/ports/lang/hermes/work/hermes-1ed8051/external -I/wrkdirs/usr/ports/lang/hermes/work/hermes-1ed8051/external/flowparser/include -I/wrkdirs/usr/ports/lang/hermes/work/hermes-1ed8051/public -I/wrkdirs/usr/ports/lang/hermes/work/hermes-1ed8051/include -Iinclude -I/wrkdirs/usr/ports/lang/hermes/work/hermes-1ed8051/external/llvh/include -I/wrkdirs/usr/ports/lang/hermes/work/hermes-1ed8051/external/llvh/gen/include -Iexternal/llvh/include -O2 -pipe  -fstack-protector-strong -Wl,-rpath=/usr/local/lib/gcc10  -Wl,-rpath=/usr/local/lib/gcc10 -Wall -Wextra -Wno-unused-parameter -Wwrite-strings -Wcast-qual -Wno-missing-field-initializers -Wno-maybe-uninitialized -Wno-class-memaccess -Wno-noexcept-type -Wdelete-non-virtual-dtor -Wno-init-li
 st-lifetime -Wno-redundant-move -fvisibility=hidden -O2 -pipe  -fstack-protector-strong -Wl,-rpath=/usr/local/lib/gcc10  -Wl,-rpath=/usr/local/lib/gcc10 -fPIC -std=c++14  -fno-exceptions -fno-rtti -MD -MT external/llvh/lib/Support/CMakeFiles/LLVHSupport.dir/StringSaver.cpp.o -MF external/llvh/lib/Support/CMakeFiles/LLVHSupport.dir/StringSaver.cpp.o.d -o external/llvh/lib/Support/CMakeFiles/LLVHSupport.dir/StringSaver.cpp.o -c /wrkdirs/usr/ports/lang/hermes/work/hermes-1ed8051/external/llvh/lib/Support/StringSaver.cpp
[47/394] /usr/local/bin/g++10 -DHERMESVM_ALLOW_COMPRESSED_POINTERS -DHERMESVM_ALLOW_CONCURRENT_GC -DHERMESVM_GC_NONCONTIG_GENERATIONAL -DHERMESVM_HEAP_SEGMENT_SIZE_KB=4096 -DHERMES_ENABLE_DEBUGGER -DHERMES_LLVM -DHERMES_RELEASE_VERSION=\"0.7.0\" -I/wrkdirs/usr/ports/lang/hermes/work/hermes-1ed8051/external -I/wrkdirs/usr/ports/lang/hermes/work/hermes-1ed8051/external/flowparser/include -I/wrkdirs/usr/ports/lang/hermes/work/hermes-1ed8051/public -I/wrkdirs/usr/ports/lang/hermes/work/hermes-1ed8051/include -Iinclude -I/wrkdirs/usr/ports/lang/hermes/work/hermes-1ed8051/external/llvh/include -I/wrkdirs/usr/ports/lang/hermes/work/hermes-1ed8051/external/llvh/gen/include -Iexternal/llvh/include -O2 -pipe  -fstack-protector-strong -Wl,-rpath=/usr/local/lib/gcc10  -Wl,-rpath=/usr/local/lib/gcc10 -Wall -Wextra -Wno-unused-parameter -Wwrite-strings -Wcast-qual -Wno-missing-field-initializers -Wno-maybe-uninitialized -Wno-class-memaccess -Wno-noexcept-type -Wdelete-non-virtual-dtor -Wno-init-li
 st-lifetime -Wno-redundant-move -fvisibility=hidden -O2 -pipe  -fstack-protector-strong -Wl,-rpath=/usr/local/lib/gcc10  -Wl,-rpath=/usr/local/lib/gcc10 -fPIC -std=c++14  -fno-exceptions -fno-rtti -MD -MT external/llvh/lib/Support/CMakeFiles/LLVHSupport.dir/Threading.cpp.o -MF external/llvh/lib/Support/CMakeFiles/LLVHSupport.dir/Threading.cpp.o.d -o external/llvh/lib/Support/CMakeFiles/LLVHSupport.dir/Threading.cpp.o -c /wrkdirs/usr/ports/lang/hermes/work/hermes-1ed8051/external/llvh/lib/Support/Threading.cpp
[48/394] /usr/local/bin/g++10 -DHERMESVM_ALLOW_COMPRESSED_POINTERS -DHERMESVM_ALLOW_CONCURRENT_GC -DHERMESVM_GC_NONCONTIG_GENERATIONAL -DHERMESVM_HEAP_SEGMENT_SIZE_KB=4096 -DHERMES_ENABLE_DEBUGGER -DHERMES_LLVM -DHERMES_RELEASE_VERSION=\"0.7.0\" -I/wrkdirs/usr/ports/lang/hermes/work/hermes-1ed8051/external -I/wrkdirs/usr/ports/lang/hermes/work/hermes-1ed8051/external/flowparser/include -I/wrkdirs/usr/ports/lang/hermes/work/hermes-1ed8051/public -I/wrkdirs/usr/ports/lang/hermes/work/hermes-1ed8051/include -Iinclude -I/wrkdirs/usr/ports/lang/hermes/work/hermes-1ed8051/external/llvh/include -I/wrkdirs/usr/ports/lang/hermes/work/hermes-1ed8051/external/llvh/gen/include -Iexternal/llvh/include -O2 -pipe  -fstack-protector-strong -Wl,-rpath=/usr/local/lib/gcc10  -Wl,-rpath=/usr/local/lib/gcc10 -Wall -Wextra -Wno-unused-parameter -Wwrite-strings -Wcast-qual -Wno-missing-field-initializers -Wno-maybe-uninitialized -Wno-class-memaccess -Wno-noexcept-type -Wdelete-non-virtual-dtor -Wno-init-li
 st-lifetime -Wno-redundant-move -fvisibility=hidden -O2 -pipe  -fstack-protector-strong -Wl,-rpath=/usr/local/lib/gcc10  -Wl,-rpath=/usr/local/lib/gcc10 -fPIC -std=c++14  -fno-exceptions -fno-rtti -MD -MT external/llvh/lib/Support/CMakeFiles/LLVHSupport.dir/TargetParser.cpp.o -MF external/llvh/lib/Support/CMakeFiles/LLVHSupport.dir/TargetParser.cpp.o.d -o external/llvh/lib/Support/CMakeFiles/LLVHSupport.dir/TargetParser.cpp.o -c /wrkdirs/usr/ports/lang/hermes/work/hermes-1ed8051/external/llvh/lib/Support/TargetParser.cpp
[49/394] /usr/local/bin/g++10 -DHERMESVM_ALLOW_COMPRESSED_POINTERS -DHERMESVM_ALLOW_CONCURRENT_GC -DHERMESVM_GC_NONCONTIG_GENERATIONAL -DHERMESVM_HEAP_SEGMENT_SIZE_KB=4096 -DHERMES_ENABLE_DEBUGGER -DHERMES_LLVM -DHERMES_RELEASE_VERSION=\"0.7.0\" -I/wrkdirs/usr/ports/lang/hermes/work/hermes-1ed8051/external -I/wrkdirs/usr/ports/lang/hermes/work/hermes-1ed8051/external/flowparser/include -I/wrkdirs/usr/ports/lang/hermes/work/hermes-1ed8051/public -I/wrkdirs/usr/ports/lang/hermes/work/hermes-1ed8051/include -Iinclude -I/wrkdirs/usr/ports/lang/hermes/work/hermes-1ed8051/external/llvh/include -I/wrkdirs/usr/ports/lang/hermes/work/hermes-1ed8051/external/llvh/gen/include -Iexternal/llvh/include -O2 -pipe  -fstack-protector-strong -Wl,-rpath=/usr/local/lib/gcc10  -Wl,-rpath=/usr/local/lib/gcc10 -Wall -Wextra -Wno-unused-parameter -Wwrite-strings -Wcast-qual -Wno-missing-field-initializers -Wno-maybe-uninitialized -Wno-class-memaccess -Wno-noexcept-type -Wdelete-non-virtual-dtor -Wno-init-li
 st-lifetime -Wno-redundant-move -fvisibility=hidden -O2 -pipe  -fstack-protector-strong -Wl,-rpath=/usr/local/lib/gcc10  -Wl,-rpath=/usr/local/lib/gcc10 -fPIC -std=c++14  -fno-exceptions -fno-rtti -MD -MT external/llvh/lib/Support/CMakeFiles/LLVHSupport.dir/Timer.cpp.o -MF external/llvh/lib/Support/CMakeFiles/LLVHSupport.dir/Timer.cpp.o.d -o external/llvh/lib/Support/CMakeFiles/LLVHSupport.dir/Timer.cpp.o -c /wrkdirs/usr/ports/lang/hermes/work/hermes-1ed8051/external/llvh/lib/Support/Timer.cpp
[50/394] /usr/local/bin/g++10 -DHERMESVM_ALLOW_COMPRESSED_POINTERS -DHERMESVM_ALLOW_CONCURRENT_GC -DHERMESVM_GC_NONCONTIG_GENERATIONAL -DHERMESVM_HEAP_SEGMENT_SIZE_KB=4096 -DHERMES_ENABLE_DEBUGGER -DHERMES_LLVM -DHERMES_RELEASE_VERSION=\"0.7.0\" -I/wrkdirs/usr/ports/lang/hermes/work/hermes-1ed8051/external -I/wrkdirs/usr/ports/lang/hermes/work/hermes-1ed8051/external/flowparser/include -I/wrkdirs/usr/ports/lang/hermes/work/hermes-1ed8051/public -I/wrkdirs/usr/ports/lang/hermes/work/hermes-1ed8051/include -Iinclude -I/wrkdirs/usr/ports/lang/hermes/work/hermes-1ed8051/external/llvh/include -I/wrkdirs/usr/ports/lang/hermes/work/hermes-1ed8051/external/llvh/gen/include -Iexternal/llvh/include -O2 -pipe  -fstack-protector-strong -Wl,-rpath=/usr/local/lib/gcc10  -Wl,-rpath=/usr/local/lib/gcc10 -Wall -Wextra -Wno-unused-parameter -Wwrite-strings -Wcast-qual -Wno-missing-field-initializers -Wno-maybe-uninitialized -Wno-class-memaccess -Wno-noexcept-type -Wdelete-non-virtual-dtor -Wno-init-li
 st-lifetime -Wno-redundant-move -fvisibility=hidden -O2 -pipe  -fstack-protector-strong -Wl,-rpath=/usr/local/lib/gcc10  -Wl,-rpath=/usr/local/lib/gcc10 -fPIC -std=c++14  -fno-exceptions -fno-rtti -MD -MT external/llvh/lib/Support/CMakeFiles/LLVHSupport.dir/Triple.cpp.o -MF external/llvh/lib/Support/CMakeFiles/LLVHSupport.dir/Triple.cpp.o.d -o external/llvh/lib/Support/CMakeFiles/LLVHSupport.dir/Triple.cpp.o -c /wrkdirs/usr/ports/lang/hermes/work/hermes-1ed8051/external/llvh/lib/Support/Triple.cpp
[51/394] /usr/local/bin/g++10 -DHERMESVM_ALLOW_COMPRESSED_POINTERS -DHERMESVM_ALLOW_CONCURRENT_GC -DHERMESVM_GC_NONCONTIG_GENERATIONAL -DHERMESVM_HEAP_SEGMENT_SIZE_KB=4096 -DHERMES_ENABLE_DEBUGGER -DHERMES_LLVM -DHERMES_RELEASE_VERSION=\"0.7.0\" -I/wrkdirs/usr/ports/lang/hermes/work/hermes-1ed8051/external -I/wrkdirs/usr/ports/lang/hermes/work/hermes-1ed8051/external/flowparser/include -I/wrkdirs/usr/ports/lang/hermes/work/hermes-1ed8051/public -I/wrkdirs/usr/ports/lang/hermes/work/hermes-1ed8051/include -Iinclude -I/wrkdirs/usr/ports/lang/hermes/work/hermes-1ed8051/external/llvh/include -I/wrkdirs/usr/ports/lang/hermes/work/hermes-1ed8051/external/llvh/gen/include -Iexternal/llvh/include -O2 -pipe  -fstack-protector-strong -Wl,-rpath=/usr/local/lib/gcc10  -Wl,-rpath=/usr/local/lib/gcc10 -Wall -Wextra -Wno-unused-parameter -Wwrite-strings -Wcast-qual -Wno-missing-field-initializers -Wno-maybe-uninitialized -Wno-class-memaccess -Wno-noexcept-type -Wdelete-non-virtual-dtor -Wno-init-li
 st-lifetime -Wno-redundant-move -fvisibility=hidden -O2 -pipe  -fstack-protector-strong -Wl,-rpath=/usr/local/lib/gcc10  -Wl,-rpath=/usr/local/lib/gcc10 -fPIC -std=c++14  -fno-exceptions -fno-rtti -MD -MT external/llvh/lib/Support/CMakeFiles/LLVHSupport.dir/Twine.cpp.o -MF external/llvh/lib/Support/CMakeFiles/LLVHSupport.dir/Twine.cpp.o.d -o external/llvh/lib/Support/CMakeFiles/LLVHSupport.dir/Twine.cpp.o -c /wrkdirs/usr/ports/lang/hermes/work/hermes-1ed8051/external/llvh/lib/Support/Twine.cpp
[52/394] /usr/local/bin/g++10 -DHERMESVM_ALLOW_COMPRESSED_POINTERS -DHERMESVM_ALLOW_CONCURRENT_GC -DHERMESVM_GC_NONCONTIG_GENERATIONAL -DHERMESVM_HEAP_SEGMENT_SIZE_KB=4096 -DHERMES_ENABLE_DEBUGGER -DHERMES_LLVM -DHERMES_RELEASE_VERSION=\"0.7.0\" -I/wrkdirs/usr/ports/lang/hermes/work/hermes-1ed8051/external -I/wrkdirs/usr/ports/lang/hermes/work/hermes-1ed8051/external/flowparser/include -I/wrkdirs/usr/ports/lang/hermes/work/hermes-1ed8051/public -I/wrkdirs/usr/ports/lang/hermes/work/hermes-1ed8051/include -Iinclude -I/wrkdirs/usr/ports/lang/hermes/work/hermes-1ed8051/external/llvh/include -I/wrkdirs/usr/ports/lang/hermes/work/hermes-1ed8051/external/llvh/gen/include -Iexternal/llvh/include -O2 -pipe  -fstack-protector-strong -Wl,-rpath=/usr/local/lib/gcc10  -Wl,-rpath=/usr/local/lib/gcc10 -Wall -Wextra -Wno-unused-parameter -Wwrite-strings -Wcast-qual -Wno-missing-field-initializers -Wno-maybe-uninitialized -Wno-class-memaccess -Wno-noexcept-type -Wdelete-non-virtual-dtor -Wno-init-li
 st-lifetime -Wno-redundant-move -fvisibility=hidden -O2 -pipe  -fstack-protector-strong -Wl,-rpath=/usr/local/lib/gcc10  -Wl,-rpath=/usr/local/lib/gcc10 -fPIC -std=c++14  -fno-exceptions -fno-rtti -MD -MT external/llvh/lib/Support/CMakeFiles/LLVHSupport.dir/Unicode.cpp.o -MF external/llvh/lib/Support/CMakeFiles/LLVHSupport.dir/Unicode.cpp.o.d -o external/llvh/lib/Support/CMakeFiles/LLVHSupport.dir/Unicode.cpp.o -c /wrkdirs/usr/ports/lang/hermes/work/hermes-1ed8051/external/llvh/lib/Support/Unicode.cpp
[53/394] /usr/local/bin/g++10 -DHERMESVM_ALLOW_COMPRESSED_POINTERS -DHERMESVM_ALLOW_CONCURRENT_GC -DHERMESVM_GC_NONCONTIG_GENERATIONAL -DHERMESVM_HEAP_SEGMENT_SIZE_KB=4096 -DHERMES_ENABLE_DEBUGGER -DHERMES_LLVM -DHERMES_RELEASE_VERSION=\"0.7.0\" -I/wrkdirs/usr/ports/lang/hermes/work/hermes-1ed8051/external -I/wrkdirs/usr/ports/lang/hermes/work/hermes-1ed8051/external/flowparser/include -I/wrkdirs/usr/ports/lang/hermes/work/hermes-1ed8051/public -I/wrkdirs/usr/ports/lang/hermes/work/hermes-1ed8051/include -Iinclude -I/wrkdirs/usr/ports/lang/hermes/work/hermes-1ed8051/external/llvh/include -I/wrkdirs/usr/ports/lang/hermes/work/hermes-1ed8051/external/llvh/gen/include -Iexternal/llvh/include -O2 -pipe  -fstack-protector-strong -Wl,-rpath=/usr/local/lib/gcc10  -Wl,-rpath=/usr/local/lib/gcc10 -Wall -Wextra -Wno-unused-parameter -Wwrite-strings -Wcast-qual -Wno-missing-field-initializers -Wno-maybe-uninitialized -Wno-class-memaccess -Wno-noexcept-type -Wdelete-non-virtual-dtor -Wno-init-li
 st-lifetime -Wno-redundant-move -fvisibility=hidden -O2 -pipe  -fstack-protector-strong -Wl,-rpath=/usr/local/lib/gcc10  -Wl,-rpath=/usr/local/lib/gcc10 -fPIC -std=c++14  -fno-exceptions -fno-rtti -MD -MT external/llvh/lib/Support/CMakeFiles/LLVHSupport.dir/Valgrind.cpp.o -MF external/llvh/lib/Support/CMakeFiles/LLVHSupport.dir/Valgrind.cpp.o.d -o external/llvh/lib/Support/CMakeFiles/LLVHSupport.dir/Valgrind.cpp.o -c /wrkdirs/usr/ports/lang/hermes/work/hermes-1ed8051/external/llvh/lib/Support/Valgrind.cpp
[54/394] /usr/local/bin/g++10 -DHERMESVM_ALLOW_COMPRESSED_POINTERS -DHERMESVM_ALLOW_CONCURRENT_GC -DHERMESVM_GC_NONCONTIG_GENERATIONAL -DHERMESVM_HEAP_SEGMENT_SIZE_KB=4096 -DHERMES_ENABLE_DEBUGGER -DHERMES_LLVM -DHERMES_RELEASE_VERSION=\"0.7.0\" -I/wrkdirs/usr/ports/lang/hermes/work/hermes-1ed8051/external -I/wrkdirs/usr/ports/lang/hermes/work/hermes-1ed8051/external/flowparser/include -I/wrkdirs/usr/ports/lang/hermes/work/hermes-1ed8051/public -I/wrkdirs/usr/ports/lang/hermes/work/hermes-1ed8051/include -Iinclude -I/wrkdirs/usr/ports/lang/hermes/work/hermes-1ed8051/external/llvh/include -I/wrkdirs/usr/ports/lang/hermes/work/hermes-1ed8051/external/llvh/gen/include -Iexternal/llvh/include -O2 -pipe  -fstack-protector-strong -Wl,-rpath=/usr/local/lib/gcc10  -Wl,-rpath=/usr/local/lib/gcc10 -Wall -Wextra -Wno-unused-parameter -Wwrite-strings -Wcast-qual -Wno-missing-field-initializers -Wno-maybe-uninitialized -Wno-class-memaccess -Wno-noexcept-type -Wdelete-non-virtual-dtor -Wno-init-li
 st-lifetime -Wno-redundant-move -fvisibility=hidden -O2 -pipe  -fstack-protector-strong -Wl,-rpath=/usr/local/lib/gcc10  -Wl,-rpath=/usr/local/lib/gcc10 -fPIC -std=c++14  -fno-exceptions -fno-rtti -MD -MT external/llvh/lib/Support/CMakeFiles/LLVHSupport.dir/Watchdog.cpp.o -MF external/llvh/lib/Support/CMakeFiles/LLVHSupport.dir/Watchdog.cpp.o.d -o external/llvh/lib/Support/CMakeFiles/LLVHSupport.dir/Watchdog.cpp.o -c /wrkdirs/usr/ports/lang/hermes/work/hermes-1ed8051/external/llvh/lib/Support/Watchdog.cpp
[55/394] /usr/local/bin/g++10 -DHERMESVM_ALLOW_COMPRESSED_POINTERS -DHERMESVM_ALLOW_CONCURRENT_GC -DHERMESVM_GC_NONCONTIG_GENERATIONAL -DHERMESVM_HEAP_SEGMENT_SIZE_KB=4096 -DHERMES_ENABLE_DEBUGGER -DHERMES_LLVM -DHERMES_RELEASE_VERSION=\"0.7.0\" -I/wrkdirs/usr/ports/lang/hermes/work/hermes-1ed8051/external -I/wrkdirs/usr/ports/lang/hermes/work/hermes-1ed8051/external/flowparser/include -I/wrkdirs/usr/ports/lang/hermes/work/hermes-1ed8051/public -I/wrkdirs/usr/ports/lang/hermes/work/hermes-1ed8051/include -Iinclude -I/wrkdirs/usr/ports/lang/hermes/work/hermes-1ed8051/external/llvh/include -I/wrkdirs/usr/ports/lang/hermes/work/hermes-1ed8051/external/llvh/gen/include -Iexternal/llvh/include -O2 -pipe  -fstack-protector-strong -Wl,-rpath=/usr/local/lib/gcc10  -Wl,-rpath=/usr/local/lib/gcc10 -Wall -Wextra -Wno-unused-parameter -Wwrite-strings -Wcast-qual -Wno-missing-field-initializers -Wno-maybe-uninitialized -Wno-class-memaccess -Wno-noexcept-type -Wdelete-non-virtual-dtor -Wno-init-li
 st-lifetime -Wno-redundant-move -fvisibility=hidden -O2 -pipe  -fstack-protector-strong -Wl,-rpath=/usr/local/lib/gcc10  -Wl,-rpath=/usr/local/lib/gcc10 -fPIC  -fno-exceptions -fno-rtti -std=c++14 -MD -MT external/llvh/lib/Demangle/CMakeFiles/LLVHDemangle.dir/MicrosoftDemangle.cpp.o -MF external/llvh/lib/Demangle/CMakeFiles/LLVHDemangle.dir/MicrosoftDemangle.cpp.o.d -o external/llvh/lib/Demangle/CMakeFiles/LLVHDemangle.dir/MicrosoftDemangle.cpp.o -c /wrkdirs/usr/ports/lang/hermes/work/hermes-1ed8051/external/llvh/lib/Demangle/MicrosoftDemangle.cpp
[56/394] /usr/local/bin/g++10 -DHERMESVM_ALLOW_COMPRESSED_POINTERS -DHERMESVM_ALLOW_CONCURRENT_GC -DHERMESVM_GC_NONCONTIG_GENERATIONAL -DHERMESVM_HEAP_SEGMENT_SIZE_KB=4096 -DHERMES_ENABLE_DEBUGGER -DHERMES_LLVM -DHERMES_RELEASE_VERSION=\"0.7.0\" -I/wrkdirs/usr/ports/lang/hermes/work/hermes-1ed8051/external -I/wrkdirs/usr/ports/lang/hermes/work/hermes-1ed8051/external/flowparser/include -I/wrkdirs/usr/ports/lang/hermes/work/hermes-1ed8051/public -I/wrkdirs/usr/ports/lang/hermes/work/hermes-1ed8051/include -Iinclude -I/wrkdirs/usr/ports/lang/hermes/work/hermes-1ed8051/external/llvh/include -I/wrkdirs/usr/ports/lang/hermes/work/hermes-1ed8051/external/llvh/gen/include -Iexternal/llvh/include -O2 -pipe  -fstack-protector-strong -Wl,-rpath=/usr/local/lib/gcc10  -Wl,-rpath=/usr/local/lib/gcc10 -Wall -Wextra -Wno-unused-parameter -Wwrite-strings -Wcast-qual -Wno-missing-field-initializers -Wno-maybe-uninitialized -Wno-class-memaccess -Wno-noexcept-type -Wdelete-non-virtual-dtor -Wno-init-li
 st-lifetime -Wno-redundant-move -fvisibility=hidden -O2 -pipe  -fstack-protector-strong -Wl,-rpath=/usr/local/lib/gcc10  -Wl,-rpath=/usr/local/lib/gcc10 -fPIC  -fno-exceptions -fno-rtti -std=c++14 -MD -MT external/llvh/lib/Demangle/CMakeFiles/LLVHDemangle.dir/MicrosoftDemangleNodes.cpp.o -MF external/llvh/lib/Demangle/CMakeFiles/LLVHDemangle.dir/MicrosoftDemangleNodes.cpp.o.d -o external/llvh/lib/Demangle/CMakeFiles/LLVHDemangle.dir/MicrosoftDemangleNodes.cpp.o -c /wrkdirs/usr/ports/lang/hermes/work/hermes-1ed8051/external/llvh/lib/Demangle/MicrosoftDemangleNodes.cpp
[57/394] /usr/local/bin/g++10 -DHERMESVM_ALLOW_COMPRESSED_POINTERS -DHERMESVM_ALLOW_CONCURRENT_GC -DHERMESVM_GC_NONCONTIG_GENERATIONAL -DHERMESVM_HEAP_SEGMENT_SIZE_KB=4096 -DHERMES_ENABLE_DEBUGGER -DHERMES_LLVM -DHERMES_RELEASE_VERSION=\"0.7.0\" -I/wrkdirs/usr/ports/lang/hermes/work/hermes-1ed8051/external -I/wrkdirs/usr/ports/lang/hermes/work/hermes-1ed8051/external/flowparser/include -I/wrkdirs/usr/ports/lang/hermes/work/hermes-1ed8051/public -I/wrkdirs/usr/ports/lang/hermes/work/hermes-1ed8051/include -Iinclude -I/wrkdirs/usr/ports/lang/hermes/work/hermes-1ed8051/external/llvh/include -I/wrkdirs/usr/ports/lang/hermes/work/hermes-1ed8051/external/llvh/gen/include -Iexternal/llvh/include -O2 -pipe  -fstack-protector-strong -Wl,-rpath=/usr/local/lib/gcc10  -Wl,-rpath=/usr/local/lib/gcc10 -Wall -Wextra -Wno-unused-parameter -Wwrite-strings -Wcast-qual -Wno-missing-field-initializers -Wno-maybe-uninitialized -Wno-class-memaccess -Wno-noexcept-type -Wdelete-non-virtual-dtor -Wno-init-li
 st-lifetime -Wno-redundant-move -fvisibility=hidden -O2 -pipe  -fstack-protector-strong -Wl,-rpath=/usr/local/lib/gcc10  -Wl,-rpath=/usr/local/lib/gcc10 -fPIC  -fno-exceptions -fno-rtti -std=c++14 -MD -MT external/llvh/lib/Demangle/CMakeFiles/LLVHDemangle.dir/ItaniumDemangle.cpp.o -MF external/llvh/lib/Demangle/CMakeFiles/LLVHDemangle.dir/ItaniumDemangle.cpp.o.d -o external/llvh/lib/Demangle/CMakeFiles/LLVHDemangle.dir/ItaniumDemangle.cpp.o -c /wrkdirs/usr/ports/lang/hermes/work/hermes-1ed8051/external/llvh/lib/Demangle/ItaniumDemangle.cpp
[58/394] : && /usr/local/bin/cmake -E rm -f external/llvh/lib/Demangle/libLLVHDemangle.a && /usr/local/bin/ar qc external/llvh/lib/Demangle/libLLVHDemangle.a  external/llvh/lib/Demangle/CMakeFiles/LLVHDemangle.dir/ItaniumDemangle.cpp.o external/llvh/lib/Demangle/CMakeFiles/LLVHDemangle.dir/MicrosoftDemangle.cpp.o external/llvh/lib/Demangle/CMakeFiles/LLVHDemangle.dir/MicrosoftDemangleNodes.cpp.o && /usr/local/bin/ranlib external/llvh/lib/Demangle/libLLVHDemangle.a && :
[59/394] : && /usr/local/bin/cmake -E rm -f external/llvh/lib/Support/libLLVHSupport.a && /usr/local/bin/ar qc external/llvh/lib/Support/libLLVHSupport.a  external/llvh/lib/Support/CMakeFiles/LLVHSupport.dir/APFloat.cpp.o external/llvh/lib/Support/CMakeFiles/LLVHSupport.dir/APInt.cpp.o external/llvh/lib/Support/CMakeFiles/LLVHSupport.dir/circular_raw_ostream.cpp.o external/llvh/lib/Support/CMakeFiles/LLVHSupport.dir/CommandLine.cpp.o external/llvh/lib/Support/CMakeFiles/LLVHSupport.dir/ConvertUTF.cpp.o external/llvh/lib/Support/CMakeFiles/LLVHSupport.dir/ConvertUTFWrapper.cpp.o external/llvh/lib/Support/CMakeFiles/LLVHSupport.dir/Debug.cpp.o external/llvh/lib/Support/CMakeFiles/LLVHSupport.dir/Errno.cpp.o external/llvh/lib/Support/CMakeFiles/LLVHSupport.dir/Error.cpp.o external/llvh/lib/Support/CMakeFiles/LLVHSupport.dir/ErrorHandling.cpp.o external/llvh/lib/Support/CMakeFiles/LLVHSupport.dir/FileCheck.cpp.o external/llvh/lib/Support/CMakeFiles/LLVHSupport.dir/FoldingSet.cpp.o extern
 al/llvh/lib/Support/CMakeFiles/LLVHSupport.dir/GraphWriter.cpp.o external/llvh/lib/Support/CMakeFiles/LLVHSupport.dir/Hashing.cpp.o external/llvh/lib/Support/CMakeFiles/LLVHSupport.dir/Host.cpp.o external/llvh/lib/Support/CMakeFiles/LLVHSupport.dir/InitLLVM.cpp.o external/llvh/lib/Support/CMakeFiles/LLVHSupport.dir/LineIterator.cpp.o external/llvh/lib/Support/CMakeFiles/LLVHSupport.dir/Locale.cpp.o external/llvh/lib/Support/CMakeFiles/LLVHSupport.dir/ManagedStatic.cpp.o external/llvh/lib/Support/CMakeFiles/LLVHSupport.dir/MD5.cpp.o external/llvh/lib/Support/CMakeFiles/LLVHSupport.dir/Memory.cpp.o external/llvh/lib/Support/CMakeFiles/LLVHSupport.dir/MemoryBuffer.cpp.o external/llvh/lib/Support/CMakeFiles/LLVHSupport.dir/Mutex.cpp.o external/llvh/lib/Support/CMakeFiles/LLVHSupport.dir/NativeFormatting.cpp.o external/llvh/lib/Support/CMakeFiles/LLVHSupport.dir/Path.cpp.o external/llvh/lib/Support/CMakeFiles/LLVHSupport.dir/PrettyStackTrace.cpp.o external/llvh/lib/Support/CMakeFiles/LLV
 HSupport.dir/Process.cpp.o external/llvh/lib!
 /Support/CMakeFiles/LLVHSupport.dir/Program.cpp.o external/llvh/lib/Support/CMakeFiles/LLVHSupport.dir/raw_ostream.cpp.o external/llvh/lib/Support/CMakeFiles/LLVHSupport.dir/raw_os_ostream.cpp.o external/llvh/lib/Support/CMakeFiles/LLVHSupport.dir/regcomp.c.o external/llvh/lib/Support/CMakeFiles/LLVHSupport.dir/regerror.c.o external/llvh/lib/Support/CMakeFiles/LLVHSupport.dir/regfree.c.o external/llvh/lib/Support/CMakeFiles/LLVHSupport.dir/Regex.cpp.o external/llvh/lib/Support/CMakeFiles/LLVHSupport.dir/regexec.c.o external/llvh/lib/Support/CMakeFiles/LLVHSupport.dir/regstrlcpy.c.o external/llvh/lib/Support/CMakeFiles/LLVHSupport.dir/SHA1.cpp.o external/llvh/lib/Support/CMakeFiles/LLVHSupport.dir/Signals.cpp.o external/llvh/lib/Support/CMakeFiles/LLVHSupport.dir/SmallVector.cpp.o external/llvh/lib/Support/CMakeFiles/LLVHSupport.dir/SmallPtrSet.cpp.o external/llvh/lib/Support/CMakeFiles/LLVHSupport.dir/SourceMgr.cpp.o external/llvh/lib/Support/CMakeFiles/LLVHSupport.dir/Statistic.cpp
 .o external/llvh/lib/Support/CMakeFiles/LLVHSupport.dir/StringExtras.cpp.o external/llvh/lib/Support/CMakeFiles/LLVHSupport.dir/StringMap.cpp.o external/llvh/lib/Support/CMakeFiles/LLVHSupport.dir/StringRef.cpp.o external/llvh/lib/Support/CMakeFiles/LLVHSupport.dir/StringSaver.cpp.o external/llvh/lib/Support/CMakeFiles/LLVHSupport.dir/TargetParser.cpp.o external/llvh/lib/Support/CMakeFiles/LLVHSupport.dir/Threading.cpp.o external/llvh/lib/Support/CMakeFiles/LLVHSupport.dir/Timer.cpp.o external/llvh/lib/Support/CMakeFiles/LLVHSupport.dir/Triple.cpp.o external/llvh/lib/Support/CMakeFiles/LLVHSupport.dir/Twine.cpp.o external/llvh/lib/Support/CMakeFiles/LLVHSupport.dir/Unicode.cpp.o external/llvh/lib/Support/CMakeFiles/LLVHSupport.dir/Valgrind.cpp.o external/llvh/lib/Support/CMakeFiles/LLVHSupport.dir/Watchdog.cpp.o && /usr/local/bin/ranlib external/llvh/lib/Support/libLLVHSupport.a && :
[60/394] /usr/local/bin/g++10 -DHERMESVM_ALLOW_COMPRESSED_POINTERS -DHERMESVM_ALLOW_CONCURRENT_GC -DHERMESVM_GC_NONCONTIG_GENERATIONAL -DHERMESVM_HEAP_SEGMENT_SIZE_KB=4096 -DHERMES_ENABLE_DEBUGGER -DHERMES_LLVM -DHERMES_RELEASE_VERSION=\"0.7.0\" -I/wrkdirs/usr/ports/lang/hermes/work/hermes-1ed8051/external -I/wrkdirs/usr/ports/lang/hermes/work/hermes-1ed8051/external/flowparser/include -I/wrkdirs/usr/ports/lang/hermes/work/hermes-1ed8051/public -I/wrkdirs/usr/ports/lang/hermes/work/hermes-1ed8051/include -Iinclude -I/wrkdirs/usr/ports/lang/hermes/work/hermes-1ed8051/external/llvh/include -I/wrkdirs/usr/ports/lang/hermes/work/hermes-1ed8051/external/llvh/gen/include -Iexternal/llvh/include -O2 -pipe  -fstack-protector-strong -Wl,-rpath=/usr/local/lib/gcc10  -Wl,-rpath=/usr/local/lib/gcc10 -Wall -Wextra -Wno-unused-parameter -Wwrite-strings -Wcast-qual -Wno-missing-field-initializers -Wno-maybe-uninitialized -Wno-class-memaccess -Wno-noexcept-type -Wdelete-non-virtual-dtor -Wno-init-li
 st-lifetime -Wno-redundant-move -fvisibility=hidden -O2 -pipe  -fstack-protector-strong -Wl,-rpath=/usr/local/lib/gcc10  -Wl,-rpath=/usr/local/lib/gcc10  -fno-exceptions -fno-rtti -std=c++14 -MD -MT external/llvh/utils/not/CMakeFiles/not.dir/not.cpp.o -MF external/llvh/utils/not/CMakeFiles/not.dir/not.cpp.o.d -o external/llvh/utils/not/CMakeFiles/not.dir/not.cpp.o -c /wrkdirs/usr/ports/lang/hermes/work/hermes-1ed8051/external/llvh/utils/not/not.cpp
[61/394] : && /usr/local/bin/g++10 -O2 -pipe  -fstack-protector-strong -Wl,-rpath=/usr/local/lib/gcc10  -Wl,-rpath=/usr/local/lib/gcc10 -Wall -Wextra -Wno-unused-parameter -Wwrite-strings -Wcast-qual -Wno-missing-field-initializers -Wno-maybe-uninitialized -Wno-class-memaccess -Wno-noexcept-type -Wdelete-non-virtual-dtor -Wno-init-list-lifetime -Wno-redundant-move -fvisibility=hidden -O2 -pipe  -fstack-protector-strong -Wl,-rpath=/usr/local/lib/gcc10  -Wl,-rpath=/usr/local/lib/gcc10 -L/usr/local/lib -fstack-protector-strong -Wl,-rpath=/usr/local/lib/gcc10 -L/usr/local/lib/gcc10 -fno-pie external/llvh/utils/not/CMakeFiles/not.dir/not.cpp.o -o bin/not  external/llvh/lib/Support/libLLVHSupport.a  external/llvh/lib/Demangle/libLLVHDemangle.a  -lpthread && :
FAILED: bin/not 
: && /usr/local/bin/g++10 -O2 -pipe  -fstack-protector-strong -Wl,-rpath=/usr/local/lib/gcc10  -Wl,-rpath=/usr/local/lib/gcc10 -Wall -Wextra -Wno-unused-parameter -Wwrite-strings -Wcast-qual -Wno-missing-field-initializers -Wno-maybe-uninitialized -Wno-class-memaccess -Wno-noexcept-type -Wdelete-non-virtual-dtor -Wno-init-list-lifetime -Wno-redundant-move -fvisibility=hidden -O2 -pipe  -fstack-protector-strong -Wl,-rpath=/usr/local/lib/gcc10  -Wl,-rpath=/usr/local/lib/gcc10 -L/usr/local/lib -fstack-protector-strong -Wl,-rpath=/usr/local/lib/gcc10 -L/usr/local/lib/gcc10 -fno-pie external/llvh/utils/not/CMakeFiles/not.dir/not.cpp.o -o bin/not  external/llvh/lib/Support/libLLVHSupport.a  external/llvh/lib/Demangle/libLLVHDemangle.a  -lpthread && :
/usr/local/bin/ld: external/llvh/lib/Support/libLLVHSupport.a(ManagedStatic.cpp.o): in function `llvh::ManagedStaticBase::RegisterManagedStatic(void* (*)(), void (*)(void*)) const':
ManagedStatic.cpp:(.text+0x58): undefined reference to `llvh::sys::CompareAndSwap(unsigned int volatile*, unsigned int, unsigned int)'
/usr/local/bin/ld: ManagedStatic.cpp:(.text+0x9c): undefined reference to `llvh::sys::MemoryFence()'
/usr/local/bin/ld: ManagedStatic.cpp:(.text+0x1d8): undefined reference to `llvh::sys::MemoryFence()'
/usr/local/bin/ld: ManagedStatic.cpp:(.text+0x1f4): undefined reference to `llvh::sys::MemoryFence()'
/usr/local/bin/ld: external/llvh/lib/Support/libLLVHSupport.a(ManagedStatic.cpp.o): in function `llvh::llvm_shutdown()':
ManagedStatic.cpp:(.text+0x378): undefined reference to `llvh::sys::CompareAndSwap(unsigned int volatile*, unsigned int, unsigned int)'
/usr/local/bin/ld: ManagedStatic.cpp:(.text+0x3bc): undefined reference to `llvh::sys::MemoryFence()'
/usr/local/bin/ld: ManagedStatic.cpp:(.text+0x448): undefined reference to `llvh::sys::MemoryFence()'
/usr/local/bin/ld: ManagedStatic.cpp:(.text+0x464): undefined reference to `llvh::sys::MemoryFence()'
collect2: error: ld returned 1 exit status
[62/394] /usr/local/bin/g++10 -DHERMESVM_ALLOW_COMPRESSED_POINTERS -DHERMESVM_ALLOW_CONCURRENT_GC -DHERMESVM_GC_NONCONTIG_GENERATIONAL -DHERMESVM_HEAP_SEGMENT_SIZE_KB=4096 -DHERMES_ENABLE_DEBUGGER -DHERMES_LLVM -DHERMES_RELEASE_VERSION=\"0.7.0\" -I/wrkdirs/usr/ports/lang/hermes/work/hermes-1ed8051/external -I/wrkdirs/usr/ports/lang/hermes/work/hermes-1ed8051/external/flowparser/include -I/wrkdirs/usr/ports/lang/hermes/work/hermes-1ed8051/public -I/wrkdirs/usr/ports/lang/hermes/work/hermes-1ed8051/include -Iinclude -I/wrkdirs/usr/ports/lang/hermes/work/hermes-1ed8051/external/llvh/include -I/wrkdirs/usr/ports/lang/hermes/work/hermes-1ed8051/external/llvh/gen/include -Iexternal/llvh/include -O2 -pipe  -fstack-protector-strong -Wl,-rpath=/usr/local/lib/gcc10  -Wl,-rpath=/usr/local/lib/gcc10 -Wall -Wextra -Wno-unused-parameter -Wwrite-strings -Wcast-qual -Wno-missing-field-initializers -Wno-maybe-uninitialized -Wno-class-memaccess -Wno-noexcept-type -Wdelete-non-virtual-dtor -Wno-init-li
 st-lifetime -Wno-redundant-move -fvisibility=hidden -O2 -pipe  -fstack-protector-strong -Wl,-rpath=/usr/local/lib/gcc10  -Wl,-rpath=/usr/local/lib/gcc10  -fno-exceptions -fno-rtti -std=c++14 -MD -MT external/llvh/utils/FileCheck/CMakeFiles/FileCheck.dir/FileCheck.cpp.o -MF external/llvh/utils/FileCheck/CMakeFiles/FileCheck.dir/FileCheck.cpp.o.d -o external/llvh/utils/FileCheck/CMakeFiles/FileCheck.dir/FileCheck.cpp.o -c /wrkdirs/usr/ports/lang/hermes/work/hermes-1ed8051/external/llvh/utils/FileCheck/FileCheck.cpp
ninja: build stopped: subcommand failed.
===> Compilation failed unexpectedly.
Try to set MAKE_JOBS_UNSAFE=yes and rebuild before reporting the failure to
the maintainer.
*** Error code 1

Stop.
make: stopped in /usr/ports/lang/hermes
Received on Tue Jun 29 2021 - 04:04:36 UTC

Original text of this message