[package - 122powerpc64-quarterly][databases/xrootd] Failed for xrootd-4.10.0_1 in build

From: <pkg-fallout_at_FreeBSD.org>
Date: Tue, 29 Jun 2021 04:03:43 GMT
You are receiving this mail as a port that you maintain
is failing to build on the FreeBSD package build server.
Please investigate the failure and submit a PR to fix
build.

Maintainer:     yuri_at_FreeBSD.org
Log URL:        http://foul1.nyi.freebsd.org/data/122powerpc64-quarterly/ae162bd98935/logs/xrootd-4.10.0_1.log
Build URL:      http://foul1.nyi.freebsd.org/build.html?mastername=122powerpc64-quarterly&build=ae162bd98935
Log:

=>> Building databases/xrootd
build started at Tue Jun 29 04:02:40 UTC 2021
port directory: /usr/ports/databases/xrootd
package name: xrootd-4.10.0_1
building for: FreeBSD 122powerpc64-quarterly-job-12 12.2-RELEASE FreeBSD 12.2-RELEASE powerpc
maintained by: yuri_at_FreeBSD.org
Makefile ident: 
Poudriere version: 3.2.8-8-gaf08dbda
Host OSVERSION: 1400008
Jail OSVERSION: 1202000
Job Id: 12

---Begin Environment---
SHELL=/bin/csh
OSVERSION=1202000
UNAME_v=FreeBSD 12.2-RELEASE
UNAME_r=12.2-RELEASE
BLOCKSIZE=K
MAIL=/var/mail/root
STATUS=1
HOME=/root
PATH=/sbin:/bin:/usr/sbin:/usr/bin:/usr/local/sbin:/usr/local/bin:/root/bin
LOCALBASE=/usr/local
USER=root
LIBEXECPREFIX=/usr/local/libexec/poudriere
POUDRIERE_VERSION=3.2.8-8-gaf08dbda
MASTERMNT=/usr/local/poudriere/data/.m/122powerpc64-quarterly/ref
POUDRIERE_BUILD_TYPE=bulk
PACKAGE_BUILDING=yes
SAVED_TERM=
PWD=/usr/local/poudriere/data/.m/122powerpc64-quarterly/ref/.p/pool
P_PORTS_FEATURES=FLAVORS SELECTED_OPTIONS
MASTERNAME=122powerpc64-quarterly
SCRIPTPREFIX=/usr/local/share/poudriere
OLDPWD=/usr/local/poudriere/data/.m/122powerpc64-quarterly/ref/.p
SCRIPTPATH=/usr/local/share/poudriere/bulk.sh
POUDRIEREPATH=/usr/local/bin/poudriere
---End Environment---

---Begin Poudriere Port Flags/Env---
PORT_FLAGS=
PKGENV=
FLAVOR=
DEPENDS_ARGS=
MAKE_ARGS=
---End Poudriere Port Flags/Env---

---Begin OPTIONS List---
===> The following configuration options are available for xrootd-4.10.0_1:
     KERBEROS5=off: Kerberos 5 support
===> Use 'make config' to modify these settings
---End OPTIONS List---

--MAINTAINER--
yuri_at_FreeBSD.org
--End MAINTAINER--

--CONFIGURE_ARGS--

--End CONFIGURE_ARGS--

--CONFIGURE_ENV--
PKG_CONFIG=pkgconf XDG_DATA_HOME=/wrkdirs/usr/ports/databases/xrootd/work  XDG_CONFIG_HOME=/wrkdirs/usr/ports/databases/xrootd/work  HOME=/wrkdirs/usr/ports/databases/xrootd/work TMPDIR="/tmp" PATH=/wrkdirs/usr/ports/databases/xrootd/work/.bin:/sbin:/bin:/usr/sbin:/usr/bin:/usr/local/sbin:/usr/local/bin:/root/bin SHELL=/bin/sh CONFIG_SHELL=/bin/sh CMAKE_PREFIX_PATH="/usr/local" LANG=en_US.UTF-8 LC_ALL=en_US.UTF-8
--End CONFIGURE_ENV--

--MAKE_ENV--
OPENSSLBASE=/usr OPENSSLDIR=/etc/ssl OPENSSLINC=/usr/include OPENSSLLIB=/usr/lib XDG_DATA_HOME=/wrkdirs/usr/ports/databases/xrootd/work  XDG_CONFIG_HOME=/wrkdirs/usr/ports/databases/xrootd/work  HOME=/wrkdirs/usr/ports/databases/xrootd/work TMPDIR="/tmp" PATH=/wrkdirs/usr/ports/databases/xrootd/work/.bin:/sbin:/bin:/usr/sbin:/usr/bin:/usr/local/sbin:/usr/local/bin:/root/bin NO_PIE=yes MK_DEBUG_FILES=no MK_KERNEL_SYMBOLS=no SHELL=/bin/sh NO_LINT=YES DESTDIR=/wrkdirs/usr/ports/databases/xrootd/work/stage LANG=en_US.UTF-8 LC_ALL=en_US.UTF-8 PREFIX=/usr/local  LOCALBASE=/usr/local  CC="cc" CFLAGS="-O2 -pipe  -fstack-protector-strong -isystem /usr/local/include -fno-strict-aliasing "  CPP="cpp" CPPFLAGS="-I/usr/local/include -isystem /usr/local/include"  LDFLAGS=" -lexecinfo -L/usr/local/lib  -fstack-protector-strong -L/usr/local/lib " LIBS=""  CXX="c++" CXXFLAGS="-O2 -pipe -fstack-protector-strong -isystem /usr/local/include -fno-strict-aliasing  -Ddirent64=dirent -isystem /usr/local/inc
 lude "  MANPREFIX="/usr/local" BSD_INSTALL_PROGRAM="install  -s -m 555"  BSD_INSTALL_LIB="install  -s -m 0644"  BSD_INSTALL_SCRIPT="install  -m 555"  BSD_INSTALL_DATA="install  -m 0644"  BSD_INSTALL_MAN="install  -m 444"
--End MAKE_ENV--

--PLIST_SUB--
KERBEROS5="_at_comment " NO_KERBEROS5="" CMAKE_BUILD_TYPE="release" GTK2_VERSION="2.10.0"  GTK3_VERSION="3.0.0" OSREL=12.2 PREFIX=%D LOCALBASE=/usr/local  RESETPREFIX=/usr/local LIB32DIR=lib DOCSDIR="share/doc/xrootd"  EXAMPLESDIR="share/examples/xrootd"  DATADIR="share/xrootd"  WWWDIR="www/xrootd"  ETCDIR="etc/xrootd"
--End PLIST_SUB--

--SUB_LIST--
KERBEROS5="_at_comment " NO_KERBEROS5="" PREFIX=/usr/local LOCALBASE=/usr/local  DATADIR=/usr/local/share/xrootd DOCSDIR=/usr/local/share/doc/xrootd EXAMPLESDIR=/usr/local/share/examples/xrootd  WWWDIR=/usr/local/www/xrootd ETCDIR=/usr/local/etc/xrootd
--End SUB_LIST--

---Begin make.conf---
USE_PACKAGE_DEPENDS=yes
BATCH=yes
WRKDIRPREFIX=/wrkdirs
PORTSDIR=/usr/ports
PACKAGES=/packages
DISTDIR=/distfiles
PACKAGE_BUILDING=yes
PACKAGE_BUILDING_FLAVORS=yes
#### /usr/local/etc/poudriere.d/make.conf ####
# XXX: We really need this but cannot use it while 'make checksum' does not
# try the next mirror on checksum failure.  It currently retries the same
# failed mirror and then fails rather then trying another.  It *does*
# try the next if the size is mismatched though.
#MASTER_SITE_FREEBSD=yes
# Build ALLOW_MAKE_JOBS_PACKAGES with 2 jobs
MAKE_JOBS_NUMBER=2
#### /usr/ports/Mk/Scripts/ports_env.sh ####
_CCVERSION_921dbbb2=cc (GCC) 4.2.1 20070831 patched [FreeBSD] Copyright (C) 2007 Free Software Foundation, Inc. This is free software; see the source for copying conditions. There is NO warranty; not even for MERCHANTABILITY or FITNESS FOR A PARTICULAR PURPOSE.
_ALTCCVERSION_921dbbb2=none
_CXXINTERNAL_acaad9ca=Using built-in specs. Target: powerpc64-undermydesk-freebsd Configured with: FreeBSD/powerpc64 system compiler Thread model: posix gcc version 4.2.1 20070831 patched [FreeBSD] "/usr/bin/ld" "--eh-frame-hdr" "-Qy" "-melf64ppc_fbsd" "--enable-new-dtags" "-dynamic-linker" "/libexec/ld-elf.so.1" "/usr/lib/crt1.o" "/usr/lib/crti.o" "/usr/lib/crtbegin.o" "-L/usr/lib" "-L/usr/lib" "/dev/null" "-lstdc++" "-lm" "-lgcc_s" "-lgcc" "-lc" "-lgcc_s" "-lgcc" "/usr/lib/crtsavres.o" "/usr/lib/crtend.o" "/usr/lib/crtn.o"
CC_OUTPUT_921dbbb2_58173849=yes
CC_OUTPUT_921dbbb2_9bdba57c=yes
CC_OUTPUT_921dbbb2_6a4fe7f5=cc1: error: unrecognized command line option "-std=c11"
CC_OUTPUT_921dbbb2_6bcac02b=yes
CC_OUTPUT_921dbbb2_67d20829=yes
CC_OUTPUT_921dbbb2_bfa62e83=cc1: error: unrecognized command line option "-std=gnu11"
CC_OUTPUT_921dbbb2_f0b4d593=yes
CC_OUTPUT_921dbbb2_308abb44=cc1plus: error: unrecognized command line option "-std=c++0x"
CC_OUTPUT_921dbbb2_f00456e5=cc1plus: error: unrecognized command line option "-std=c++11"
CC_OUTPUT_921dbbb2_65ad290d=cc1plus: error: unrecognized command line option "-std=c++14"
CC_OUTPUT_921dbbb2_f2776b26=cc1plus: error: unrecognized command line option "-std=c++17"
CC_OUTPUT_921dbbb2_b2657cc3=yes
CC_OUTPUT_921dbbb2_380987f7=cc1plus: error: unrecognized command line option "-std=gnu++11"
CC_OUTPUT_921dbbb2_160933ec=cc1plus: error: unrecognized command line option "-std=gnu++14"
CC_OUTPUT_921dbbb2_fb62803b=cc1plus: error: unrecognized command line option "-std=gnu++17"
_OBJC_CCVERSION_921dbbb2=cc (GCC) 4.2.1 20070831 patched [FreeBSD] Copyright (C) 2007 Free Software Foundation, Inc. This is free software; see the source for copying conditions. There is NO warranty; not even for MERCHANTABILITY or FITNESS FOR A PARTICULAR PURPOSE.
_OBJC_ALTCCVERSION_921dbbb2=none
ARCH=powerpc64
PPC_ABI=ELFv1
OPSYS=FreeBSD
_OSRELEASE=12.2-RELEASE
OSREL=12.2
OSVERSION=1202000
PYTHONBASE=/usr/local
CONFIGURE_MAX_CMD_LEN=524288
HAVE_PORTS_ENV=1
#### Misc Poudriere ####
GID=0
UID=0
---End make.conf---
--Resource limits--
cpu time               (seconds, -t)  unlimited
file size           (512-blocks, -f)  unlimited
data seg size           (kbytes, -d)  33554432
stack size              (kbytes, -s)  524288
core file size      (512-blocks, -c)  unlimited
max memory size         (kbytes, -m)  unlimited
locked memory           (kbytes, -l)  unlimited
max user processes              (-u)  89999
open files                      (-n)  1024
virtual mem size        (kbytes, -v)  unlimited
swap limit              (kbytes, -w)  unlimited
socket buffer size       (bytes, -b)  unlimited
pseudo-terminals                (-p)  unlimited
kqueues                         (-k)  unlimited
umtx shared locks               (-o)  unlimited
--End resource limits--
=======================<phase: check-sanity   >============================
===>  License GPLv3 LGPL3 accepted by the user
===========================================================================
=======================<phase: pkg-depends    >============================
===>   xrootd-4.10.0_1 depends on file: /usr/local/sbin/pkg - not found
===>   Installing existing package /packages/All/pkg-1.16.3.txz
[122powerpc64-quarterly-job-12] Installing pkg-1.16.3...
[122powerpc64-quarterly-job-12] Extracting pkg-1.16.3: .......... done
===>   xrootd-4.10.0_1 depends on file: /usr/local/sbin/pkg - found
===>   Returning to build of xrootd-4.10.0_1
===========================================================================
=======================<phase: fetch-depends  >============================
===========================================================================
=======================<phase: fetch          >============================
===>  License GPLv3 LGPL3 accepted by the user
===> Fetching all distfiles required by xrootd-4.10.0_1 for building
===========================================================================
=======================<phase: checksum       >============================
===>  License GPLv3 LGPL3 accepted by the user
===> Fetching all distfiles required by xrootd-4.10.0_1 for building
=> SHA256 Checksum OK for xrootd-4.10.0.tar.gz.
===========================================================================
=======================<phase: extract-depends>============================
===========================================================================
=======================<phase: extract        >============================
===>  License GPLv3 LGPL3 accepted by the user
===> Fetching all distfiles required by xrootd-4.10.0_1 for building
===>  Extracting for xrootd-4.10.0_1
=> SHA256 Checksum OK for xrootd-4.10.0.tar.gz.
===========================================================================
=======================<phase: patch-depends  >============================
===========================================================================
=======================<phase: patch          >============================
===>  Patching for xrootd-4.10.0_1
===>  Applying FreeBSD patches for xrootd-4.10.0_1 from /usr/ports/databases/xrootd/files
===========================================================================
=======================<phase: build-depends  >============================
===>   xrootd-4.10.0_1 depends on executable: bash - not found
===>   Installing existing package /packages/All/bash-5.1.4_1.txz
[122powerpc64-quarterly-job-12] Installing bash-5.1.4_1...
[122powerpc64-quarterly-job-12] `-- Installing gettext-runtime-0.21...
[122powerpc64-quarterly-job-12] |   `-- Installing indexinfo-0.3.1...
[122powerpc64-quarterly-job-12] |   `-- Extracting indexinfo-0.3.1: .... done
[122powerpc64-quarterly-job-12] `-- Extracting gettext-runtime-0.21: .......... done
[122powerpc64-quarterly-job-12] `-- Installing readline-8.1.0...
[122powerpc64-quarterly-job-12] `-- Extracting readline-8.1.0: .......... done
[122powerpc64-quarterly-job-12] Extracting bash-5.1.4_1: .......... done
===>   xrootd-4.10.0_1 depends on executable: bash - found
===>   Returning to build of xrootd-4.10.0_1
===>   xrootd-4.10.0_1 depends on file: /usr/local/bin/cmake - not found
===>   Installing existing package /packages/All/cmake-3.19.6.txz
[122powerpc64-quarterly-job-12] Installing cmake-3.19.6...
[122powerpc64-quarterly-job-12] `-- Installing curl-7.76.0...
[122powerpc64-quarterly-job-12] |   `-- Installing ca_root_nss-3.63...
<snip>
===========================================================================
=======================<phase: lib-depends    >============================
===>   xrootd-4.10.0_1 depends on shared library: libcurl.so - found (/usr/local/lib/libcurl.so)
===>   xrootd-4.10.0_1 depends on shared library: libxml2.so - not found
===>   Installing existing package /packages/All/libxml2-2.9.10_4.txz
[122powerpc64-quarterly-job-12] Installing libxml2-2.9.10_4...
[122powerpc64-quarterly-job-12] Extracting libxml2-2.9.10_4: .......... done
===>   xrootd-4.10.0_1 depends on shared library: libxml2.so - found (/usr/local/lib/libxml2.so)
===>   Returning to build of xrootd-4.10.0_1
===>   xrootd-4.10.0_1 depends on shared library: libreadline.so.8 - found (/usr/local/lib/libreadline.so.8)
===========================================================================
=======================<phase: configure      >============================
===>  Configuring for xrootd-4.10.0_1
===>  Performing out-of-source build
/bin/mkdir -p /wrkdirs/usr/ports/databases/xrootd/work/.build
CMake Deprecation Warning at CMakeLists.txt:4 (cmake_minimum_required):
  Compatibility with CMake < 2.8.12 will be removed from a future version of
  CMake.

  Update the VERSION argument <min> value or use a ...<max> suffix to tell
  CMake that the project does not need compatibility with older versions.


CMake Deprecation Warning at CMakeLists.txt:7 (CMAKE_POLICY):
  The OLD behavior for policy CMP0022 will be removed from a future version
  of CMake.

  The cmake-policies(7) manual explains that the OLD behaviors of all
  policies are deprecated and that a policy should be set to OLD only under
  specific short-term circumstances.  Projects should be ported to the NEW
  behavior and not rely on setting a policy to OLD.


-- The C compiler identification is GNU 4.2.1
-- The CXX compiler identification is GNU 4.2.1
-- Detecting C compiler ABI info
-- Detecting C compiler ABI info - done
-- Check for working C compiler: /usr/bin/cc - skipped
-- Detecting C compile features
-- Detecting C compile features - done
-- Detecting CXX compiler ABI info
-- Detecting CXX compiler ABI info - done
-- Check for working CXX compiler: /usr/bin/c++ - skipped
-- Detecting CXX compile features
-- Detecting CXX compile features - done
CMake Deprecation Warning at CMakeLists.txt:17 (cmake_policy):
  The OLD behavior for policy CMP0054 will be removed from a future version
  of CMake.

  The cmake-policies(7) manual explains that the OLD behaviors of all
  policies are deprecated and that a policy should be set to OLD only under
  specific short-term circumstances.  Projects should be ported to the NEW
  behavior and not rely on setting a policy to OLD.


-- Looking for setresuid
-- Looking for setresuid - found
-- Looking for strlcpy
-- Looking for strlcpy - found
-- Looking for fstatat
-- Looking for fstatat - found
-- Looking for sigwaitinfo
-- Looking for sigwaitinfo - found
-- Looking for shadow.h
-- Looking for shadow.h - not found
-- Looking for getifaddrs
-- Looking for getifaddrs - found
-- Looking for getnameinfo
-- Looking for getnameinfo - found
-- Looking for getprotobyname_r
-- Looking for getprotobyname_r - found
-- Looking for gethostbyaddr_r
-- Looking for gethostbyaddr_r - found
-- Looking for sendfile
-- Looking for sendfile - found
-- Looking for crypt
-- Looking for crypt - not found
-- Looking for crypt in crypt
-- Looking for crypt in crypt - found
-- Looking for et/com_err.h
-- Looking for et/com_err.h - not found
-- Performing Test HAVE_ATOMICS
-- Performing Test HAVE_ATOMICS - Failed
-- Found ZLIB: /usr/lib/libz.so (found version "1.2.11") 
-- Performing Test READLINE_OK
-- Performing Test READLINE_OK - Failed
CMake Warning (dev) at /usr/local/share/cmake/Modules/FindPackageHandleStandardArgs.cmake:426 (message):
  The package name passed to `find_package_handle_standard_args` (READLINE)
  does not match the name of the calling package (Readline).  This can lead
  to problems in calling code that expects `find_package` result variables
  (e.g., `_FOUND`) to follow a certain pattern.
Call Stack (most recent call first):
  cmake/FindReadline.cmake:58 (find_package_handle_standard_args)
  cmake/XRootDFindLibs.cmake:7 (find_package)
  CMakeLists.txt:30 (include)
This warning is for project developers.  Use -Wno-dev to suppress it.

-- Found READLINE: /usr/local/lib/libreadline.so;/usr/lib/libncurses.so  
-- Found LibXml2: /usr/local/lib/libxml2.so (found version "2.9.10") 
CMake Warning (dev) at /usr/local/share/cmake/Modules/FindPackageHandleStandardArgs.cmake:426 (message):
  The package name passed to `find_package_handle_standard_args` (systemd)
  does not match the name of the calling package (Systemd).  This can lead to
  problems in calling code that expects `find_package` result variables
  (e.g., `_FOUND`) to follow a certain pattern.
Call Stack (most recent call first):
  cmake/FindSystemd.cmake:30 (find_package_handle_standard_args)
  cmake/XRootDFindLibs.cmake:25 (find_package)
  CMakeLists.txt:30 (include)
This warning is for project developers.  Use -Wno-dev to suppress it.

-- Could NOT find systemd (missing: SYSTEMD_INCLUDE_DIRS SYSTEMD_LIBRARIES) 
-- Found CURL: /usr/local/lib/libcurl.so (found version "7.76.0")  
-- Found OpenSSL: /usr/lib/libssl.so;/usr/lib/libcrypto.so  
-- Looking for TLS_method
-- Looking for TLS_method - found
-- Looking for TLS_method
-- Looking for TLS_method - found
-- Looking for TLSv1_2_method
-- Looking for TLSv1_2_method - found
-- Looking for TLSv1_2_method
-- Looking for TLSv1_2_method - found
-- Looking for TLSv1_1_method
-- Looking for TLSv1_1_method - found
-- Looking for TLSv1_1_method
-- Looking for TLSv1_1_method - found
-- Looking for TLSv1_method
-- Looking for TLSv1_method - found
-- Looking for TLSv1_method
-- Looking for TLSv1_method - found
-- Looking for DH_compute_key_padded
-- Looking for DH_compute_key_padded - found
-- Looking for DH_compute_key_padded
-- Looking for DH_compute_key_padded - found
-- Looking for curl_multi_wait
-- Looking for curl_multi_wait - found
-- Could NOT find Macaroons (missing: MACAROONS_INCLUDES MACAROONS_LIB) 
-- Found PkgConfig: pkgconf (found version "1.7.4") 
-- Checking for module 'json-c'
--   Package 'json-c', required by 'virtual:world', not found
-- Checking for module 'uuid'
--   Package 'uuid', required by 'virtual:world', not found
[I] No git repository info found. Trying to interpret VERSION_INFO
-- Performing Test CURL_PIPELINING
-- Performing Test CURL_PIPELINING - Success
-- ----------------------------------------
-- Installation path: /usr/local
-- C Compiler:        /usr/bin/cc
-- C++ Compiler:      /usr/bin/c++
-- Build type:        Release
-- Plug-in version:   4
-- 
-- Readline support:  yes
-- Fuse support:      disabled
-- Crypto support:    yes
-- Kerberos5 support: disabled
-- XrdCl:             yes
-- Tests:             disabled
-- HTTP support:      yes
-- HTTP TPC support:  yes
-- Macaroons support: disabled
-- Python support:    disabled
-- ----------------------------------------
-- Configuring done
-- Generating done
CMake Warning:
  Manually-specified variables were not used by the project:

    CMAKE_COLOR_MAKEFILE
    CMAKE_CXX_FLAGS_DEBUG
    CMAKE_C_FLAGS_DEBUG
    CMAKE_C_FLAGS_RELEASE
    CMAKE_VERBOSE_MAKEFILE
    THREADS_HAVE_PTHREAD_ARG


-- Build files have been written to: /wrkdirs/usr/ports/databases/xrootd/work/.build
===========================================================================
=======================<phase: build          >============================
===>  Building for xrootd-4.10.0_1
[1/552] cd /wrkdirs/usr/ports/databases/xrootd/work/.build && /wrkdirs/usr/ports/databases/xrootd/work/xrootd-4.10.0/genversion.sh /wrkdirs/usr/ports/databases/xrootd/work/xrootd-4.10.0
[I] No git repository info found. Trying to interpret VERSION_INFO
[I] src/XrdVersion.hh successfully generated
[2/552] /usr/bin/c++ -DHAVE_CRYPT -DHAVE_CURL_MULTI_WAIT -DHAVE_DH_PADDED -DHAVE_FSTATAT -DHAVE_GETHBYXR -DHAVE_GETIFADDRS -DHAVE_LIBZ -DHAVE_NAMEINFO -DHAVE_PROTOR -DHAVE_READLINE -DHAVE_SENDFILE -DHAVE_SETRESUID -DHAVE_SIGWTI -DHAVE_SSL -DHAVE_STRLCPY -DHAVE_TLS -DHAVE_TLS1 -DHAVE_TLS11 -DHAVE_TLS12 -DHAVE_XML2 -DHAVE_XRDCRYPTO -DUSE_LIBC_SEMAPHORE=0 -DXRDPLUGIN_SOVERSION=\"4\" -DXrdServer_EXPORTS -D_FILE_OFFSET_BITS=64 -D_LARGEFILE64_SOURCE -D_LARGEFILE_SOURCE -I/wrkdirs/usr/ports/databases/xrootd/work/xrootd-4.10.0/src/.. -I/wrkdirs/usr/ports/databases/xrootd/work/xrootd-4.10.0/src/. -I/wrkdirs/usr/ports/databases/xrootd/work/xrootd-4.10.0/src -Isrc -O2 -pipe -fstack-protector-strong -isystem /usr/local/include -fno-strict-aliasing  -Ddirent64=dirent -isystem /usr/local/include -std=c++0x -DOPENSSL_NO_FILENAMES -std=c++0x -Wall -Wextra -Wno-unused-parameter -O2 -pipe -fstack-protector-strong -isystem /usr/local/include -fno-strict-aliasing  -Ddirent64=dirent -isystem /usr/local/i
 nclude -fPIC -MD -MT src/CMakeFiles/XrdServer.dir/XrdXrootd/XrdXrootdAdmin.cc.o -MF src/CMakeFiles/XrdServer.dir/XrdXrootd/XrdXrootdAdmin.cc.o.d -o src/CMakeFiles/XrdServer.dir/XrdXrootd/XrdXrootdAdmin.cc.o -c /wrkdirs/usr/ports/databases/xrootd/work/xrootd-4.10.0/src/XrdXrootd/XrdXrootdAdmin.cc
FAILED: src/CMakeFiles/XrdServer.dir/XrdXrootd/XrdXrootdAdmin.cc.o 
/usr/bin/c++ -DHAVE_CRYPT -DHAVE_CURL_MULTI_WAIT -DHAVE_DH_PADDED -DHAVE_FSTATAT -DHAVE_GETHBYXR -DHAVE_GETIFADDRS -DHAVE_LIBZ -DHAVE_NAMEINFO -DHAVE_PROTOR -DHAVE_READLINE -DHAVE_SENDFILE -DHAVE_SETRESUID -DHAVE_SIGWTI -DHAVE_SSL -DHAVE_STRLCPY -DHAVE_TLS -DHAVE_TLS1 -DHAVE_TLS11 -DHAVE_TLS12 -DHAVE_XML2 -DHAVE_XRDCRYPTO -DUSE_LIBC_SEMAPHORE=0 -DXRDPLUGIN_SOVERSION=\"4\" -DXrdServer_EXPORTS -D_FILE_OFFSET_BITS=64 -D_LARGEFILE64_SOURCE -D_LARGEFILE_SOURCE -I/wrkdirs/usr/ports/databases/xrootd/work/xrootd-4.10.0/src/.. -I/wrkdirs/usr/ports/databases/xrootd/work/xrootd-4.10.0/src/. -I/wrkdirs/usr/ports/databases/xrootd/work/xrootd-4.10.0/src -Isrc -O2 -pipe -fstack-protector-strong -isystem /usr/local/include -fno-strict-aliasing  -Ddirent64=dirent -isystem /usr/local/include -std=c++0x -DOPENSSL_NO_FILENAMES -std=c++0x -Wall -Wextra -Wno-unused-parameter -O2 -pipe -fstack-protector-strong -isystem /usr/local/include -fno-strict-aliasing  -Ddirent64=dirent -isystem /usr/local/include -
 fPIC -MD -MT src/CMakeFiles/XrdServer.dir/XrdXrootd/XrdXrootdAdmin.cc.o -MF src/CMakeFiles/XrdServer.dir/XrdXrootd/XrdXrootdAdmin.cc.o.d -o src/CMakeFiles/XrdServer.dir/XrdXrootd/XrdXrootdAdmin.cc.o -c /wrkdirs/usr/ports/databases/xrootd/work/xrootd-4.10.0/src/XrdXrootd/XrdXrootdAdmin.cc
cc1plus: error: unrecognized command line option "-std=c++0x"
cc1plus: error: unrecognized command line option "-std=c++0x"
[3/552] /usr/bin/c++ -DHAVE_CRYPT -DHAVE_CURL_MULTI_WAIT -DHAVE_DH_PADDED -DHAVE_FSTATAT -DHAVE_GETHBYXR -DHAVE_GETIFADDRS -DHAVE_LIBZ -DHAVE_NAMEINFO -DHAVE_PROTOR -DHAVE_READLINE -DHAVE_SENDFILE -DHAVE_SETRESUID -DHAVE_SIGWTI -DHAVE_SSL -DHAVE_STRLCPY -DHAVE_TLS -DHAVE_TLS1 -DHAVE_TLS11 -DHAVE_TLS12 -DHAVE_XML2 -DHAVE_XRDCRYPTO -DUSE_LIBC_SEMAPHORE=0 -DXRDPLUGIN_SOVERSION=\"4\" -D_FILE_OFFSET_BITS=64 -D_LARGEFILE64_SOURCE -D_LARGEFILE_SOURCE -I/wrkdirs/usr/ports/databases/xrootd/work/xrootd-4.10.0/src/.. -I/wrkdirs/usr/ports/databases/xrootd/work/xrootd-4.10.0/src/. -I/wrkdirs/usr/ports/databases/xrootd/work/xrootd-4.10.0/src -Isrc -O2 -pipe -fstack-protector-strong -isystem /usr/local/include -fno-strict-aliasing  -Ddirent64=dirent -isystem /usr/local/include -std=c++0x -DOPENSSL_NO_FILENAMES -std=c++0x -Wall -Wextra -Wno-unused-parameter -O2 -pipe -fstack-protector-strong -isystem /usr/local/include -fno-strict-aliasing  -Ddirent64=dirent -isystem /usr/local/include -MD -MT src/C
 MakeFiles/xrdgsitest.dir/XrdSecgsi/XrdSecgsitest.cc.o -MF src/CMakeFiles/xrdgsitest.dir/XrdSecgsi/XrdSecgsitest.cc.o.d -o src/CMakeFiles/xrdgsitest.dir/XrdSecgsi/XrdSecgsitest.cc.o -c /wrkdirs/usr/ports/databases/xrootd/work/xrootd-4.10.0/src/XrdSecgsi/XrdSecgsitest.cc
FAILED: src/CMakeFiles/xrdgsitest.dir/XrdSecgsi/XrdSecgsitest.cc.o 
/usr/bin/c++ -DHAVE_CRYPT -DHAVE_CURL_MULTI_WAIT -DHAVE_DH_PADDED -DHAVE_FSTATAT -DHAVE_GETHBYXR -DHAVE_GETIFADDRS -DHAVE_LIBZ -DHAVE_NAMEINFO -DHAVE_PROTOR -DHAVE_READLINE -DHAVE_SENDFILE -DHAVE_SETRESUID -DHAVE_SIGWTI -DHAVE_SSL -DHAVE_STRLCPY -DHAVE_TLS -DHAVE_TLS1 -DHAVE_TLS11 -DHAVE_TLS12 -DHAVE_XML2 -DHAVE_XRDCRYPTO -DUSE_LIBC_SEMAPHORE=0 -DXRDPLUGIN_SOVERSION=\"4\" -D_FILE_OFFSET_BITS=64 -D_LARGEFILE64_SOURCE -D_LARGEFILE_SOURCE -I/wrkdirs/usr/ports/databases/xrootd/work/xrootd-4.10.0/src/.. -I/wrkdirs/usr/ports/databases/xrootd/work/xrootd-4.10.0/src/. -I/wrkdirs/usr/ports/databases/xrootd/work/xrootd-4.10.0/src -Isrc -O2 -pipe -fstack-protector-strong -isystem /usr/local/include -fno-strict-aliasing  -Ddirent64=dirent -isystem /usr/local/include -std=c++0x -DOPENSSL_NO_FILENAMES -std=c++0x -Wall -Wextra -Wno-unused-parameter -O2 -pipe -fstack-protector-strong -isystem /usr/local/include -fno-strict-aliasing  -Ddirent64=dirent -isystem /usr/local/include -MD -MT src/CMakeFile
 s/xrdgsitest.dir/XrdSecgsi/XrdSecgsitest.cc.o -MF src/CMakeFiles/xrdgsitest.dir/XrdSecgsi/XrdSecgsitest.cc.o.d -o src/CMakeFiles/xrdgsitest.dir/XrdSecgsi/XrdSecgsitest.cc.o -c /wrkdirs/usr/ports/databases/xrootd/work/xrootd-4.10.0/src/XrdSecgsi/XrdSecgsitest.cc
cc1plus: error: unrecognized command line option "-std=c++0x"
cc1plus: error: unrecognized command line option "-std=c++0x"
ninja: build stopped: subcommand failed.
===> Compilation failed unexpectedly.
Try to set MAKE_JOBS_UNSAFE=yes and rebuild before reporting the failure to
the maintainer.
*** Error code 1

Stop.
make: stopped in /usr/ports/databases/xrootd
Received on Tue Jun 29 2021 - 04:03:43 UTC

Original text of this message