[package - 122powerpc64-quarterly][science/dakota] Failed for dakota-6.13.0_2 in build

From: <pkg-fallout_at_FreeBSD.org>
Date: Tue, 29 Jun 2021 03:24:13 GMT
You are receiving this mail as a port that you maintain
is failing to build on the FreeBSD package build server.
Please investigate the failure and submit a PR to fix
build.

Maintainer:     yuri_at_FreeBSD.org
Log URL:        http://foul1.nyi.freebsd.org/data/122powerpc64-quarterly/ae162bd98935/logs/dakota-6.13.0_2.log
Build URL:      http://foul1.nyi.freebsd.org/build.html?mastername=122powerpc64-quarterly&build=ae162bd98935
Log:

=>> Building science/dakota
build started at Tue Jun 29 03:19:00 UTC 2021
port directory: /usr/ports/science/dakota
package name: dakota-6.13.0_2
building for: FreeBSD 122powerpc64-quarterly-job-07 12.2-RELEASE FreeBSD 12.2-RELEASE powerpc
maintained by: yuri_at_FreeBSD.org
Makefile ident: 
Poudriere version: 3.2.8-8-gaf08dbda
Host OSVERSION: 1400008
Jail OSVERSION: 1202000
Job Id: 07

---Begin Environment---
SHELL=/bin/csh
OSVERSION=1202000
UNAME_v=FreeBSD 12.2-RELEASE
UNAME_r=12.2-RELEASE
BLOCKSIZE=K
MAIL=/var/mail/root
STATUS=1
HOME=/root
PATH=/sbin:/bin:/usr/sbin:/usr/bin:/usr/local/sbin:/usr/local/bin:/root/bin
LOCALBASE=/usr/local
USER=root
LIBEXECPREFIX=/usr/local/libexec/poudriere
POUDRIERE_VERSION=3.2.8-8-gaf08dbda
MASTERMNT=/usr/local/poudriere/data/.m/122powerpc64-quarterly/ref
POUDRIERE_BUILD_TYPE=bulk
PACKAGE_BUILDING=yes
SAVED_TERM=
PWD=/usr/local/poudriere/data/.m/122powerpc64-quarterly/ref/.p/pool
P_PORTS_FEATURES=FLAVORS SELECTED_OPTIONS
MASTERNAME=122powerpc64-quarterly
SCRIPTPREFIX=/usr/local/share/poudriere
OLDPWD=/usr/local/poudriere/data/.m/122powerpc64-quarterly/ref/.p
SCRIPTPATH=/usr/local/share/poudriere/bulk.sh
POUDRIEREPATH=/usr/local/bin/poudriere
---End Environment---

---Begin Poudriere Port Flags/Env---
PORT_FLAGS=
PKGENV=
FLAVOR=
DEPENDS_ARGS=
MAKE_ARGS=
---End Poudriere Port Flags/Env---

---Begin OPTIONS List---
===> The following configuration options are available for dakota-6.13.0_2:
     GSL=on: GSL support
     GUI=off: Build the Dakota/Motif Graphics package
     HDF5=on: HDF-5 data format support
===> Use 'make config' to modify these settings
---End OPTIONS List---

--MAINTAINER--
yuri_at_FreeBSD.org
--End MAINTAINER--

--CONFIGURE_ARGS--

--End CONFIGURE_ARGS--

--CONFIGURE_ENV--
F77="gfortran10" FC="gfortran10" FFLAGS="-O -fallow-argument-mismatch -Wl,-rpath=/usr/local/lib/gcc10" FCFLAGS="-Wl,-rpath=/usr/local/lib/gcc10" ac_cv_path_PERL=/usr/local/bin/perl ac_cv_path_PERL_PATH=/usr/local/bin/perl  PERL_USE_UNSAFE_INC=1 PYTHON="/usr/local/bin/python3.7" XDG_DATA_HOME=/wrkdirs/usr/ports/science/dakota/work  XDG_CONFIG_HOME=/wrkdirs/usr/ports/science/dakota/work  HOME=/wrkdirs/usr/ports/science/dakota/work TMPDIR="/tmp" PATH=/wrkdirs/usr/ports/science/dakota/work/.bin:/sbin:/bin:/usr/sbin:/usr/bin:/usr/local/sbin:/usr/local/bin:/root/bin SHELL=/bin/sh CONFIG_SHELL=/bin/sh
--End CONFIGURE_ENV--

--MAKE_ENV--
F77="gfortran10" FC="gfortran10" FFLAGS="-O -fallow-argument-mismatch -Wl,-rpath=/usr/local/lib/gcc10" FCFLAGS="-Wl,-rpath=/usr/local/lib/gcc10" PERL_USE_UNSAFE_INC=1 XDG_DATA_HOME=/wrkdirs/usr/ports/science/dakota/work  XDG_CONFIG_HOME=/wrkdirs/usr/ports/science/dakota/work  HOME=/wrkdirs/usr/ports/science/dakota/work TMPDIR="/tmp" PATH=/wrkdirs/usr/ports/science/dakota/work/.bin:/sbin:/bin:/usr/sbin:/usr/bin:/usr/local/sbin:/usr/local/bin:/root/bin NO_PIE=yes MK_DEBUG_FILES=no MK_KERNEL_SYMBOLS=no SHELL=/bin/sh NO_LINT=YES ADDR2LINE="/usr/local/bin/addr2line" AR="/usr/local/bin/ar" AS="/usr/local/bin/as" CPPFILT="/usr/local/bin/c++filt" GPROF="/usr/local/bin/gprof" LD="/usr/local/bin/ld" NM="/usr/local/bin/nm" OBJCOPY="/usr/local/bin/objcopy" OBJDUMP="/usr/local/bin/objdump" RANLIB="/usr/local/bin/ranlib" READELF="/usr/local/bin/readelf" SIZE="/usr/local/bin/size" STRINGS="/usr/local/bin/strings" PREFIX=/usr/local  LOCALBASE=/usr/local  CC="gcc10" CFLAGS="-O2 -pipe  -fstack-protect
 or-strong -Wl,-rpath=/usr/local/lib/gcc10 -fno-strict-aliasing "  CPP="cpp10" CPPFLAGS=""  LDFLAGS=" -lexecinfo -Wl,-rpath=/usr/local/lib/gcc10  -L/usr/local/lib/gcc10 -B/usr/local/bin -fstack-protector-strong -Wl,-rpath=/usr/local/lib/gcc10 -L/usr/local/lib/gcc10 " LIBS=""  CXX="g++10" CXXFLAGS="-O2 -pipe  -fstack-protector-strong -Wl,-rpath=/usr/local/lib/gcc10  -Wl,-rpath=/usr/local/lib/gcc10 "  MANPREFIX="/usr/local" BSD_INSTALL_PROGRAM="install  -s -m 555"  BSD_INSTALL_LIB="install  -s -m 0644"  BSD_INSTALL_SCRIPT="install  -m 555"  BSD_INSTALL_DATA="install  -m 0644"  BSD_INSTALL_MAN="install  -m 444"
--End MAKE_ENV--

--PLIST_SUB--
GSL="" NO_GSL="_at_comment " GUI="_at_comment " NO_GUI="" HDF5="" NO_HDF5="_at_comment " CMAKE_BUILD_TYPE="release" PYTHON_INCLUDEDIR=include/python3.7m  PYTHON_LIBDIR=lib/python3.7  PYTHON_PLATFORM=freebsd12  PYTHON_SITELIBDIR=lib/python3.7/site-packages  PYTHON_SUFFIX=37  PYTHON_EXT_SUFFIX=  PYTHON_VER=3.7  PYTHON_VERSION=python3.7 PYTHON2="_at_comment " PYTHON3="" OSREL=12.2 PREFIX=%D LOCALBASE=/usr/local  RESETPREFIX=/usr/local LIB32DIR=lib PERL_VERSION=5.32.1  PERL_VER=5.32  PERL5_MAN1=lib/perl5/site_perl/man/man1  PERL5_MAN3=lib/perl5/site_perl/man/man3  SITE_PERL=lib/perl5/site_perl  SITE_ARCH=lib/perl5/site_perl/mach/5.32 DOCSDIR="share/doc/dakota"  EXAMPLESDIR="share/examples/dakota"  DATADIR="share/dakota"  WWWDIR="www/dakota"  ETCDIR="etc/dakota"
--End PLIST_SUB--

--SUB_LIST--
GSL="" NO_GSL="_at_comment " GUI="_at_comment " NO_GUI="" HDF5="" NO_HDF5="_at_comment " PREFIX=/usr/local LOCALBASE=/usr/local  DATADIR=/usr/local/share/dakota DOCSDIR=/usr/local/share/doc/dakota EXAMPLESDIR=/usr/local/share/examples/dakota  WWWDIR=/usr/local/www/dakota ETCDIR=/usr/local/etc/dakota
--End SUB_LIST--

---Begin make.conf---
USE_PACKAGE_DEPENDS=yes
BATCH=yes
WRKDIRPREFIX=/wrkdirs
PORTSDIR=/usr/ports
PACKAGES=/packages
DISTDIR=/distfiles
PACKAGE_BUILDING=yes
PACKAGE_BUILDING_FLAVORS=yes
#### /usr/local/etc/poudriere.d/make.conf ####
# XXX: We really need this but cannot use it while 'make checksum' does not
# try the next mirror on checksum failure.  It currently retries the same
# failed mirror and then fails rather then trying another.  It *does*
# try the next if the size is mismatched though.
#MASTER_SITE_FREEBSD=yes
# Build ALLOW_MAKE_JOBS_PACKAGES with 2 jobs
MAKE_JOBS_NUMBER=2
#### /usr/ports/Mk/Scripts/ports_env.sh ####
_CCVERSION_921dbbb2=cc (GCC) 4.2.1 20070831 patched [FreeBSD] Copyright (C) 2007 Free Software Foundation, Inc. This is free software; see the source for copying conditions. There is NO warranty; not even for MERCHANTABILITY or FITNESS FOR A PARTICULAR PURPOSE.
_ALTCCVERSION_921dbbb2=none
_CXXINTERNAL_acaad9ca=Using built-in specs. Target: powerpc64-undermydesk-freebsd Configured with: FreeBSD/powerpc64 system compiler Thread model: posix gcc version 4.2.1 20070831 patched [FreeBSD] "/usr/bin/ld" "--eh-frame-hdr" "-Qy" "-melf64ppc_fbsd" "--enable-new-dtags" "-dynamic-linker" "/libexec/ld-elf.so.1" "/usr/lib/crt1.o" "/usr/lib/crti.o" "/usr/lib/crtbegin.o" "-L/usr/lib" "-L/usr/lib" "/dev/null" "-lstdc++" "-lm" "-lgcc_s" "-lgcc" "-lc" "-lgcc_s" "-lgcc" "/usr/lib/crtsavres.o" "/usr/lib/crtend.o" "/usr/lib/crtn.o"
CC_OUTPUT_921dbbb2_58173849=yes
CC_OUTPUT_921dbbb2_9bdba57c=yes
CC_OUTPUT_921dbbb2_6a4fe7f5=cc1: error: unrecognized command line option "-std=c11"
CC_OUTPUT_921dbbb2_6bcac02b=yes
CC_OUTPUT_921dbbb2_67d20829=yes
CC_OUTPUT_921dbbb2_bfa62e83=cc1: error: unrecognized command line option "-std=gnu11"
CC_OUTPUT_921dbbb2_f0b4d593=yes
CC_OUTPUT_921dbbb2_308abb44=cc1plus: error: unrecognized command line option "-std=c++0x"
CC_OUTPUT_921dbbb2_f00456e5=cc1plus: error: unrecognized command line option "-std=c++11"
CC_OUTPUT_921dbbb2_65ad290d=cc1plus: error: unrecognized command line option "-std=c++14"
CC_OUTPUT_921dbbb2_f2776b26=cc1plus: error: unrecognized command line option "-std=c++17"
CC_OUTPUT_921dbbb2_b2657cc3=yes
CC_OUTPUT_921dbbb2_380987f7=cc1plus: error: unrecognized command line option "-std=gnu++11"
CC_OUTPUT_921dbbb2_160933ec=cc1plus: error: unrecognized command line option "-std=gnu++14"
CC_OUTPUT_921dbbb2_fb62803b=cc1plus: error: unrecognized command line option "-std=gnu++17"
_OBJC_CCVERSION_921dbbb2=cc (GCC) 4.2.1 20070831 patched [FreeBSD] Copyright (C) 2007 Free Software Foundation, Inc. This is free software; see the source for copying conditions. There is NO warranty; not even for MERCHANTABILITY or FITNESS FOR A PARTICULAR PURPOSE.
_OBJC_ALTCCVERSION_921dbbb2=none
ARCH=powerpc64
PPC_ABI=ELFv1
OPSYS=FreeBSD
_OSRELEASE=12.2-RELEASE
OSREL=12.2
OSVERSION=1202000
PYTHONBASE=/usr/local
CONFIGURE_MAX_CMD_LEN=524288
HAVE_PORTS_ENV=1
#### Misc Poudriere ####
GID=0
UID=0
---End make.conf---
--Resource limits--
cpu time               (seconds, -t)  unlimited
file size           (512-blocks, -f)  unlimited
data seg size           (kbytes, -d)  33554432
stack size              (kbytes, -s)  524288
core file size      (512-blocks, -c)  unlimited
max memory size         (kbytes, -m)  unlimited
locked memory           (kbytes, -l)  unlimited
max user processes              (-u)  89999
open files                      (-n)  1024
virtual mem size        (kbytes, -v)  unlimited
swap limit              (kbytes, -w)  unlimited
socket buffer size       (bytes, -b)  unlimited
pseudo-terminals                (-p)  unlimited
kqueues                         (-k)  unlimited
umtx shared locks               (-o)  unlimited
--End resource limits--
=======================<phase: check-sanity   >============================
===>  License LGPL21 accepted by the user
===========================================================================
=======================<phase: pkg-depends    >============================
===>   dakota-6.13.0_2 depends on file: /usr/local/sbin/pkg - not found
===>   Installing existing package /packages/All/pkg-1.16.3.txz
[122powerpc64-quarterly-job-07] Installing pkg-1.16.3...
[122powerpc64-quarterly-job-07] Extracting pkg-1.16.3: .......... done
===>   dakota-6.13.0_2 depends on file: /usr/local/sbin/pkg - found
===>   Returning to build of dakota-6.13.0_2
===========================================================================
=======================<phase: fetch-depends  >============================
===========================================================================
=======================<phase: fetch          >============================
===>  License LGPL21 accepted by the user
===> Fetching all distfiles required by dakota-6.13.0_2 for building
===========================================================================
=======================<phase: checksum       >============================
===>  License LGPL21 accepted by the user
===> Fetching all distfiles required by dakota-6.13.0_2 for building
=> SHA256 Checksum OK for dakota-6.13.0-release-public.src-UI.tar.gz.
===========================================================================
=======================<phase: extract-depends>============================
===========================================================================
=======================<phase: extract        >============================
===>  License LGPL21 accepted by the user
===> Fetching all distfiles required by dakota-6.13.0_2 for building
===>  Extracting for dakota-6.13.0_2
=> SHA256 Checksum OK for dakota-6.13.0-release-public.src-UI.tar.gz.
===========================================================================
=======================<phase: patch-depends  >============================
===========================================================================
=======================<phase: patch          >============================
===>  Patching for dakota-6.13.0_2
===>  Applying FreeBSD patches for dakota-6.13.0_2 from /usr/ports/science/dakota/files
===========================================================================
=======================<phase: build-depends  >============================
===>   dakota-6.13.0_2 depends on file: /usr/local/bin/cmake - not found
===>   Installing existing package /packages/All/cmake-3.19.6.txz
[122powerpc64-quarterly-job-07] Installing cmake-3.19.6...
[122powerpc64-quarterly-job-07] `-- Installing curl-7.76.0...
[122powerpc64-quarterly-job-07] |   `-- Installing ca_root_nss-3.63...
[122powerpc64-quarterly-job-07] |   `-- Extracting ca_root_nss-3.63: ........ done
[122powerpc64-quarterly-job-07] |   `-- Installing libnghttp2-1.43.0...
[122powerpc64-quarterly-job-07] |   | `-- Installing gcc10-10.2.0_1...
[122powerpc64-quarterly-job-07] |   |   `-- Installing binutils-2.33.1_4,1...
[122powerpc64-quarterly-job-07] |   |   | `-- Installing gettext-runtime-0.21...
[122powerpc64-quarterly-job-07] |   |   |   `-- Installing indexinfo-0.3.1...
[122powerpc64-quarterly-job-07] |   |   |   `-- Extracting indexinfo-0.3.1: .... done
[122powerpc64-quarterly-job-07] |   |   | `-- Extracting gettext-runtime-0.21: .......... done
[122powerpc64-quarterly-job-07] |   |   `-- Extracting binutils-2.33.1_4,1: .......... done
[122powerpc64-quarterly-job-07] |   |   `-- Installing gcc9-9.3.0_3...
<snip>
 1702 | 140   S(I)=S1
      |                                                                        1
Warning: Fortran 2018 deleted feature: DO termination statement which is not END DO or CONTINUE with label 140 at (1)
/wrkdirs/usr/ports/science/dakota/work/dakota-6.13.0-release-public.src-UI/packages/external/CONMIN/src/conmin.f:1706:72:

 1706 | 150   S(NDV1)=S(NDV1)-A(NDV1,J)*C(J)
      |                                                                        1
Warning: Fortran 2018 deleted feature: DO termination statement which is not END DO or CONTINUE with label 150 at (1)
/wrkdirs/usr/ports/science/dakota/work/dakota-6.13.0-release-public.src-UI/packages/external/CONMIN/src/conmin.f:1715:72:

 1715 | 172   SG=SG+S(I)*A(I,J)
      |                                                                        1
Warning: Fortran 2018 deleted feature: DO termination statement which is not END DO or CONTINUE with label 172 at (1)
/wrkdirs/usr/ports/science/dakota/work/dakota-6.13.0-release-public.src-UI/packages/external/CONMIN/src/conmin.f:1748:72:

 1748 | 170   S(I)=S1*S(I)
      |                                                                        1
Warning: Fortran 2018 deleted feature: DO termination statement which is not END DO or CONTINUE with label 170 at (1)
/wrkdirs/usr/ports/science/dakota/work/dakota-6.13.0-release-public.src-UI/packages/external/CONMIN/src/conmin.f:1892:72:

 1892 | 110   G(I)=SCAL(I)*X(I)
      |                                                                        1
Warning: Fortran 2018 deleted feature: DO termination statement which is not END DO or CONTINUE with label 110 at (1)
/wrkdirs/usr/ports/science/dakota/work/dakota-6.13.0-release-public.src-UI/packages/external/CONMIN/src/conmin.f:2046:72:

 2046 | 280   G(I)=SCAL(I)*X(I)
      |                                                                        1
Warning: Fortran 2018 deleted feature: DO termination statement which is not END DO or CONTINUE with label 280 at (1)
/wrkdirs/usr/ports/science/dakota/work/dakota-6.13.0-release-public.src-UI/packages/external/CONMIN/src/conmin.f:2208:72:

 2208 | 490   G(I)=SCAL(I)*X(I)
      |                                                                        1
Warning: Fortran 2018 deleted feature: DO termination statement which is not END DO or CONTINUE with label 490 at (1)
/wrkdirs/usr/ports/science/dakota/work/dakota-6.13.0-release-public.src-UI/packages/external/CONMIN/src/conmin.f:2433:72:

 2433 | 10    MS1(I)=0
      |                                                                        1
Warning: Fortran 2018 deleted feature: DO termination statement which is not END DO or CONTINUE with label 10 at (1)
/wrkdirs/usr/ports/science/dakota/work/dakota-6.13.0-release-public.src-UI/packages/external/CONMIN/src/conmin.f:2484:72:

 2484 | 40    B(ICHK,J)=BB*B(ICHK,J)
      |                                                                        1
Warning: Fortran 2018 deleted feature: DO termination statement which is not END DO or CONTINUE with label 40 at (1)
/wrkdirs/usr/ports/science/dakota/work/dakota-6.13.0-release-public.src-UI/packages/external/CONMIN/src/conmin.f:2494:72:

 2494 | 50    B(I,J)=B(I,J)-BB1*B(ICHK,J)
      |                                                                        1
Warning: Fortran 2018 deleted feature: DO termination statement which is not END DO or CONTINUE with label 50 at (1)
--- packages/CMakeFiles/MUQ.dir/all ---
[ 10%] Building CXX object CMakeFiles/muqUtilities.dir/modules/Utilities/src/StringUtilities.cpp.o
[ 11%] Building CXX object CMakeFiles/muqUtilities.dir/modules/Utilities/src/MultiIndices/MultiIndex.cpp.o
--- packages/external/CONMIN/src/CMakeFiles/conmin.dir/all ---
--- packages/external/CONMIN/src/libconmin.so ---
[  1%] Linking Fortran shared library libconmin.so
cd /wrkdirs/usr/ports/science/dakota/work/.build/packages/external/CONMIN/src && /usr/local/bin/cmake -E cmake_link_script CMakeFiles/conmin.dir/link.txt --verbose=1
/usr/local/bin/gfortran10 -fPIC -O -fallow-argument-mismatch -Wl,-rpath=/usr/local/lib/gcc10 -O3 -DNDEBUG -O3  -lexecinfo -Wl,-rpath=/usr/local/lib/gcc10  -L/usr/local/lib/gcc10 -B/usr/local/bin -fstack-protector-strong -Wl,-rpath=/usr/local/lib/gcc10 -L/usr/local/lib/gcc10 -shared -Wl,-soname,libconmin.so -o libconmin.so CMakeFiles/conmin.dir/conmin.f.o  -Wl,-rpath,::::::::::::::::::::::::::::::::::::: 
[  1%] Built target conmin
--- packages/external/NCSUOpt/CMakeFiles/ncsuopt.dir/all ---
/usr/bin/make  -f packages/external/NCSUOpt/CMakeFiles/ncsuopt.dir/build.make packages/external/NCSUOpt/CMakeFiles/ncsuopt.dir/depend
--- packages/external/NCSUOpt/CMakeFiles/ncsuopt.dir/depend ---
cd /wrkdirs/usr/ports/science/dakota/work/.build && /usr/local/bin/cmake -E cmake_depends "Unix Makefiles" /wrkdirs/usr/ports/science/dakota/work/dakota-6.13.0-release-public.src-UI /wrkdirs/usr/ports/science/dakota/work/dakota-6.13.0-release-public.src-UI/packages/external/NCSUOpt /wrkdirs/usr/ports/science/dakota/work/.build /wrkdirs/usr/ports/science/dakota/work/.build/packages/external/NCSUOpt /wrkdirs/usr/ports/science/dakota/work/.build/packages/external/NCSUOpt/CMakeFiles/ncsuopt.dir/DependInfo.cmake
Scanning dependencies of target ncsuopt
/usr/bin/make  -f packages/external/NCSUOpt/CMakeFiles/ncsuopt.dir/build.make packages/external/NCSUOpt/CMakeFiles/ncsuopt.dir/build
--- packages/external/NCSUOpt/CMakeFiles/ncsuopt.dir/DIRect.f.o ---
[  1%] Building Fortran object packages/external/NCSUOpt/CMakeFiles/ncsuopt.dir/DIRect.f.o
cd /wrkdirs/usr/ports/science/dakota/work/.build/packages/external/NCSUOpt && /usr/local/bin/gfortran10 -DHAVE_CONFIG_H -DHAVE_DAKOTA_SURROGATES -Dncsuopt_EXPORTS  -O -fallow-argument-mismatch -Wl,-rpath=/usr/local/lib/gcc10 -O3 -DNDEBUG -O3 -fPIC -c /wrkdirs/usr/ports/science/dakota/work/dakota-6.13.0-release-public.src-UI/packages/external/NCSUOpt/DIRect.f -o CMakeFiles/ncsuopt.dir/DIRect.f.o
--- packages/external/NCSUOpt/CMakeFiles/ncsuopt.dir/DIRbatch.f.o ---
[  1%] Building Fortran object packages/external/NCSUOpt/CMakeFiles/ncsuopt.dir/DIRbatch.f.o
cd /wrkdirs/usr/ports/science/dakota/work/.build/packages/external/NCSUOpt && /usr/local/bin/gfortran10 -DHAVE_CONFIG_H -DHAVE_DAKOTA_SURROGATES -Dncsuopt_EXPORTS  -O -fallow-argument-mismatch -Wl,-rpath=/usr/local/lib/gcc10 -O3 -DNDEBUG -O3 -fPIC -c /wrkdirs/usr/ports/science/dakota/work/dakota-6.13.0-release-public.src-UI/packages/external/NCSUOpt/DIRbatch.f -o CMakeFiles/ncsuopt.dir/DIRbatch.f.o
--- packages/external/NCSUOpt/CMakeFiles/ncsuopt.dir/DIRsubrout.f.o ---
[  1%] Building Fortran object packages/external/NCSUOpt/CMakeFiles/ncsuopt.dir/DIRsubrout.f.o
cd /wrkdirs/usr/ports/science/dakota/work/.build/packages/external/NCSUOpt && /usr/local/bin/gfortran10 -DHAVE_CONFIG_H -DHAVE_DAKOTA_SURROGATES -Dncsuopt_EXPORTS  -O -fallow-argument-mismatch -Wl,-rpath=/usr/local/lib/gcc10 -O3 -DNDEBUG -O3 -fPIC -c /wrkdirs/usr/ports/science/dakota/work/dakota-6.13.0-release-public.src-UI/packages/external/NCSUOpt/DIRsubrout.f -o CMakeFiles/ncsuopt.dir/DIRsubrout.f.o
--- packages/CMakeFiles/MUQ.dir/all ---
[ 12%] Building CXX object CMakeFiles/muqUtilities.dir/modules/Utilities/src/MultiIndices/MultiIndexLimiter.cpp.o
--- packages/external/NCSUOpt/CMakeFiles/ncsuopt.dir/all ---
--- packages/external/NCSUOpt/libncsuopt.so ---
[  2%] Linking Fortran shared library libncsuopt.so
cd /wrkdirs/usr/ports/science/dakota/work/.build/packages/external/NCSUOpt && /usr/local/bin/cmake -E cmake_link_script CMakeFiles/ncsuopt.dir/link.txt --verbose=1
/usr/local/bin/gfortran10 -fPIC -O -fallow-argument-mismatch -Wl,-rpath=/usr/local/lib/gcc10 -O3 -DNDEBUG -O3  -lexecinfo -Wl,-rpath=/usr/local/lib/gcc10  -L/usr/local/lib/gcc10 -B/usr/local/bin -fstack-protector-strong -Wl,-rpath=/usr/local/lib/gcc10 -L/usr/local/lib/gcc10 -shared -Wl,-soname,libncsuopt.so -o libncsuopt.so CMakeFiles/ncsuopt.dir/DIRect.f.o CMakeFiles/ncsuopt.dir/DIRbatch.f.o CMakeFiles/ncsuopt.dir/DIRsubrout.f.o  -Wl,-rpath,::::::::::::::::::::::::::::::::::::: 
[  2%] Built target ncsuopt
--- packages/external/nidr/CMakeFiles/nidr.dir/all ---
/usr/bin/make  -f packages/external/nidr/CMakeFiles/nidr.dir/build.make packages/external/nidr/CMakeFiles/nidr.dir/depend
--- packages/external/nidr/CMakeFiles/nidr.dir/depend ---
cd /wrkdirs/usr/ports/science/dakota/work/.build && /usr/local/bin/cmake -E cmake_depends "Unix Makefiles" /wrkdirs/usr/ports/science/dakota/work/dakota-6.13.0-release-public.src-UI /wrkdirs/usr/ports/science/dakota/work/dakota-6.13.0-release-public.src-UI/packages/external/nidr /wrkdirs/usr/ports/science/dakota/work/.build /wrkdirs/usr/ports/science/dakota/work/.build/packages/external/nidr /wrkdirs/usr/ports/science/dakota/work/.build/packages/external/nidr/CMakeFiles/nidr.dir/DependInfo.cmake
Scanning dependencies of target nidr
/usr/bin/make  -f packages/external/nidr/CMakeFiles/nidr.dir/build.make packages/external/nidr/CMakeFiles/nidr.dir/build
--- packages/external/nidr/CMakeFiles/nidr.dir/nidr-scanner.c.o ---
[  2%] Building C object packages/external/nidr/CMakeFiles/nidr.dir/nidr-scanner.c.o
cd /wrkdirs/usr/ports/science/dakota/work/.build/packages/external/nidr && /usr/local/bin/gcc10 -DHAVE_CONFIG_H -DHAVE_DAKOTA_SURROGATES -DNO_NIDR_DYNLIB -Dnidr_EXPORTS -I/wrkdirs/usr/ports/science/dakota/work/dakota-6.13.0-release-public.src-UI/packages/external/nidr -I/wrkdirs/usr/ports/science/dakota/work/.build/packages/external/nidr -O2 -pipe  -fstack-protector-strong -Wl,-rpath=/usr/local/lib/gcc10 -fno-strict-aliasing -O2 -pipe  -fstack-protector-strong -Wl,-rpath=/usr/local/lib/gcc10 -fno-strict-aliasing -fPIC -o CMakeFiles/nidr.dir/nidr-scanner.c.o -c /wrkdirs/usr/ports/science/dakota/work/dakota-6.13.0-release-public.src-UI/packages/external/nidr/nidr-scanner.c
/wrkdirs/usr/ports/science/dakota/work/dakota-6.13.0-release-public.src-UI/packages/external/nidr/nidr-scanner.c: In function 'nidr_init_buffer':
/wrkdirs/usr/ports/science/dakota/work/dakota-6.13.0-release-public.src-UI/packages/external/nidr/nidr-scanner.c:1673:35: warning: implicit declaration of function 'isatty' [-Wimplicit-function-declaration]
 1673 |  b->nidr_is_interactive = file ? (isatty( fileno(file) ) > 0) : 0;
      |                                   ^~~~~~
--- packages/external/nidr/CMakeFiles/nidr.dir/nidr-parser.c.o ---
[  2%] Building C object packages/external/nidr/CMakeFiles/nidr.dir/nidr-parser.c.o
cd /wrkdirs/usr/ports/science/dakota/work/.build/packages/external/nidr && /usr/local/bin/gcc10 -DHAVE_CONFIG_H -DHAVE_DAKOTA_SURROGATES -DNO_NIDR_DYNLIB -Dnidr_EXPORTS -I/wrkdirs/usr/ports/science/dakota/work/dakota-6.13.0-release-public.src-UI/packages/external/nidr -I/wrkdirs/usr/ports/science/dakota/work/.build/packages/external/nidr -O2 -pipe  -fstack-protector-strong -Wl,-rpath=/usr/local/lib/gcc10 -fno-strict-aliasing -O2 -pipe  -fstack-protector-strong -Wl,-rpath=/usr/local/lib/gcc10 -fno-strict-aliasing -fPIC -o CMakeFiles/nidr.dir/nidr-parser.c.o -c /wrkdirs/usr/ports/science/dakota/work/dakota-6.13.0-release-public.src-UI/packages/external/nidr/nidr-parser.c
--- packages/CMakeFiles/MUQ.dir/all ---
[ 13%] Building CXX object CMakeFiles/muqUtilities.dir/modules/Utilities/src/MultiIndices/MultiIndexSet.cpp.o
--- packages/external/nidr/CMakeFiles/nidr.dir/all ---
--- packages/external/nidr/CMakeFiles/nidr.dir/avltree.c.o ---
[  2%] Building C object packages/external/nidr/CMakeFiles/nidr.dir/avltree.c.o
cd /wrkdirs/usr/ports/science/dakota/work/.build/packages/external/nidr && /usr/local/bin/gcc10 -DHAVE_CONFIG_H -DHAVE_DAKOTA_SURROGATES -DNO_NIDR_DYNLIB -Dnidr_EXPORTS -I/wrkdirs/usr/ports/science/dakota/work/dakota-6.13.0-release-public.src-UI/packages/external/nidr -I/wrkdirs/usr/ports/science/dakota/work/.build/packages/external/nidr -O2 -pipe  -fstack-protector-strong -Wl,-rpath=/usr/local/lib/gcc10 -fno-strict-aliasing -O2 -pipe  -fstack-protector-strong -Wl,-rpath=/usr/local/lib/gcc10 -fno-strict-aliasing -fPIC -o CMakeFiles/nidr.dir/avltree.c.o -c /wrkdirs/usr/ports/science/dakota/work/dakota-6.13.0-release-public.src-UI/packages/external/nidr/avltree.c
--- packages/external/nidr/CMakeFiles/nidr.dir/nidr.c.o ---
[  2%] Building C object packages/external/nidr/CMakeFiles/nidr.dir/nidr.c.o
cd /wrkdirs/usr/ports/science/dakota/work/.build/packages/external/nidr && /usr/local/bin/gcc10 -DHAVE_CONFIG_H -DHAVE_DAKOTA_SURROGATES -DNO_NIDR_DYNLIB -Dnidr_EXPORTS -I/wrkdirs/usr/ports/science/dakota/work/dakota-6.13.0-release-public.src-UI/packages/external/nidr -I/wrkdirs/usr/ports/science/dakota/work/.build/packages/external/nidr -O2 -pipe  -fstack-protector-strong -Wl,-rpath=/usr/local/lib/gcc10 -fno-strict-aliasing -O2 -pipe  -fstack-protector-strong -Wl,-rpath=/usr/local/lib/gcc10 -fno-strict-aliasing -fPIC -o CMakeFiles/nidr.dir/nidr.c.o -c /wrkdirs/usr/ports/science/dakota/work/dakota-6.13.0-release-public.src-UI/packages/external/nidr/nidr.c
--- packages/external/nidr/libnidr.so ---
[  2%] Linking C shared library libnidr.so
cd /wrkdirs/usr/ports/science/dakota/work/.build/packages/external/nidr && /usr/local/bin/cmake -E cmake_link_script CMakeFiles/nidr.dir/link.txt --verbose=1
/usr/local/bin/gcc10 -fPIC -O2 -pipe  -fstack-protector-strong -Wl,-rpath=/usr/local/lib/gcc10 -fno-strict-aliasing -O2 -pipe  -fstack-protector-strong -Wl,-rpath=/usr/local/lib/gcc10 -fno-strict-aliasing  -lexecinfo -Wl,-rpath=/usr/local/lib/gcc10  -L/usr/local/lib/gcc10 -B/usr/local/bin -fstack-protector-strong -Wl,-rpath=/usr/local/lib/gcc10 -L/usr/local/lib/gcc10 -shared -Wl,-soname,libnidr.so -o libnidr.so CMakeFiles/nidr.dir/nidr-scanner.c.o CMakeFiles/nidr.dir/nidr-parser.c.o CMakeFiles/nidr.dir/avltree.c.o CMakeFiles/nidr.dir/nidr.c.o  -Wl,-rpath,::::::::::::::::::::::::::::::::::::: 
[  2%] Built target nidr
--- packages/external/nidr/CMakeFiles/nidrgen.dir/all ---
/usr/bin/make  -f packages/external/nidr/CMakeFiles/nidrgen.dir/build.make packages/external/nidr/CMakeFiles/nidrgen.dir/depend
--- packages/external/nidr/CMakeFiles/nidrgen.dir/depend ---
cd /wrkdirs/usr/ports/science/dakota/work/.build && /usr/local/bin/cmake -E cmake_depends "Unix Makefiles" /wrkdirs/usr/ports/science/dakota/work/dakota-6.13.0-release-public.src-UI /wrkdirs/usr/ports/science/dakota/work/dakota-6.13.0-release-public.src-UI/packages/external/nidr /wrkdirs/usr/ports/science/dakota/work/.build /wrkdirs/usr/ports/science/dakota/work/.build/packages/external/nidr /wrkdirs/usr/ports/science/dakota/work/.build/packages/external/nidr/CMakeFiles/nidrgen.dir/DependInfo.cmake
Scanning dependencies of target nidrgen
/usr/bin/make  -f packages/external/nidr/CMakeFiles/nidrgen.dir/build.make packages/external/nidr/CMakeFiles/nidrgen.dir/build
--- packages/external/nidr/CMakeFiles/nidrgen.dir/nidrgen.c.o ---
[  2%] Building C object packages/external/nidr/CMakeFiles/nidrgen.dir/nidrgen.c.o
cd /wrkdirs/usr/ports/science/dakota/work/.build/packages/external/nidr && /usr/local/bin/gcc10 -DHAVE_CONFIG_H -DHAVE_DAKOTA_SURROGATES -DNO_NIDR_DYNLIB -I/wrkdirs/usr/ports/science/dakota/work/dakota-6.13.0-release-public.src-UI/packages/external/nidr -I/wrkdirs/usr/ports/science/dakota/work/.build/packages/external/nidr -O2 -pipe  -fstack-protector-strong -Wl,-rpath=/usr/local/lib/gcc10 -fno-strict-aliasing -O2 -pipe  -fstack-protector-strong -Wl,-rpath=/usr/local/lib/gcc10 -fno-strict-aliasing -o CMakeFiles/nidrgen.dir/nidrgen.c.o -c /wrkdirs/usr/ports/science/dakota/work/dakota-6.13.0-release-public.src-UI/packages/external/nidr/nidrgen.c
--- packages/CMakeFiles/MUQ.dir/all ---
[ 15%] Building CXX object CMakeFiles/muqUtilities.dir/modules/Utilities/src/MultiIndices/MultiIndexFactory.cpp.o
--- packages/external/nidr/CMakeFiles/nidrgen.dir/all ---
--- packages/external/nidr/nidrgen ---
[  2%] Linking C executable nidrgen
cd /wrkdirs/usr/ports/science/dakota/work/.build/packages/external/nidr && /usr/local/bin/cmake -E cmake_link_script CMakeFiles/nidrgen.dir/link.txt --verbose=1
/usr/local/bin/gcc10 -O2 -pipe  -fstack-protector-strong -Wl,-rpath=/usr/local/lib/gcc10 -fno-strict-aliasing -O2 -pipe  -fstack-protector-strong -Wl,-rpath=/usr/local/lib/gcc10 -fno-strict-aliasing  -lexecinfo -Wl,-rpath=/usr/local/lib/gcc10  -L/usr/local/lib/gcc10 -B/usr/local/bin -fstack-protector-strong -Wl,-rpath=/usr/local/lib/gcc10 -L/usr/local/lib/gcc10 CMakeFiles/nidrgen.dir/nidrgen.c.o -o nidrgen  -lm 
[  2%] Built target nidrgen
--- packages/external/ampl/CMakeFiles/genarith.dir/all ---
/usr/bin/make  -f packages/external/ampl/CMakeFiles/genarith.dir/build.make packages/external/ampl/CMakeFiles/genarith.dir/depend
--- packages/external/ampl/CMakeFiles/genarith.dir/depend ---
cd /wrkdirs/usr/ports/science/dakota/work/.build && /usr/local/bin/cmake -E cmake_depends "Unix Makefiles" /wrkdirs/usr/ports/science/dakota/work/dakota-6.13.0-release-public.src-UI /wrkdirs/usr/ports/science/dakota/work/dakota-6.13.0-release-public.src-UI/packages/external/ampl /wrkdirs/usr/ports/science/dakota/work/.build /wrkdirs/usr/ports/science/dakota/work/.build/packages/external/ampl /wrkdirs/usr/ports/science/dakota/work/.build/packages/external/ampl/CMakeFiles/genarith.dir/DependInfo.cmake
Scanning dependencies of target genarith
/usr/bin/make  -f packages/external/ampl/CMakeFiles/genarith.dir/build.make packages/external/ampl/CMakeFiles/genarith.dir/build
--- packages/external/ampl/CMakeFiles/genarith.dir/arithchk.c.o ---
[  2%] Building C object packages/external/ampl/CMakeFiles/genarith.dir/arithchk.c.o
cd /wrkdirs/usr/ports/science/dakota/work/.build/packages/external/ampl && /usr/local/bin/gcc10 -DHAVE_CONFIG_H -DHAVE_DAKOTA_SURROGATES -I/wrkdirs/usr/ports/science/dakota/work/dakota-6.13.0-release-public.src-UI/packages/external/ampl -I/wrkdirs/usr/ports/science/dakota/work/.build/packages/external/ampl -O2 -pipe  -fstack-protector-strong -Wl,-rpath=/usr/local/lib/gcc10 -fno-strict-aliasing -O2 -pipe  -fstack-protector-strong -Wl,-rpath=/usr/local/lib/gcc10 -fno-strict-aliasing -o CMakeFiles/genarith.dir/arithchk.c.o -c /wrkdirs/usr/ports/science/dakota/work/dakota-6.13.0-release-public.src-UI/packages/external/ampl/arithchk.c
--- packages/external/ampl/CMakeFiles/genarith.dir/fpinit.c.o ---
[  2%] Building C object packages/external/ampl/CMakeFiles/genarith.dir/fpinit.c.o
cd /wrkdirs/usr/ports/science/dakota/work/.build/packages/external/ampl && /usr/local/bin/gcc10 -DHAVE_CONFIG_H -DHAVE_DAKOTA_SURROGATES -I/wrkdirs/usr/ports/science/dakota/work/dakota-6.13.0-release-public.src-UI/packages/external/ampl -I/wrkdirs/usr/ports/science/dakota/work/.build/packages/external/ampl -O2 -pipe  -fstack-protector-strong -Wl,-rpath=/usr/local/lib/gcc10 -fno-strict-aliasing -O2 -pipe  -fstack-protector-strong -Wl,-rpath=/usr/local/lib/gcc10 -fno-strict-aliasing -o CMakeFiles/genarith.dir/fpinit.c.o -c /wrkdirs/usr/ports/science/dakota/work/dakota-6.13.0-release-public.src-UI/packages/external/ampl/fpinit.c
In file included from /usr/include/floatingpoint.h:37,
                 from /wrkdirs/usr/ports/science/dakota/work/dakota-6.13.0-release-public.src-UI/packages/external/ampl/fpinit.c:218:
/usr/include/machine/ieeefp.h:35:14: error: expected ';' before 'extern'
   35 | __BEGIN_DECLS
      |              ^
      |              ;
   36 | extern fp_rnd_t    fpgetround(void);
      | ~~~~~~        
/usr/include/machine/ieeefp.h:41:12: error: expected ';' before 'void'
   41 | __END_DECLS
      |            ^
      |            ;
/wrkdirs/usr/ports/science/dakota/work/dakota-6.13.0-release-public.src-UI/packages/external/ampl/fpinit.c: In function 'fpinit_ASL':
/wrkdirs/usr/ports/science/dakota/work/dakota-6.13.0-release-public.src-UI/packages/external/ampl/fpinit.c:223:2: warning: implicit declaration of function 'fpsetprec' [-Wimplicit-function-declaration]
  223 |  fpsetprec(FP_PD);
      |  ^~~~~~~~~
/wrkdirs/usr/ports/science/dakota/work/dakota-6.13.0-release-public.src-UI/packages/external/ampl/fpinit.c:223:12: error: 'FP_PD' undeclared (first use in this function)
  223 |  fpsetprec(FP_PD);
      |            ^~~~~
/wrkdirs/usr/ports/science/dakota/work/dakota-6.13.0-release-public.src-UI/packages/external/ampl/fpinit.c:223:12: note: each undeclared identifier is reported only once for each function it appears in
*** [packages/external/ampl/CMakeFiles/genarith.dir/fpinit.c.o] Error code 1

make[3]: stopped in /wrkdirs/usr/ports/science/dakota/work/.build
1 error

make[3]: stopped in /wrkdirs/usr/ports/science/dakota/work/.build
*** [packages/external/ampl/CMakeFiles/genarith.dir/all] Error code 2

make[2]: stopped in /wrkdirs/usr/ports/science/dakota/work/.build
--- packages/CMakeFiles/MUQ.dir/all ---
*** [all] Error code 2

make[4]: stopped in /wrkdirs/usr/ports/science/dakota/work/.build/packages/external/muq2/src/MUQ-build
1 error

make[4]: stopped in /wrkdirs/usr/ports/science/dakota/work/.build/packages/external/muq2/src/MUQ-build
*** [packages/external/muq2/src/MUQ-stamp/MUQ-build] Error code 2

make[3]: stopped in /wrkdirs/usr/ports/science/dakota/work/.build
1 error

make[3]: stopped in /wrkdirs/usr/ports/science/dakota/work/.build
*** [packages/CMakeFiles/MUQ.dir/all] Error code 2

make[2]: stopped in /wrkdirs/usr/ports/science/dakota/work/.build
2 errors

make[2]: stopped in /wrkdirs/usr/ports/science/dakota/work/.build
*** [all] Error code 2

make[1]: stopped in /wrkdirs/usr/ports/science/dakota/work/.build
1 error

make[1]: stopped in /wrkdirs/usr/ports/science/dakota/work/.build
===> Compilation failed unexpectedly.
Try to set MAKE_JOBS_UNSAFE=yes and rebuild before reporting the failure to
the maintainer.
*** Error code 1

Stop.
make: stopped in /usr/ports/science/dakota
Received on Tue Jun 29 2021 - 03:24:13 UTC

Original text of this message