[package - 122powerpc64-quarterly][devel/trellis] Failed for trellis-g20190422_3 in build

From: <pkg-fallout_at_FreeBSD.org>
Date: Tue, 29 Jun 2021 03:07:10 GMT
You are receiving this mail as a port that you maintain
is failing to build on the FreeBSD package build server.
Please investigate the failure and submit a PR to fix
build.

Maintainer:     manu_at_FreeBSD.Org
Log URL:        http://foul1.nyi.freebsd.org/data/122powerpc64-quarterly/ae162bd98935/logs/trellis-g20190422_3.log
Build URL:      http://foul1.nyi.freebsd.org/build.html?mastername=122powerpc64-quarterly&build=ae162bd98935
Log:

=>> Building devel/trellis
build started at Tue Jun 29 03:05:26 UTC 2021
port directory: /usr/ports/devel/trellis
package name: trellis-g20190422_3
building for: FreeBSD 122powerpc64-quarterly-job-12 12.2-RELEASE FreeBSD 12.2-RELEASE powerpc
maintained by: manu_at_FreeBSD.Org
Makefile ident: 
Poudriere version: 3.2.8-8-gaf08dbda
Host OSVERSION: 1400008
Jail OSVERSION: 1202000
Job Id: 12

---Begin Environment---
SHELL=/bin/csh
OSVERSION=1202000
UNAME_v=FreeBSD 12.2-RELEASE
UNAME_r=12.2-RELEASE
BLOCKSIZE=K
MAIL=/var/mail/root
STATUS=1
HOME=/root
PATH=/sbin:/bin:/usr/sbin:/usr/bin:/usr/local/sbin:/usr/local/bin:/root/bin
LOCALBASE=/usr/local
USER=root
LIBEXECPREFIX=/usr/local/libexec/poudriere
POUDRIERE_VERSION=3.2.8-8-gaf08dbda
MASTERMNT=/usr/local/poudriere/data/.m/122powerpc64-quarterly/ref
POUDRIERE_BUILD_TYPE=bulk
PACKAGE_BUILDING=yes
SAVED_TERM=
PWD=/usr/local/poudriere/data/.m/122powerpc64-quarterly/ref/.p/pool
P_PORTS_FEATURES=FLAVORS SELECTED_OPTIONS
MASTERNAME=122powerpc64-quarterly
SCRIPTPREFIX=/usr/local/share/poudriere
OLDPWD=/usr/local/poudriere/data/.m/122powerpc64-quarterly/ref/.p
SCRIPTPATH=/usr/local/share/poudriere/bulk.sh
POUDRIEREPATH=/usr/local/bin/poudriere
---End Environment---

---Begin Poudriere Port Flags/Env---
PORT_FLAGS=
PKGENV=
FLAVOR=
DEPENDS_ARGS=
MAKE_ARGS=
---End Poudriere Port Flags/Env---

---Begin OPTIONS List---
---End OPTIONS List---

--MAINTAINER--
manu_at_FreeBSD.Org
--End MAINTAINER--

--CONFIGURE_ARGS--

--End CONFIGURE_ARGS--

--CONFIGURE_ENV--
PYTHON="/usr/local/bin/python3.7" XDG_DATA_HOME=/wrkdirs/usr/ports/devel/trellis/work  XDG_CONFIG_HOME=/wrkdirs/usr/ports/devel/trellis/work  HOME=/wrkdirs/usr/ports/devel/trellis/work TMPDIR="/tmp" PATH=/wrkdirs/usr/ports/devel/trellis/work/.bin:/sbin:/bin:/usr/sbin:/usr/bin:/usr/local/sbin:/usr/local/bin:/root/bin SHELL=/bin/sh CONFIG_SHELL=/bin/sh
--End CONFIGURE_ENV--

--MAKE_ENV--
XDG_DATA_HOME=/wrkdirs/usr/ports/devel/trellis/work  XDG_CONFIG_HOME=/wrkdirs/usr/ports/devel/trellis/work  HOME=/wrkdirs/usr/ports/devel/trellis/work TMPDIR="/tmp" PATH=/wrkdirs/usr/ports/devel/trellis/work/.bin:/sbin:/bin:/usr/sbin:/usr/bin:/usr/local/sbin:/usr/local/bin:/root/bin NO_PIE=yes MK_DEBUG_FILES=no MK_KERNEL_SYMBOLS=no SHELL=/bin/sh NO_LINT=YES ADDR2LINE="/usr/local/bin/addr2line" AR="/usr/local/bin/ar" AS="/usr/local/bin/as" CPPFILT="/usr/local/bin/c++filt" GPROF="/usr/local/bin/gprof" LD="/usr/local/bin/ld" NM="/usr/local/bin/nm" OBJCOPY="/usr/local/bin/objcopy" OBJDUMP="/usr/local/bin/objdump" RANLIB="/usr/local/bin/ranlib" READELF="/usr/local/bin/readelf" SIZE="/usr/local/bin/size" STRINGS="/usr/local/bin/strings" DESTDIR=/wrkdirs/usr/ports/devel/trellis/work/stage PREFIX=/usr/local  LOCALBASE=/usr/local  CC="gcc10" CFLAGS="-O2 -pipe  -fstack-protector-strong -Wl,-rpath=/usr/local/lib/gcc10 -fno-strict-aliasing "  CPP="cpp10" CPPFLAGS=""  LDFLAGS=" -fstack-protector-
 strong -Wl,-rpath=/usr/local/lib/gcc10 -L/usr/local/lib/gcc10 " LIBS=""  CXX="g++10" CXXFLAGS="-O2 -pipe  -fstack-protector-strong -Wl,-rpath=/usr/local/lib/gcc10  -Wl,-rpath=/usr/local/lib/gcc10 "  MANPREFIX="/usr/local" BSD_INSTALL_PROGRAM="install  -s -m 555"  BSD_INSTALL_LIB="install  -s -m 0644"  BSD_INSTALL_SCRIPT="install  -m 555"  BSD_INSTALL_DATA="install  -m 0644"  BSD_INSTALL_MAN="install  -m 444"
--End MAKE_ENV--

--PLIST_SUB--
CMAKE_BUILD_TYPE="release" PYTHON_INCLUDEDIR=include/python3.7m  PYTHON_LIBDIR=lib/python3.7  PYTHON_PLATFORM=freebsd12  PYTHON_SITELIBDIR=lib/python3.7/site-packages  PYTHON_SUFFIX=37  PYTHON_EXT_SUFFIX=  PYTHON_VER=3.7  PYTHON_VERSION=python3.7 PYTHON2="_at_comment " PYTHON3="" OSREL=12.2 PREFIX=%D LOCALBASE=/usr/local  RESETPREFIX=/usr/local LIB32DIR=lib DOCSDIR="share/doc/trellis"  EXAMPLESDIR="share/examples/trellis"  DATADIR="share/trellis"  WWWDIR="www/trellis"  ETCDIR="etc/trellis"
--End PLIST_SUB--

--SUB_LIST--
PREFIX=/usr/local LOCALBASE=/usr/local  DATADIR=/usr/local/share/trellis DOCSDIR=/usr/local/share/doc/trellis EXAMPLESDIR=/usr/local/share/examples/trellis  WWWDIR=/usr/local/www/trellis ETCDIR=/usr/local/etc/trellis
--End SUB_LIST--

---Begin make.conf---
USE_PACKAGE_DEPENDS=yes
BATCH=yes
WRKDIRPREFIX=/wrkdirs
PORTSDIR=/usr/ports
PACKAGES=/packages
DISTDIR=/distfiles
PACKAGE_BUILDING=yes
PACKAGE_BUILDING_FLAVORS=yes
#### /usr/local/etc/poudriere.d/make.conf ####
# XXX: We really need this but cannot use it while 'make checksum' does not
# try the next mirror on checksum failure.  It currently retries the same
# failed mirror and then fails rather then trying another.  It *does*
# try the next if the size is mismatched though.
#MASTER_SITE_FREEBSD=yes
# Build ALLOW_MAKE_JOBS_PACKAGES with 2 jobs
MAKE_JOBS_NUMBER=2
#### /usr/ports/Mk/Scripts/ports_env.sh ####
_CCVERSION_921dbbb2=cc (GCC) 4.2.1 20070831 patched [FreeBSD] Copyright (C) 2007 Free Software Foundation, Inc. This is free software; see the source for copying conditions. There is NO warranty; not even for MERCHANTABILITY or FITNESS FOR A PARTICULAR PURPOSE.
_ALTCCVERSION_921dbbb2=none
_CXXINTERNAL_acaad9ca=Using built-in specs. Target: powerpc64-undermydesk-freebsd Configured with: FreeBSD/powerpc64 system compiler Thread model: posix gcc version 4.2.1 20070831 patched [FreeBSD] "/usr/bin/ld" "--eh-frame-hdr" "-Qy" "-melf64ppc_fbsd" "--enable-new-dtags" "-dynamic-linker" "/libexec/ld-elf.so.1" "/usr/lib/crt1.o" "/usr/lib/crti.o" "/usr/lib/crtbegin.o" "-L/usr/lib" "-L/usr/lib" "/dev/null" "-lstdc++" "-lm" "-lgcc_s" "-lgcc" "-lc" "-lgcc_s" "-lgcc" "/usr/lib/crtsavres.o" "/usr/lib/crtend.o" "/usr/lib/crtn.o"
CC_OUTPUT_921dbbb2_58173849=yes
CC_OUTPUT_921dbbb2_9bdba57c=yes
CC_OUTPUT_921dbbb2_6a4fe7f5=cc1: error: unrecognized command line option "-std=c11"
CC_OUTPUT_921dbbb2_6bcac02b=yes
CC_OUTPUT_921dbbb2_67d20829=yes
CC_OUTPUT_921dbbb2_bfa62e83=cc1: error: unrecognized command line option "-std=gnu11"
CC_OUTPUT_921dbbb2_f0b4d593=yes
CC_OUTPUT_921dbbb2_308abb44=cc1plus: error: unrecognized command line option "-std=c++0x"
CC_OUTPUT_921dbbb2_f00456e5=cc1plus: error: unrecognized command line option "-std=c++11"
CC_OUTPUT_921dbbb2_65ad290d=cc1plus: error: unrecognized command line option "-std=c++14"
CC_OUTPUT_921dbbb2_f2776b26=cc1plus: error: unrecognized command line option "-std=c++17"
CC_OUTPUT_921dbbb2_b2657cc3=yes
CC_OUTPUT_921dbbb2_380987f7=cc1plus: error: unrecognized command line option "-std=gnu++11"
CC_OUTPUT_921dbbb2_160933ec=cc1plus: error: unrecognized command line option "-std=gnu++14"
CC_OUTPUT_921dbbb2_fb62803b=cc1plus: error: unrecognized command line option "-std=gnu++17"
_OBJC_CCVERSION_921dbbb2=cc (GCC) 4.2.1 20070831 patched [FreeBSD] Copyright (C) 2007 Free Software Foundation, Inc. This is free software; see the source for copying conditions. There is NO warranty; not even for MERCHANTABILITY or FITNESS FOR A PARTICULAR PURPOSE.
_OBJC_ALTCCVERSION_921dbbb2=none
ARCH=powerpc64
PPC_ABI=ELFv1
OPSYS=FreeBSD
_OSRELEASE=12.2-RELEASE
OSREL=12.2
OSVERSION=1202000
PYTHONBASE=/usr/local
CONFIGURE_MAX_CMD_LEN=524288
HAVE_PORTS_ENV=1
#### Misc Poudriere ####
GID=0
UID=0
---End make.conf---
--Resource limits--
cpu time               (seconds, -t)  unlimited
file size           (512-blocks, -f)  unlimited
data seg size           (kbytes, -d)  33554432
stack size              (kbytes, -s)  524288
core file size      (512-blocks, -c)  unlimited
max memory size         (kbytes, -m)  unlimited
locked memory           (kbytes, -l)  unlimited
max user processes              (-u)  89999
open files                      (-n)  1024
virtual mem size        (kbytes, -v)  unlimited
swap limit              (kbytes, -w)  unlimited
socket buffer size       (bytes, -b)  unlimited
pseudo-terminals                (-p)  unlimited
kqueues                         (-k)  unlimited
umtx shared locks               (-o)  unlimited
--End resource limits--
=======================<phase: check-sanity   >============================
===>  License ISCL accepted by the user
===========================================================================
=======================<phase: pkg-depends    >============================
===>   trellis-g20190422_3 depends on file: /usr/local/sbin/pkg - not found
===>   Installing existing package /packages/All/pkg-1.16.3.txz
[122powerpc64-quarterly-job-12] Installing pkg-1.16.3...
[122powerpc64-quarterly-job-12] Extracting pkg-1.16.3: .......... done
===>   trellis-g20190422_3 depends on file: /usr/local/sbin/pkg - found
===>   Returning to build of trellis-g20190422_3
===========================================================================
=======================<phase: fetch-depends  >============================
===========================================================================
=======================<phase: fetch          >============================
===>  License ISCL accepted by the user
===> Fetching all distfiles required by trellis-g20190422_3 for building
===========================================================================
=======================<phase: checksum       >============================
===>  License ISCL accepted by the user
===> Fetching all distfiles required by trellis-g20190422_3 for building
=> SHA256 Checksum OK for SymbiFlow-prjtrellis-g20190422-5eb0ad87_GH0.tar.gz.
=> SHA256 Checksum OK for SymbiFlow-prjtrellis-db-d0b219af_GH0.tar.gz.
=> SHA256 Checksum OK for 2784291454a0307cf131acb5f0f68acc1eb4ffc3.patch.
===========================================================================
=======================<phase: extract-depends>============================
===========================================================================
=======================<phase: extract        >============================
===>  License ISCL accepted by the user
===> Fetching all distfiles required by trellis-g20190422_3 for building
===>  Extracting for trellis-g20190422_3
=> SHA256 Checksum OK for SymbiFlow-prjtrellis-g20190422-5eb0ad87_GH0.tar.gz.
=> SHA256 Checksum OK for SymbiFlow-prjtrellis-db-d0b219af_GH0.tar.gz.
=> SHA256 Checksum OK for 2784291454a0307cf131acb5f0f68acc1eb4ffc3.patch.
===========================================================================
=======================<phase: patch-depends  >============================
===========================================================================
=======================<phase: patch          >============================
===>  Patching for trellis-g20190422_3
===>  Applying distribution patches for trellis-g20190422_3
===>  Applying FreeBSD patches for trellis-g20190422_3 from /usr/ports/devel/trellis/files
===========================================================================
=======================<phase: build-depends  >============================
===>   trellis-g20190422_3 depends on file: /usr/local/bin/cmake - not found
===>   Installing existing package /packages/All/cmake-3.19.6.txz
[122powerpc64-quarterly-job-12] Installing cmake-3.19.6...
[122powerpc64-quarterly-job-12] `-- Installing curl-7.76.0...
[122powerpc64-quarterly-job-12] |   `-- Installing ca_root_nss-3.63...
[122powerpc64-quarterly-job-12] |   `-- Extracting ca_root_nss-3.63: ........ done
[122powerpc64-quarterly-job-12] |   `-- Installing libnghttp2-1.43.0...
[122powerpc64-quarterly-job-12] |   | `-- Installing gcc10-10.2.0_1...
[122powerpc64-quarterly-job-12] |   |   `-- Installing binutils-2.33.1_4,1...
[122powerpc64-quarterly-job-12] |   |   | `-- Installing gettext-runtime-0.21...
[122powerpc64-quarterly-job-12] |   |   |   `-- Installing indexinfo-0.3.1...
[122powerpc64-quarterly-job-12] |   |   |   `-- Extracting indexinfo-0.3.1: .... done
[122powerpc64-quarterly-job-12] |   |   | `-- Extracting gettext-runtime-0.21: .......... done
[122powerpc64-quarterly-job-12] |   |   `-- Extracting binutils-2.33.1_4,1: .......... done
[122powerpc64-quarterly-job-12] |   |   `-- Installing gcc9-9.3.0_3...
<snip>
--
FreeBSD does not, and can not warrant that the certification authorities
whose certificates are included in this package have in any way been
audited for trustworthiness or RFC 3647 compliance.

Assessment and verification of trust is the complete responsibility of the
system administrator.


This package installs symlinks to support root certificates discovery by
default for software that uses OpenSSL.

This enables SSL Certificate Verification by client software without manual
intervention.

If you prefer to do this manually, replace the following symlinks with
either an empty file or your site-local certificate bundle.

  * /etc/ssl/cert.pem
  * /usr/local/etc/ssl/cert.pem
  * /usr/local/openssl/cert.pem
=====
Message from gcc9-9.3.0_3:

--
To ensure binaries built with this toolchain find appropriate versions
of the necessary run-time libraries, you may want to link using

  -Wl,-rpath=/usr/local/lib/gcc9

For ports leveraging USE_GCC, USES=compiler, or USES=fortran this happens
transparently.
=====
Message from gcc10-10.2.0_1:

--
To ensure binaries built with this toolchain find appropriate versions
of the necessary run-time libraries, you may want to link using

  -Wl,-rpath=/usr/local/lib/gcc10

For ports leveraging USE_GCC, USES=compiler, or USES=fortran this happens
transparently.
===>   trellis-g20190422_3 depends on file: /usr/local/bin/cmake - found
===>   Returning to build of trellis-g20190422_3
===>   trellis-g20190422_3 depends on executable: ninja - not found
===>   Installing existing package /packages/All/ninja-1.10.2,2.txz
[122powerpc64-quarterly-job-12] Installing ninja-1.10.2,2...
[122powerpc64-quarterly-job-12] `-- Installing python37-3.7.10...
[122powerpc64-quarterly-job-12] |   `-- Installing libffi-3.3_1...
[122powerpc64-quarterly-job-12] |   `-- Extracting libffi-3.3_1: .......... done
[122powerpc64-quarterly-job-12] |   `-- Installing readline-8.1.0...
[122powerpc64-quarterly-job-12] |   `-- Extracting readline-8.1.0: .......... done
[122powerpc64-quarterly-job-12] `-- Extracting python37-3.7.10: .......... done
[122powerpc64-quarterly-job-12] Extracting ninja-1.10.2,2: ........ done
=====
Message from python37-3.7.10:

--
Note that some standard Python modules are provided as separate ports
as they require additional dependencies. They are available as:

py37-gdbm       databases/py-gdbm_at_py37
py37-sqlite3    databases/py-sqlite3_at_py37
py37-tkinter    x11-toolkits/py-tkinter_at_py37
===>   trellis-g20190422_3 depends on executable: ninja - found
===>   Returning to build of trellis-g20190422_3
===>   trellis-g20190422_3 depends on file: /usr/local/bin/python3.7 - found
===>   trellis-g20190422_3 depends on executable: gcc10 - found
===>   trellis-g20190422_3 depends on file: /usr/local/bin/as - found
===========================================================================
=======================<phase: lib-depends    >============================
===>   trellis-g20190422_3 depends on shared library: libftdi1.so - not found
===>   Installing existing package /packages/All/libftdi1-1.5_2.txz
[122powerpc64-quarterly-job-12] Installing libftdi1-1.5_2...
[122powerpc64-quarterly-job-12] `-- Installing boost-libs-1.72.0_4...
[122powerpc64-quarterly-job-12] |   `-- Installing icu-68.2,1...
[122powerpc64-quarterly-job-12] |   `-- Extracting icu-68.2,1: .......... done
[122powerpc64-quarterly-job-12] `-- Extracting boost-libs-1.72.0_4: .......... done
[122powerpc64-quarterly-job-12] `-- Installing libconfuse-3.3_2...
[122powerpc64-quarterly-job-12] `-- Extracting libconfuse-3.3_2: .......... done
[122powerpc64-quarterly-job-12] Extracting libftdi1-1.5_2: .......... done
=====
Message from boost-libs-1.72.0_4:

--
You have built the Boost library with thread support.

Don't forget to add -pthread to your linker options when
linking your code.
===>   trellis-g20190422_3 depends on shared library: libftdi1.so - found (/usr/local/lib/libftdi1.so)
===>   Returning to build of trellis-g20190422_3
===>   trellis-g20190422_3 depends on shared library: libboost_atomic.so - found (/usr/local/lib/libboost_atomic.so)
===>   trellis-g20190422_3 depends on shared library: libboost_chrono.so - found (/usr/local/lib/libboost_chrono.so)
===>   trellis-g20190422_3 depends on shared library: libboost_date_time.so - found (/usr/local/lib/libboost_date_time.so)
===>   trellis-g20190422_3 depends on shared library: libboost_filesystem.so - found (/usr/local/lib/libboost_filesystem.so)
===>   trellis-g20190422_3 depends on shared library: libboost_program_options.so - found (/usr/local/lib/libboost_program_options.so)
===>   trellis-g20190422_3 depends on shared library: libboost_python37.so - not found
===>   Installing existing package /packages/All/py37-boost-libs-1.72.0_1.txz
[122powerpc64-quarterly-job-12] Installing py37-boost-libs-1.72.0_1...
[122powerpc64-quarterly-job-12] Extracting py37-boost-libs-1.72.0_1: .......... done
=====
Message from py37-boost-libs-1.72.0_1:

--
You have built the Boost library with thread support.

Don't forget to add -pthread to your linker options when
linking your code.
===>   trellis-g20190422_3 depends on shared library: libboost_python37.so - found (/usr/local/lib/libboost_python37.so)
===>   Returning to build of trellis-g20190422_3
===>   trellis-g20190422_3 depends on shared library: libboost_thread.so - found (/usr/local/lib/libboost_thread.so)
===========================================================================
=======================<phase: configure      >============================
===>  Configuring for trellis-g20190422_3
===>  Performing out-of-source build
/bin/mkdir -p /wrkdirs/usr/ports/devel/trellis/work/.build
-- The C compiler identification is GNU 10.2.0
-- The CXX compiler identification is GNU 10.2.0
-- Detecting C compiler ABI info
-- Detecting C compiler ABI info - done
-- Check for working C compiler: /usr/local/bin/gcc10 - skipped
-- Detecting C compile features
-- Detecting C compile features - done
-- Detecting CXX compiler ABI info
-- Detecting CXX compiler ABI info - done
-- Check for working CXX compiler: /usr/local/bin/g++10 - skipped
-- Detecting CXX compile features
-- Detecting CXX compile features - done
-- Found PythonInterp: /usr/local/bin/python3.7 (found suitable version "3.7.10", minimum required is "3.5") 
-- Found PythonLibs: /usr/local/lib/libpython3.7m.so (found suitable version "3.7.10", minimum required is "3.5") 
-- Looking for pthread.h
-- Looking for pthread.h - found
-- Found Threads: TRUE  
-- Found Boost: /usr/local/include (found version "1.72.0") found components: filesystem thread chrono date_time atomic 
CMake Warning at /usr/local/share/cmake/Modules/FindBoost.cmake:2054 (message):
  No header defined for python-py3710; skipping header check (note:
  header-only libraries have no designated component)
Call Stack (most recent call first):
  CMakeLists.txt:36 (find_package)


-- Could NOT find Boost (missing: python-py3710) (found version "1.72.0")
CMake Warning at /usr/local/share/cmake/Modules/FindBoost.cmake:2054 (message):
  No header defined for python-py37; skipping header check (note: header-only
  libraries have no designated component)
Call Stack (most recent call first):
  CMakeLists.txt:43 (find_package)


-- Could NOT find Boost (missing: python-py37) (found version "1.72.0")
CMake Warning at /usr/local/share/cmake/Modules/FindBoost.cmake:2054 (message):
  No header defined for python-py3; skipping header check (note: header-only
  libraries have no designated component)
Call Stack (most recent call first):
  CMakeLists.txt:43 (find_package)


-- Could NOT find Boost (missing: python-py3) (found version "1.72.0")
-- Could NOT find Boost (missing: python3) (found version "1.72.0")
-- Could NOT find Boost (missing: python36) (found version "1.72.0")
-- Found Boost: /usr/local/include (found version "1.72.0") found components: python37 filesystem thread chrono date_time atomic 
-- Found Boost: /usr/local/include (found version "1.72.0") found components: program_options 
-- Configuring done
-- Generating done
CMake Warning:
  Manually-specified variables were not used by the project:

    CMAKE_COLOR_MAKEFILE
    CMAKE_CXX_FLAGS_DEBUG
    CMAKE_C_FLAGS_DEBUG
    CMAKE_C_FLAGS_RELEASE
    CMAKE_VERBOSE_MAKEFILE


-- Build files have been written to: /wrkdirs/usr/ports/devel/trellis/work/.build
===========================================================================
=======================<phase: build          >============================
===>  Building for trellis-g20190422_3
[1/36] /usr/local/bin/g++10 -DTRELLIS_PREFIX=\"/usr/local\" -I/wrkdirs/usr/ports/devel/trellis/work/prjtrellis-5eb0ad87/libtrellis/include -I/usr/local/include/python3.7m -Wall -pedantic -Wextra -O3 -O2 -pipe  -fstack-protector-strong -Wl,-rpath=/usr/local/lib/gcc10  -Wl,-rpath=/usr/local/lib/gcc10 -std=gnu++14 -MD -MT CMakeFiles/ecppll.dir/tools/ecppll.cpp.o -MF CMakeFiles/ecppll.dir/tools/ecppll.cpp.o.d -o CMakeFiles/ecppll.dir/tools/ecppll.cpp.o -c /wrkdirs/usr/ports/devel/trellis/work/prjtrellis-5eb0ad87/libtrellis/tools/ecppll.cpp
[2/36] /usr/local/bin/g++10 -DTRELLIS_PREFIX=\"/usr/local\" -I/wrkdirs/usr/ports/devel/trellis/work/prjtrellis-5eb0ad87/libtrellis/include -I/usr/local/include/python3.7m -Wall -pedantic -Wextra -O3 -O2 -pipe  -fstack-protector-strong -Wl,-rpath=/usr/local/lib/gcc10  -Wl,-rpath=/usr/local/lib/gcc10 -std=gnu++14 -MD -MT CMakeFiles/ecpmulti.dir/tools/ecpmulti.cpp.o -MF CMakeFiles/ecpmulti.dir/tools/ecpmulti.cpp.o.d -o CMakeFiles/ecpmulti.dir/tools/ecpmulti.cpp.o -c /wrkdirs/usr/ports/devel/trellis/work/prjtrellis-5eb0ad87/libtrellis/tools/ecpmulti.cpp
[3/36] /usr/local/bin/g++10 -DTRELLIS_PREFIX=\"/usr/local\" -I/wrkdirs/usr/ports/devel/trellis/work/prjtrellis-5eb0ad87/libtrellis/include -I/usr/local/include/python3.7m -Wall -pedantic -Wextra -O3 -O2 -pipe  -fstack-protector-strong -Wl,-rpath=/usr/local/lib/gcc10  -Wl,-rpath=/usr/local/lib/gcc10 -std=gnu++14 -MD -MT CMakeFiles/ecpunpack.dir/tools/ecpunpack.cpp.o -MF CMakeFiles/ecpunpack.dir/tools/ecpunpack.cpp.o.d -o CMakeFiles/ecpunpack.dir/tools/ecpunpack.cpp.o -c /wrkdirs/usr/ports/devel/trellis/work/prjtrellis-5eb0ad87/libtrellis/tools/ecpunpack.cpp
[4/36] /usr/local/bin/g++10 -DINCLUDE_PYTHON=1 -Dpytrellis_EXPORTS -I/wrkdirs/usr/ports/devel/trellis/work/prjtrellis-5eb0ad87/libtrellis/include -I/usr/local/include/python3.7m -Wall -pedantic -Wextra -O3 -O2 -pipe  -fstack-protector-strong -Wl,-rpath=/usr/local/lib/gcc10  -Wl,-rpath=/usr/local/lib/gcc10 -fPIC -std=gnu++14 -MD -MT CMakeFiles/pytrellis.dir/src/Bels.cpp.o -MF CMakeFiles/pytrellis.dir/src/Bels.cpp.o.d -o CMakeFiles/pytrellis.dir/src/Bels.cpp.o -c /wrkdirs/usr/ports/devel/trellis/work/prjtrellis-5eb0ad87/libtrellis/src/Bels.cpp
[5/36] /usr/local/bin/g++10 -DINCLUDE_PYTHON=1 -Dpytrellis_EXPORTS -I/wrkdirs/usr/ports/devel/trellis/work/prjtrellis-5eb0ad87/libtrellis/include -I/usr/local/include/python3.7m -Wall -pedantic -Wextra -O3 -O2 -pipe  -fstack-protector-strong -Wl,-rpath=/usr/local/lib/gcc10  -Wl,-rpath=/usr/local/lib/gcc10 -fPIC -std=gnu++14 -MD -MT CMakeFiles/pytrellis.dir/src/BitDatabase.cpp.o -MF CMakeFiles/pytrellis.dir/src/BitDatabase.cpp.o.d -o CMakeFiles/pytrellis.dir/src/BitDatabase.cpp.o -c /wrkdirs/usr/ports/devel/trellis/work/prjtrellis-5eb0ad87/libtrellis/src/BitDatabase.cpp
[6/36] /usr/local/bin/g++10 -DINCLUDE_PYTHON=1 -Dpytrellis_EXPORTS -I/wrkdirs/usr/ports/devel/trellis/work/prjtrellis-5eb0ad87/libtrellis/include -I/usr/local/include/python3.7m -Wall -pedantic -Wextra -O3 -O2 -pipe  -fstack-protector-strong -Wl,-rpath=/usr/local/lib/gcc10  -Wl,-rpath=/usr/local/lib/gcc10 -fPIC -std=gnu++14 -MD -MT CMakeFiles/pytrellis.dir/src/CRAM.cpp.o -MF CMakeFiles/pytrellis.dir/src/CRAM.cpp.o.d -o CMakeFiles/pytrellis.dir/src/CRAM.cpp.o -c /wrkdirs/usr/ports/devel/trellis/work/prjtrellis-5eb0ad87/libtrellis/src/CRAM.cpp
FAILED: CMakeFiles/pytrellis.dir/src/CRAM.cpp.o 
/usr/local/bin/g++10 -DINCLUDE_PYTHON=1 -Dpytrellis_EXPORTS -I/wrkdirs/usr/ports/devel/trellis/work/prjtrellis-5eb0ad87/libtrellis/include -I/usr/local/include/python3.7m -Wall -pedantic -Wextra -O3 -O2 -pipe  -fstack-protector-strong -Wl,-rpath=/usr/local/lib/gcc10  -Wl,-rpath=/usr/local/lib/gcc10 -fPIC -std=gnu++14 -MD -MT CMakeFiles/pytrellis.dir/src/CRAM.cpp.o -MF CMakeFiles/pytrellis.dir/src/CRAM.cpp.o.d -o CMakeFiles/pytrellis.dir/src/CRAM.cpp.o -c /wrkdirs/usr/ports/devel/trellis/work/prjtrellis-5eb0ad87/libtrellis/src/CRAM.cpp
/wrkdirs/usr/ports/devel/trellis/work/prjtrellis-5eb0ad87/libtrellis/src/CRAM.cpp: In function 'Trellis::CRAMDelta Trellis::operator-(const Trellis::CRAMView&, const Trellis::CRAMView&)':
/wrkdirs/usr/ports/devel/trellis/work/prjtrellis-5eb0ad87/libtrellis/src/CRAM.cpp:38:15: error: 'runtime_error' was not declared in this scope
   38 |         throw runtime_error("cannot compare CRAMViews of different sizes");
      |               ^~~~~~~~~~~~~
[7/36] /usr/local/bin/g++10 -DINCLUDE_PYTHON=1 -Dpytrellis_EXPORTS -I/wrkdirs/usr/ports/devel/trellis/work/prjtrellis-5eb0ad87/libtrellis/include -I/usr/local/include/python3.7m -Wall -pedantic -Wextra -O3 -O2 -pipe  -fstack-protector-strong -Wl,-rpath=/usr/local/lib/gcc10  -Wl,-rpath=/usr/local/lib/gcc10 -fPIC -std=gnu++14 -MD -MT CMakeFiles/pytrellis.dir/src/Bitstream.cpp.o -MF CMakeFiles/pytrellis.dir/src/Bitstream.cpp.o.d -o CMakeFiles/pytrellis.dir/src/Bitstream.cpp.o -c /wrkdirs/usr/ports/devel/trellis/work/prjtrellis-5eb0ad87/libtrellis/src/Bitstream.cpp
ninja: build stopped: subcommand failed.
===> Compilation failed unexpectedly.
Try to set MAKE_JOBS_UNSAFE=yes and rebuild before reporting the failure to
the maintainer.
*** Error code 1

Stop.
make: stopped in /usr/ports/devel/trellis
Received on Tue Jun 29 2021 - 03:07:10 UTC

Original text of this message