[package - 130arm64-quarterly][sysutils/cpuid2cpuflags] Failed for cpuid2cpuflags-11 in build

From: <pkg-fallout_at_FreeBSD.org>
Date: Sun, 27 Jun 2021 15:37:44 GMT
You are receiving this mail as a port that you maintain
is failing to build on the FreeBSD package build server.
Please investigate the failure and submit a PR to fix
build.

Maintainer:     danfe_at_FreeBSD.org
Log URL:        http://ampere1.nyi.freebsd.org/data/130arm64-quarterly/67383f941ca2/logs/cpuid2cpuflags-11.log
Build URL:      http://ampere1.nyi.freebsd.org/build.html?mastername=130arm64-quarterly&build=67383f941ca2
Log:

=>> Building sysutils/cpuid2cpuflags
build started at Sun Jun 27 15:37:29 UTC 2021
port directory: /usr/ports/sysutils/cpuid2cpuflags
package name: cpuid2cpuflags-11
building for: FreeBSD 130arm64-quarterly-job-02 13.0-RELEASE-p2 FreeBSD 13.0-RELEASE-p2 arm64
maintained by: danfe_at_FreeBSD.org
Makefile ident: 
Poudriere version: 3.2.8-8-gaf08dbda
Host OSVERSION: 1400008
Jail OSVERSION: 1300139
Job Id: 02

---Begin Environment---
SHELL=/bin/csh
OSVERSION=1300139
UNAME_v=FreeBSD 13.0-RELEASE-p2
UNAME_r=13.0-RELEASE-p2
BLOCKSIZE=K
MAIL=/var/mail/root
MM_CHARSET=UTF-8
LANG=C.UTF-8
STATUS=1
HOME=/root
PATH=/sbin:/bin:/usr/sbin:/usr/bin:/usr/local/sbin:/usr/local/bin:/root/bin
LOCALBASE=/usr/local
USER=root
LIBEXECPREFIX=/usr/local/libexec/poudriere
POUDRIERE_VERSION=3.2.8-8-gaf08dbda
MASTERMNT=/usr/local/poudriere/data/.m/130arm64-quarterly/ref
POUDRIERE_BUILD_TYPE=bulk
PACKAGE_BUILDING=yes
SAVED_TERM=
PWD=/usr/local/poudriere/data/.m/130arm64-quarterly/ref/.p/pool
P_PORTS_FEATURES=FLAVORS SELECTED_OPTIONS
MASTERNAME=130arm64-quarterly
SCRIPTPREFIX=/usr/local/share/poudriere
OLDPWD=/usr/local/poudriere/data/.m/130arm64-quarterly/ref/.p
SCRIPTPATH=/usr/local/share/poudriere/bulk.sh
POUDRIEREPATH=/usr/local/bin/poudriere
---End Environment---

---Begin Poudriere Port Flags/Env---
PORT_FLAGS=
PKGENV=
FLAVOR=
DEPENDS_ARGS=
MAKE_ARGS=
---End Poudriere Port Flags/Env---

---Begin OPTIONS List---
===> The following configuration options are available for cpuid2cpuflags-11:
     DOCS=on: Build and/or install documentation
===> Use 'make config' to modify these settings
---End OPTIONS List---

--MAINTAINER--
danfe_at_FreeBSD.org
--End MAINTAINER--

--CONFIGURE_ARGS--
--prefix=/usr/local ${_LATE_CONFIGURE_ARGS}
--End CONFIGURE_ARGS--

--CONFIGURE_ENV--
XDG_DATA_HOME=/wrkdirs/usr/ports/sysutils/cpuid2cpuflags/work  XDG_CONFIG_HOME=/wrkdirs/usr/ports/sysutils/cpuid2cpuflags/work  HOME=/wrkdirs/usr/ports/sysutils/cpuid2cpuflags/work TMPDIR="/tmp" PATH=/wrkdirs/usr/ports/sysutils/cpuid2cpuflags/work/.bin:/sbin:/bin:/usr/sbin:/usr/bin:/usr/local/sbin:/usr/local/bin:/root/bin SHELL=/bin/sh CONFIG_SHELL=/bin/sh CONFIG_SITE=/usr/ports/Templates/config.site lt_cv_sys_max_cmd_len=524288
--End CONFIGURE_ENV--

--MAKE_ENV--
XDG_DATA_HOME=/wrkdirs/usr/ports/sysutils/cpuid2cpuflags/work  XDG_CONFIG_HOME=/wrkdirs/usr/ports/sysutils/cpuid2cpuflags/work  HOME=/wrkdirs/usr/ports/sysutils/cpuid2cpuflags/work TMPDIR="/tmp" PATH=/wrkdirs/usr/ports/sysutils/cpuid2cpuflags/work/.bin:/sbin:/bin:/usr/sbin:/usr/bin:/usr/local/sbin:/usr/local/bin:/root/bin NO_PIE=yes MK_DEBUG_FILES=no MK_KERNEL_SYMBOLS=no SHELL=/bin/sh NO_LINT=YES PREFIX=/usr/local  LOCALBASE=/usr/local  CC="cc" CFLAGS="-O2 -pipe  -fstack-protector-strong -fno-strict-aliasing "  CPP="cpp" CPPFLAGS=""  LDFLAGS=" -fstack-protector-strong " LIBS=""  CXX="c++" CXXFLAGS="-O2 -pipe -fstack-protector-strong -fno-strict-aliasing  "  MANPREFIX="/usr/local" BSD_INSTALL_PROGRAM="install  -s -m 555"  BSD_INSTALL_LIB="install  -s -m 0644"  BSD_INSTALL_SCRIPT="install  -m 555"  BSD_INSTALL_DATA="install  -m 0644"  BSD_INSTALL_MAN="install  -m 444"
--End MAKE_ENV--

--PLIST_SUB--
PORTDOCS="" OSREL=13.0 PREFIX=%D LOCALBASE=/usr/local  RESETPREFIX=/usr/local LIB32DIR=lib DOCSDIR="share/doc/cpuid2cpuflags"  EXAMPLESDIR="share/examples/cpuid2cpuflags"  DATADIR="share/cpuid2cpuflags"  WWWDIR="www/cpuid2cpuflags"  ETCDIR="etc/cpuid2cpuflags"
--End PLIST_SUB--

--SUB_LIST--
PREFIX=/usr/local LOCALBASE=/usr/local  DATADIR=/usr/local/share/cpuid2cpuflags DOCSDIR=/usr/local/share/doc/cpuid2cpuflags EXAMPLESDIR=/usr/local/share/examples/cpuid2cpuflags  WWWDIR=/usr/local/www/cpuid2cpuflags ETCDIR=/usr/local/etc/cpuid2cpuflags
--End SUB_LIST--

---Begin make.conf---
USE_PACKAGE_DEPENDS=yes
BATCH=yes
WRKDIRPREFIX=/wrkdirs
PORTSDIR=/usr/ports
PACKAGES=/packages
DISTDIR=/distfiles
PACKAGE_BUILDING=yes
PACKAGE_BUILDING_FLAVORS=yes
#### /usr/local/etc/poudriere.d/make.conf ####
# XXX: We really need this but cannot use it while 'make checksum' does not
# try the next mirror on checksum failure.  It currently retries the same
# failed mirror and then fails rather then trying another.  It *does*
# try the next if the size is mismatched though.
#MASTER_SITE_FREEBSD=yes
# Build ALLOW_MAKE_JOBS_PACKAGES with 2 jobs
MAKE_JOBS_NUMBER=2
#### /usr/ports/Mk/Scripts/ports_env.sh ####
_CCVERSION_921dbbb2=FreeBSD clang version 11.0.1 (git_at_github.com:llvm/llvm-project.git llvmorg-11.0.1-0-g43ff75f2c3fe) Target: aarch64-unknown-freebsd13.0 Thread model: posix InstalledDir: /usr/bin
_ALTCCVERSION_921dbbb2=none
_CXXINTERNAL_acaad9ca=FreeBSD clang version 11.0.1 (git_at_github.com:llvm/llvm-project.git llvmorg-11.0.1-0-g43ff75f2c3fe) Target: aarch64-unknown-freebsd13.0 Thread model: posix InstalledDir: /usr/bin "/usr/bin/ld" "--eh-frame-hdr" "-dynamic-linker" "/libexec/ld-elf.so.1" "--enable-new-dtags" "-o" "a.out" "/usr/lib/crt1.o" "/usr/lib/crti.o" "/usr/lib/crtbegin.o" "-L/usr/lib" "/dev/null" "-lc++" "-lm" "-lgcc" "--as-needed" "-lgcc_s" "--no-as-needed" "-lc" "-lgcc" "--as-needed" "-lgcc_s" "--no-as-needed" "/usr/lib/crtend.o" "/usr/lib/crtn.o"
CC_OUTPUT_921dbbb2_58173849=yes
CC_OUTPUT_921dbbb2_9bdba57c=yes
CC_OUTPUT_921dbbb2_6a4fe7f5=yes
CC_OUTPUT_921dbbb2_6bcac02b=yes
CC_OUTPUT_921dbbb2_67d20829=yes
CC_OUTPUT_921dbbb2_bfa62e83=yes
CC_OUTPUT_921dbbb2_f0b4d593=yes
CC_OUTPUT_921dbbb2_308abb44=yes
CC_OUTPUT_921dbbb2_f00456e5=yes
CC_OUTPUT_921dbbb2_65ad290d=yes
CC_OUTPUT_921dbbb2_f2776b26=yes
CC_OUTPUT_921dbbb2_b2657cc3=yes
CC_OUTPUT_921dbbb2_380987f7=yes
CC_OUTPUT_921dbbb2_160933ec=yes
CC_OUTPUT_921dbbb2_fb62803b=yes
_OBJC_CCVERSION_921dbbb2=FreeBSD clang version 11.0.1 (git_at_github.com:llvm/llvm-project.git llvmorg-11.0.1-0-g43ff75f2c3fe) Target: aarch64-unknown-freebsd13.0 Thread model: posix InstalledDir: /usr/bin
_OBJC_ALTCCVERSION_921dbbb2=none
ARCH=aarch64
OPSYS=FreeBSD
_OSRELEASE=13.0-RELEASE-p2
OSREL=13.0
OSVERSION=1300139
PYTHONBASE=/usr/local
CONFIGURE_MAX_CMD_LEN=524288
HAVE_PORTS_ENV=1
#### Misc Poudriere ####
GID=0
UID=0
---End make.conf---
--Resource limits--
cpu time               (seconds, -t)  unlimited
file size           (512-blocks, -f)  unlimited
data seg size           (kbytes, -d)  1048576
stack size              (kbytes, -s)  1048576
core file size      (512-blocks, -c)  unlimited
max memory size         (kbytes, -m)  unlimited
locked memory           (kbytes, -l)  unlimited
max user processes              (-u)  89999
open files                      (-n)  1024
virtual mem size        (kbytes, -v)  unlimited
swap limit              (kbytes, -w)  unlimited
socket buffer size       (bytes, -b)  unlimited
pseudo-terminals                (-p)  unlimited
kqueues                         (-k)  unlimited
umtx shared locks               (-o)  unlimited
--End resource limits--
=======================<phase: check-sanity   >============================
===>  License BSD2CLAUSE accepted by the user
===========================================================================
=======================<phase: pkg-depends    >============================
===>   cpuid2cpuflags-11 depends on file: /usr/local/sbin/pkg - not found
===>   Installing existing package /packages/All/pkg-1.16.3.txz
[130arm64-quarterly-job-02] Installing pkg-1.16.3...
[130arm64-quarterly-job-02] Extracting pkg-1.16.3: .......... done
===>   cpuid2cpuflags-11 depends on file: /usr/local/sbin/pkg - found
===>   Returning to build of cpuid2cpuflags-11
===========================================================================
=======================<phase: fetch-depends  >============================
===========================================================================
=======================<phase: fetch          >============================
===>  License BSD2CLAUSE accepted by the user
===> Fetching all distfiles required by cpuid2cpuflags-11 for building
===========================================================================
=======================<phase: checksum       >============================
===>  License BSD2CLAUSE accepted by the user
===> Fetching all distfiles required by cpuid2cpuflags-11 for building
=> SHA256 Checksum OK for mgorny-cpuid2cpuflags-v11_GH0.tar.gz.
===========================================================================
=======================<phase: extract-depends>============================
===========================================================================
=======================<phase: extract        >============================
===>  License BSD2CLAUSE accepted by the user
===> Fetching all distfiles required by cpuid2cpuflags-11 for building
===>  Extracting for cpuid2cpuflags-11
=> SHA256 Checksum OK for mgorny-cpuid2cpuflags-v11_GH0.tar.gz.
===========================================================================
=======================<phase: patch-depends  >============================
===========================================================================
=======================<phase: patch          >============================
===>  Patching for cpuid2cpuflags-11
===========================================================================
=======================<phase: build-depends  >============================
===>   cpuid2cpuflags-11 depends on package: autoconf>=2.69 - not found
===>   Installing existing package /packages/All/autoconf-2.69_3.txz
[130arm64-quarterly-job-02] Installing autoconf-2.69_3...
[130arm64-quarterly-job-02] `-- Installing autoconf-wrapper-20131203...
[130arm64-quarterly-job-02] `-- Extracting autoconf-wrapper-20131203: .......... done
[130arm64-quarterly-job-02] `-- Installing indexinfo-0.3.1...
[130arm64-quarterly-job-02] `-- Extracting indexinfo-0.3.1: .... done
[130arm64-quarterly-job-02] `-- Installing m4-1.4.18_1,1...
[130arm64-quarterly-job-02] `-- Extracting m4-1.4.18_1,1: .......... done
[130arm64-quarterly-job-02] `-- Installing perl5-5.32.1_1...
[130arm64-quarterly-job-02] `-- Extracting perl5-5.32.1_1: .......... done
[130arm64-quarterly-job-02] Extracting autoconf-2.69_3: .......... done
===>   cpuid2cpuflags-11 depends on package: autoconf>=2.69 - found
===>   Returning to build of cpuid2cpuflags-11
===>   cpuid2cpuflags-11 depends on package: automake>=1.16.1 - not found
===>   Installing existing package /packages/All/automake-1.16.3.txz
[130arm64-quarterly-job-02] Installing automake-1.16.3...
[130arm64-quarterly-job-02] Extracting automake-1.16.3: .......... done
===>   cpuid2cpuflags-11 depends on package: automake>=1.16.1 - found
===>   Returning to build of cpuid2cpuflags-11
===========================================================================
=======================<phase: lib-depends    >============================
===========================================================================
=======================<phase: configure      >============================
===>  Configuring for cpuid2cpuflags-11
aclocal: warning: couldn't open directory 'm4': No such file or directory
configure.ac:9: installing 'build-aux/compile'
configure.ac:5: installing 'build-aux/install-sh'
configure.ac:5: installing 'build-aux/missing'
Makefile.am: installing 'build-aux/depcomp'
parallel-tests: installing 'build-aux/test-driver'
configure: loading site script /usr/ports/Templates/config.site
checking for a BSD-compatible install... /usr/bin/install -c
checking whether build environment is sane... yes
checking for a thread-safe mkdir -p... (cached) /bin/mkdir -p
checking for gawk... (cached) /usr/bin/awk
checking whether make sets $(MAKE)... yes
checking whether make supports nested variables... yes
checking whether make supports nested variables... (cached) yes
checking for gcc... cc
checking whether the C compiler works... yes
checking for C compiler default output file name... a.out
checking for suffix of executables... 
checking whether we are cross compiling... no
checking for suffix of object files... o
checking whether we are using the GNU C compiler... yes
checking whether cc accepts -g... yes
checking for cc option to accept ISO C89... none needed
checking whether cc understands -c and -o together... yes
checking whether make supports the include directive... yes (GNU style)
checking dependency style of cc... gcc3
checking how to run the C preprocessor... cpp
checking for grep that handles long lines and -e... (cached) /usr/bin/grep
checking for egrep... (cached) /usr/bin/egrep
checking for ANSI C header files... (cached) yes
checking for sys/types.h... (cached) yes
checking for sys/stat.h... (cached) yes
checking for stdlib.h... (cached) yes
checking for string.h... (cached) yes
checking for memory.h... (cached) yes
checking for strings.h... (cached) yes
checking for inttypes.h... (cached) yes
checking for stdint.h... (cached) yes
checking for unistd.h... (cached) yes
checking for minix/config.h... (cached) no
checking whether it is safe to define __EXTENSIONS__... yes
checking for uint32_t... (cached) yes
checking cpuid.h usability... no
checking cpuid.h presence... no
checking for cpuid.h... no
checking sys/auxv.h usability... yes
checking sys/auxv.h presence... yes
checking for sys/auxv.h... yes
checking for getauxval... no
checking that generated files are newer than configure... done
configure: creating ./config.status
config.status: creating Makefile
config.status: creating config.h
config.status: executing depfiles commands
===========================================================================
=======================<phase: build          >============================
===>  Building for cpuid2cpuflags-11
--- all ---
/usr/bin/make  all-am
--- src/.dirstamp ---
--- src/.deps/.dirstamp ---
--- src/main.o ---
--- src/arm.o ---
--- src/main.o ---
depbase=`echo src/main.o | sed 's|[^/]*$|.deps/&|;s|\.o$||'`; cc -DHAVE_CONFIG_H -I.      -O2 -pipe  -fstack-protector-strong -fno-strict-aliasing -MT src/main.o -MD -MP -MF $depbase.Tpo -c -o src/main.o src/main.c && mv -f $depbase.Tpo $depbase.Po
--- src/arm.o ---
depbase=`echo src/arm.o | sed 's|[^/]*$|.deps/&|;s|\.o$||'`; cc -DHAVE_CONFIG_H -I.      -O2 -pipe  -fstack-protector-strong -fno-strict-aliasing -MT src/arm.o -MD -MP -MF $depbase.Tpo -c -o src/arm.o src/arm.c && mv -f $depbase.Tpo $depbase.Po
--- src/hwcap.o ---
depbase=`echo src/hwcap.o | sed 's|[^/]*$|.deps/&|;s|\.o$||'`; cc -DHAVE_CONFIG_H -I.      -O2 -pipe  -fstack-protector-strong -fno-strict-aliasing -MT src/hwcap.o -MD -MP -MF $depbase.Tpo -c -o src/hwcap.o src/hwcap.c && mv -f $depbase.Tpo $depbase.Po
--- src/ppc.o ---
depbase=`echo src/ppc.o | sed 's|[^/]*$|.deps/&|;s|\.o$||'`; cc -DHAVE_CONFIG_H -I.      -O2 -pipe  -fstack-protector-strong -fno-strict-aliasing -MT src/ppc.o -MD -MP -MF $depbase.Tpo -c -o src/ppc.o src/ppc.c && mv -f $depbase.Tpo $depbase.Po
--- src/hwcap.o ---
src/hwcap.c:20:3: error: "Platform not supported (only Linux supported at the moment)"
#       error "Platform not supported (only Linux supported at the moment)"
        ^
src/hwcap.c:23:3: error: "Platform not supported (no getauxval())"
#       error "Platform not supported (no getauxval())"
        ^
src/hwcap.c:33:9: warning: implicit declaration of function 'getauxval' is invalid in C99 [-Wimplicit-function-declaration]
        return getauxval(AT_HWCAP);
               ^
src/hwcap.c:42:9: warning: implicit declaration of function 'getauxval' is invalid in C99 [-Wimplicit-function-declaration]
        return getauxval(AT_HWCAP2);
               ^
2 warnings and 2 errors generated.
*** [src/hwcap.o] Error code 1

make[2]: stopped in /wrkdirs/usr/ports/sysutils/cpuid2cpuflags/work/cpuid2cpuflags-11
1 error

make[2]: stopped in /wrkdirs/usr/ports/sysutils/cpuid2cpuflags/work/cpuid2cpuflags-11

make[1]: stopped in /wrkdirs/usr/ports/sysutils/cpuid2cpuflags/work/cpuid2cpuflags-11
===> Compilation failed unexpectedly.
Try to set MAKE_JOBS_UNSAFE=yes and rebuild before reporting the failure to
the maintainer.
*** Error code 1

Stop.
make: stopped in /usr/ports/sysutils/cpuid2cpuflags
Received on Sun Jun 27 2021 - 15:37:44 UTC

Original text of this message