[package - 130arm64-quarterly][graphics/cfdg] Failed for cfdg-2.2.2_2 in build

From: <pkg-fallout_at_FreeBSD.org>
Date: Sun, 27 Jun 2021 15:19:27 GMT
You are receiving this mail as a port that you maintain
is failing to build on the FreeBSD package build server.
Please investigate the failure and submit a PR to fix
build.

Maintainer:     anatoly.borodin_at_gmail.com
Log URL:        http://ampere1.nyi.freebsd.org/data/130arm64-quarterly/67383f941ca2/logs/cfdg-2.2.2_2.log
Build URL:      http://ampere1.nyi.freebsd.org/build.html?mastername=130arm64-quarterly&build=67383f941ca2
Log:

=>> Building graphics/cfdg
build started at Sun Jun 27 15:18:46 UTC 2021
port directory: /usr/ports/graphics/cfdg
package name: cfdg-2.2.2_2
building for: FreeBSD 130arm64-quarterly-job-05 13.0-RELEASE-p2 FreeBSD 13.0-RELEASE-p2 arm64
maintained by: anatoly.borodin_at_gmail.com
Makefile ident: 
Poudriere version: 3.2.8-8-gaf08dbda
Host OSVERSION: 1400008
Jail OSVERSION: 1300139
Job Id: 05

---Begin Environment---
SHELL=/bin/csh
OSVERSION=1300139
UNAME_v=FreeBSD 13.0-RELEASE-p2
UNAME_r=13.0-RELEASE-p2
BLOCKSIZE=K
MAIL=/var/mail/root
MM_CHARSET=UTF-8
LANG=C.UTF-8
STATUS=1
HOME=/root
PATH=/sbin:/bin:/usr/sbin:/usr/bin:/usr/local/sbin:/usr/local/bin:/root/bin
LOCALBASE=/usr/local
USER=root
LIBEXECPREFIX=/usr/local/libexec/poudriere
POUDRIERE_VERSION=3.2.8-8-gaf08dbda
MASTERMNT=/usr/local/poudriere/data/.m/130arm64-quarterly/ref
POUDRIERE_BUILD_TYPE=bulk
PACKAGE_BUILDING=yes
SAVED_TERM=
PWD=/usr/local/poudriere/data/.m/130arm64-quarterly/ref/.p/pool
P_PORTS_FEATURES=FLAVORS SELECTED_OPTIONS
MASTERNAME=130arm64-quarterly
SCRIPTPREFIX=/usr/local/share/poudriere
OLDPWD=/usr/local/poudriere/data/.m/130arm64-quarterly/ref/.p
SCRIPTPATH=/usr/local/share/poudriere/bulk.sh
POUDRIEREPATH=/usr/local/bin/poudriere
---End Environment---

---Begin Poudriere Port Flags/Env---
PORT_FLAGS=
PKGENV=
FLAVOR=
DEPENDS_ARGS=
MAKE_ARGS=
---End Poudriere Port Flags/Env---

---Begin OPTIONS List---
===> The following configuration options are available for cfdg-2.2.2_2:
     EXAMPLES=on: Build and/or install examples
===> Use 'make config' to modify these settings
---End OPTIONS List---

--MAINTAINER--
anatoly.borodin_at_gmail.com
--End MAINTAINER--

--CONFIGURE_ARGS--

--End CONFIGURE_ARGS--

--CONFIGURE_ENV--
MAKE=gmake XDG_DATA_HOME=/wrkdirs/usr/ports/graphics/cfdg/work  XDG_CONFIG_HOME=/wrkdirs/usr/ports/graphics/cfdg/work  HOME=/wrkdirs/usr/ports/graphics/cfdg/work TMPDIR="/tmp" PATH=/wrkdirs/usr/ports/graphics/cfdg/work/.bin:/sbin:/bin:/usr/sbin:/usr/bin:/usr/local/sbin:/usr/local/bin:/root/bin SHELL=/bin/sh CONFIG_SHELL=/bin/sh
--End CONFIGURE_ENV--

--MAKE_ENV--
XDG_DATA_HOME=/wrkdirs/usr/ports/graphics/cfdg/work  XDG_CONFIG_HOME=/wrkdirs/usr/ports/graphics/cfdg/work  HOME=/wrkdirs/usr/ports/graphics/cfdg/work TMPDIR="/tmp" PATH=/wrkdirs/usr/ports/graphics/cfdg/work/.bin:/sbin:/bin:/usr/sbin:/usr/bin:/usr/local/sbin:/usr/local/bin:/root/bin NO_PIE=yes MK_DEBUG_FILES=no MK_KERNEL_SYMBOLS=no SHELL=/bin/sh NO_LINT=YES PREFIX=/usr/local  LOCALBASE=/usr/local  CC="cc" CFLAGS="-O2 -pipe  -fstack-protector-strong -fno-strict-aliasing "  CPP="cpp" CPPFLAGS=""  LDFLAGS=" -fstack-protector-strong " LIBS=""  CXX="c++" CXXFLAGS="-O2 -pipe -fstack-protector-strong -fno-strict-aliasing  "  MANPREFIX="/usr/local" BSD_INSTALL_PROGRAM="install  -s -m 555"  BSD_INSTALL_LIB="install  -s -m 0644"  BSD_INSTALL_SCRIPT="install  -m 555"  BSD_INSTALL_DATA="install  -m 0644"  BSD_INSTALL_MAN="install  -m 444"
--End MAKE_ENV--

--PLIST_SUB--
PORTEXAMPLES="" OSREL=13.0 PREFIX=%D LOCALBASE=/usr/local  RESETPREFIX=/usr/local LIB32DIR=lib DOCSDIR="share/doc/cfdg"  EXAMPLESDIR="share/examples/cfdg"  DATADIR="share/cfdg"  WWWDIR="www/cfdg"  ETCDIR="etc/cfdg"
--End PLIST_SUB--

--SUB_LIST--
PREFIX=/usr/local LOCALBASE=/usr/local  DATADIR=/usr/local/share/cfdg DOCSDIR=/usr/local/share/doc/cfdg EXAMPLESDIR=/usr/local/share/examples/cfdg  WWWDIR=/usr/local/www/cfdg ETCDIR=/usr/local/etc/cfdg
--End SUB_LIST--

---Begin make.conf---
USE_PACKAGE_DEPENDS=yes
BATCH=yes
WRKDIRPREFIX=/wrkdirs
PORTSDIR=/usr/ports
PACKAGES=/packages
DISTDIR=/distfiles
PACKAGE_BUILDING=yes
PACKAGE_BUILDING_FLAVORS=yes
#### /usr/local/etc/poudriere.d/make.conf ####
# XXX: We really need this but cannot use it while 'make checksum' does not
# try the next mirror on checksum failure.  It currently retries the same
# failed mirror and then fails rather then trying another.  It *does*
# try the next if the size is mismatched though.
#MASTER_SITE_FREEBSD=yes
# Build ALLOW_MAKE_JOBS_PACKAGES with 2 jobs
MAKE_JOBS_NUMBER=2
#### /usr/ports/Mk/Scripts/ports_env.sh ####
_CCVERSION_921dbbb2=FreeBSD clang version 11.0.1 (git_at_github.com:llvm/llvm-project.git llvmorg-11.0.1-0-g43ff75f2c3fe) Target: aarch64-unknown-freebsd13.0 Thread model: posix InstalledDir: /usr/bin
_ALTCCVERSION_921dbbb2=none
_CXXINTERNAL_acaad9ca=FreeBSD clang version 11.0.1 (git_at_github.com:llvm/llvm-project.git llvmorg-11.0.1-0-g43ff75f2c3fe) Target: aarch64-unknown-freebsd13.0 Thread model: posix InstalledDir: /usr/bin "/usr/bin/ld" "--eh-frame-hdr" "-dynamic-linker" "/libexec/ld-elf.so.1" "--enable-new-dtags" "-o" "a.out" "/usr/lib/crt1.o" "/usr/lib/crti.o" "/usr/lib/crtbegin.o" "-L/usr/lib" "/dev/null" "-lc++" "-lm" "-lgcc" "--as-needed" "-lgcc_s" "--no-as-needed" "-lc" "-lgcc" "--as-needed" "-lgcc_s" "--no-as-needed" "/usr/lib/crtend.o" "/usr/lib/crtn.o"
CC_OUTPUT_921dbbb2_58173849=yes
CC_OUTPUT_921dbbb2_9bdba57c=yes
CC_OUTPUT_921dbbb2_6a4fe7f5=yes
CC_OUTPUT_921dbbb2_6bcac02b=yes
CC_OUTPUT_921dbbb2_67d20829=yes
CC_OUTPUT_921dbbb2_bfa62e83=yes
CC_OUTPUT_921dbbb2_f0b4d593=yes
CC_OUTPUT_921dbbb2_308abb44=yes
CC_OUTPUT_921dbbb2_f00456e5=yes
CC_OUTPUT_921dbbb2_65ad290d=yes
CC_OUTPUT_921dbbb2_f2776b26=yes
CC_OUTPUT_921dbbb2_b2657cc3=yes
CC_OUTPUT_921dbbb2_380987f7=yes
CC_OUTPUT_921dbbb2_160933ec=yes
CC_OUTPUT_921dbbb2_fb62803b=yes
_OBJC_CCVERSION_921dbbb2=FreeBSD clang version 11.0.1 (git_at_github.com:llvm/llvm-project.git llvmorg-11.0.1-0-g43ff75f2c3fe) Target: aarch64-unknown-freebsd13.0 Thread model: posix InstalledDir: /usr/bin
_OBJC_ALTCCVERSION_921dbbb2=none
ARCH=aarch64
OPSYS=FreeBSD
_OSRELEASE=13.0-RELEASE-p2
OSREL=13.0
OSVERSION=1300139
PYTHONBASE=/usr/local
CONFIGURE_MAX_CMD_LEN=524288
HAVE_PORTS_ENV=1
#### Misc Poudriere ####
GID=0
UID=0
---End make.conf---
--Resource limits--
cpu time               (seconds, -t)  unlimited
file size           (512-blocks, -f)  unlimited
data seg size           (kbytes, -d)  1048576
stack size              (kbytes, -s)  1048576
core file size      (512-blocks, -c)  unlimited
max memory size         (kbytes, -m)  unlimited
locked memory           (kbytes, -l)  unlimited
max user processes              (-u)  89999
open files                      (-n)  1024
virtual mem size        (kbytes, -v)  unlimited
swap limit              (kbytes, -w)  unlimited
socket buffer size       (bytes, -b)  unlimited
pseudo-terminals                (-p)  unlimited
kqueues                         (-k)  unlimited
umtx shared locks               (-o)  unlimited
--End resource limits--
=======================<phase: check-sanity   >============================
===>  License GPLv2+ accepted by the user
===========================================================================
=======================<phase: pkg-depends    >============================
===>   cfdg-2.2.2_2 depends on file: /usr/local/sbin/pkg - not found
===>   Installing existing package /packages/All/pkg-1.16.3.txz
[130arm64-quarterly-job-05] Installing pkg-1.16.3...
[130arm64-quarterly-job-05] Extracting pkg-1.16.3: .......... done
===>   cfdg-2.2.2_2 depends on file: /usr/local/sbin/pkg - found
===>   Returning to build of cfdg-2.2.2_2
===========================================================================
=======================<phase: fetch-depends  >============================
===========================================================================
=======================<phase: fetch          >============================
===>  License GPLv2+ accepted by the user
===> Fetching all distfiles required by cfdg-2.2.2_2 for building
===========================================================================
=======================<phase: checksum       >============================
===>  License GPLv2+ accepted by the user
===> Fetching all distfiles required by cfdg-2.2.2_2 for building
=> SHA256 Checksum OK for ContextFreeSource2.2.2.tgz.
===========================================================================
=======================<phase: extract-depends>============================
===========================================================================
=======================<phase: extract        >============================
===>  License GPLv2+ accepted by the user
===> Fetching all distfiles required by cfdg-2.2.2_2 for building
===>  Extracting for cfdg-2.2.2_2
=> SHA256 Checksum OK for ContextFreeSource2.2.2.tgz.
===========================================================================
=======================<phase: patch-depends  >============================
===========================================================================
=======================<phase: patch          >============================
===>  Patching for cfdg-2.2.2_2
===>  Applying FreeBSD patches for cfdg-2.2.2_2 from /usr/ports/graphics/cfdg/files
===========================================================================
=======================<phase: build-depends  >============================
===>   cfdg-2.2.2_2 depends on package: gmake>=4.3 - not found
===>   Installing existing package /packages/All/gmake-4.3_2.txz
[130arm64-quarterly-job-05] Installing gmake-4.3_2...
[130arm64-quarterly-job-05] `-- Installing gettext-runtime-0.21...
[130arm64-quarterly-job-05] |   `-- Installing indexinfo-0.3.1...
[130arm64-quarterly-job-05] |   `-- Extracting indexinfo-0.3.1: .... done
[130arm64-quarterly-job-05] `-- Extracting gettext-runtime-0.21: .......... done
[130arm64-quarterly-job-05] Extracting gmake-4.3_2: .......... done
===>   cfdg-2.2.2_2 depends on package: gmake>=4.3 - found
===>   Returning to build of cfdg-2.2.2_2
===========================================================================
=======================<phase: lib-depends    >============================
===>   cfdg-2.2.2_2 depends on shared library: libpng.so - not found
===>   Installing existing package /packages/All/png-1.6.37_1.txz
[130arm64-quarterly-job-05] Installing png-1.6.37_1...
[130arm64-quarterly-job-05] Extracting png-1.6.37_1: .......... done
<snip>
        register double a = (*x - tx) * d;
        ^~~~~~~~~
src-agg/include/agg_trans_affine.h:319:9: warning: 'register' storage class specifier is deprecated and incompatible with C++17 [-Wdeprecated-register]
        register double b = (*y - ty) * d;
        ^~~~~~~~~
6 warnings generated.
c++ -O2 -pipe -fstack-protector-strong -fno-strict-aliasing   -Isrc-common -Isrc-unix -Iobjs -Isrc-agg/include -Isrc-common/agg-extras -O3 -Wall -I/usr/local/include/libpng16  -c -o objs/tiledCanvas.o src-common/tiledCanvas.cpp
In file included from src-common/shapeSTL.cpp:26:
In file included from src-common/shapeSTL.h:40:
In file included from src-common/cfdg.h:36:
In file included from src-agg/include/agg_trans_affine.h:29:
src-agg/include/agg_basics.h:215:13: warning: 'register' storage class specifier is deprecated and incompatible with C++17 [-Wdeprecated-register]
            register unsigned q = a * b + (1 << (Shift-1));
            ^~~~~~~~~
In file included from src-common/shapeSTL.cpp:26:
In file included from src-common/shapeSTL.h:40:
In file included from src-common/cfdg.h:36:
src-agg/include/agg_trans_affine.h:301:9: warning: 'register' storage class specifier is deprecated and incompatible with C++17 [-Wdeprecated-register]
        register double tmp = *x;
        ^~~~~~~~~
src-agg/include/agg_trans_affine.h:309:9: warning: 'register' storage class specifier is deprecated and incompatible with C++17 [-Wdeprecated-register]
        register double tmp = *x;
        ^~~~~~~~~
src-agg/include/agg_trans_affine.h:317:9: warning: 'register' storage class specifier is deprecated and incompatible with C++17 [-Wdeprecated-register]
        register double d = determinant_reciprocal();
        ^~~~~~~~~
src-agg/include/agg_trans_affine.h:318:9: warning: 'register' storage class specifier is deprecated and incompatible with C++17 [-Wdeprecated-register]
        register double a = (*x - tx) * d;
        ^~~~~~~~~
src-agg/include/agg_trans_affine.h:319:9: warning: 'register' storage class specifier is deprecated and incompatible with C++17 [-Wdeprecated-register]
        register double b = (*y - ty) * d;
        ^~~~~~~~~
In file included from src-common/tiledCanvas.cpp:25:
In file included from src-common/tiledCanvas.h:28:
In file included from src-agg/include/agg_trans_affine.h:29:
src-agg/include/agg_basics.h:215:13: warning: 'register' storage class specifier is deprecated and incompatible with C++17 [-Wdeprecated-register]
            register unsigned q = a * b + (1 << (Shift-1));
            ^~~~~~~~~
In file included from src-common/tiledCanvas.cpp:25:
In file included from src-common/tiledCanvas.h:28:
src-agg/include/agg_trans_affine.h:301:9: warning: 'register' storage class specifier is deprecated and incompatible with C++17 [-Wdeprecated-register]
        register double tmp = *x;
        ^~~~~~~~~
src-agg/include/agg_trans_affine.h:309:9: warning: 'register' storage class specifier is deprecated and incompatible with C++17 [-Wdeprecated-register]
        register double tmp = *x;
        ^~~~~~~~~
src-agg/include/agg_trans_affine.h:317:9: warning: 'register' storage class specifier is deprecated and incompatible with C++17 [-Wdeprecated-register]
        register double d = determinant_reciprocal();
        ^~~~~~~~~
src-agg/include/agg_trans_affine.h:318:9: warning: 'register' storage class specifier is deprecated and incompatible with C++17 [-Wdeprecated-register]
        register double a = (*x - tx) * d;
        ^~~~~~~~~
src-agg/include/agg_trans_affine.h:319:9: warning: 'register' storage class specifier is deprecated and incompatible with C++17 [-Wdeprecated-register]
        register double b = (*y - ty) * d;
        ^~~~~~~~~
In file included from src-common/shapeSTL.cpp:26:
src-common/shapeSTL.h:155:25: warning: private field 'mSystem' is not used [-Wunused-private-field]
    AbstractSystem&     mSystem;
                        ^
7 warnings generated.
c++ -O2 -pipe -fstack-protector-strong -fno-strict-aliasing   -Isrc-common -Isrc-unix -Iobjs -Isrc-agg/include -Isrc-common/agg-extras -O3 -Wall -I/usr/local/include/libpng16  -c -o objs/pngCanvas.o src-unix/pngCanvas.cpp
In file included from src-unix/pngCanvas.cpp:29:
In file included from src-unix/pngCanvas.h:29:
In file included from src-common/cfdg.h:36:
In file included from src-agg/include/agg_trans_affine.h:29:
src-agg/include/agg_basics.h:215:13: warning: 'register' storage class specifier is deprecated and incompatible with C++17 [-Wdeprecated-register]
            register unsigned q = a * b + (1 << (Shift-1));
            ^~~~~~~~~
In file included from src-unix/pngCanvas.cpp:29:
In file included from src-unix/pngCanvas.h:29:
In file included from src-common/cfdg.h:36:
src-agg/include/agg_trans_affine.h:301:9: warning: 'register' storage class specifier is deprecated and incompatible with C++17 [-Wdeprecated-register]
        register double tmp = *x;
        ^~~~~~~~~
src-agg/include/agg_trans_affine.h:309:9: warning: 'register' storage class specifier is deprecated and incompatible with C++17 [-Wdeprecated-register]
        register double tmp = *x;
        ^~~~~~~~~
src-agg/include/agg_trans_affine.h:317:9: warning: 'register' storage class specifier is deprecated and incompatible with C++17 [-Wdeprecated-register]
        register double d = determinant_reciprocal();
        ^~~~~~~~~
src-agg/include/agg_trans_affine.h:318:9: warning: 'register' storage class specifier is deprecated and incompatible with C++17 [-Wdeprecated-register]
        register double a = (*x - tx) * d;
        ^~~~~~~~~
src-agg/include/agg_trans_affine.h:319:9: warning: 'register' storage class specifier is deprecated and incompatible with C++17 [-Wdeprecated-register]
        register double b = (*y - ty) * d;
        ^~~~~~~~~
6 warnings generated.
c++ -O2 -pipe -fstack-protector-strong -fno-strict-aliasing   -Isrc-common -Isrc-unix -Iobjs -Isrc-agg/include -Isrc-common/agg-extras -O3 -Wall -I/usr/local/include/libpng16  -c -o objs/posixSystem.o src-unix/posixSystem.cpp
6 warnings generated.
c++ -O2 -pipe -fstack-protector-strong -fno-strict-aliasing   -Isrc-common -Isrc-unix -Iobjs -Isrc-agg/include -Isrc-common/agg-extras -O3 -Wall -I/usr/local/include/libpng16  -c -o objs/main.o src-unix/main.cpp
In file included from src-unix/posixSystem.cpp:29:
In file included from src-unix/posixSystem.h:32:
In file included from src-common/cfdg.h:36:
In file included from src-agg/include/agg_trans_affine.h:29:
src-agg/include/agg_basics.h:215:13: warning: 'register' storage class specifier is deprecated and incompatible with C++17 [-Wdeprecated-register]
            register unsigned q = a * b + (1 << (Shift-1));
            ^~~~~~~~~
In file included from src-unix/posixSystem.cpp:29:
In file included from src-unix/posixSystem.h:32:
In file included from src-common/cfdg.h:36:
src-agg/include/agg_trans_affine.h:301:9: warning: 'register' storage class specifier is deprecated and incompatible with C++17 [-Wdeprecated-register]
        register double tmp = *x;
        ^~~~~~~~~
src-agg/include/agg_trans_affine.h:309:9: warning: 'register' storage class specifier is deprecated and incompatible with C++17 [-Wdeprecated-register]
        register double tmp = *x;
        ^~~~~~~~~
src-agg/include/agg_trans_affine.h:317:9: warning: 'register' storage class specifier is deprecated and incompatible with C++17 [-Wdeprecated-register]
        register double d = determinant_reciprocal();
        ^~~~~~~~~
src-agg/include/agg_trans_affine.h:318:9: warning: 'register' storage class specifier is deprecated and incompatible with C++17 [-Wdeprecated-register]
        register double a = (*x - tx) * d;
        ^~~~~~~~~
src-agg/include/agg_trans_affine.h:319:9: warning: 'register' storage class specifier is deprecated and incompatible with C++17 [-Wdeprecated-register]
        register double b = (*y - ty) * d;
        ^~~~~~~~~
src-unix/posixSystem.cpp:112:2: warning: 'delete' applied to a pointer that was allocated with 'new[]'; did you mean 'delete[]'? [-Wmismatched-new-delete]
        delete b;
        ^
              []
src-unix/posixSystem.cpp:95:12: note: allocated with 'new[]' here
        char* b = new char[t.size() + 1];
                  ^
In file included from src-unix/main.cpp:38:
In file included from src-common/cfdg.h:36:
In file included from src-agg/include/agg_trans_affine.h:29:
src-agg/include/agg_basics.h:215:13: warning: 'register' storage class specifier is deprecated and incompatible with C++17 [-Wdeprecated-register]
            register unsigned q = a * b + (1 << (Shift-1));
            ^~~~~~~~~
In file included from src-unix/main.cpp:38:
In file included from src-common/cfdg.h:36:
src-agg/include/agg_trans_affine.h:301:9: warning: 'register' storage class specifier is deprecated and incompatible with C++17 [-Wdeprecated-register]
        register double tmp = *x;
        ^~~~~~~~~
src-agg/include/agg_trans_affine.h:309:9: warning: 'register' storage class specifier is deprecated and incompatible with C++17 [-Wdeprecated-register]
        register double tmp = *x;
        ^~~~~~~~~
src-agg/include/agg_trans_affine.h:317:9: warning: 'register' storage class specifier is deprecated and incompatible with C++17 [-Wdeprecated-register]
        register double d = determinant_reciprocal();
        ^~~~~~~~~
src-agg/include/agg_trans_affine.h:318:9: warning: 'register' storage class specifier is deprecated and incompatible with C++17 [-Wdeprecated-register]
        register double a = (*x - tx) * d;
        ^~~~~~~~~
src-agg/include/agg_trans_affine.h:319:9: warning: 'register' storage class specifier is deprecated and incompatible with C++17 [-Wdeprecated-register]
        register double b = (*y - ty) * d;
        ^~~~~~~~~
7 warnings generated.
c++ -O2 -pipe -fstack-protector-strong -fno-strict-aliasing   -Isrc-common -Isrc-unix -Iobjs -Isrc-agg/include -Isrc-common/agg-extras -O3 -Wall -I/usr/local/include/libpng16  -c -o objs/posixTimer.o src-unix/posixTimer.cpp
In file included from src-unix/posixTimer.cpp:25:
In file included from src-common/cfdg.h:36:
In file included from src-agg/include/agg_trans_affine.h:29:
src-agg/include/agg_basics.h:215:13: warning: 'register' storage class specifier is deprecated and incompatible with C++17 [-Wdeprecated-register]
            register unsigned q = a * b + (1 << (Shift-1));
            ^~~~~~~~~
In file included from src-unix/posixTimer.cpp:25:
In file included from src-common/cfdg.h:36:
src-agg/include/agg_trans_affine.h:301:9: warning: 'register' storage class specifier is deprecated and incompatible with C++17 [-Wdeprecated-register]
        register double tmp = *x;
        ^~~~~~~~~
src-agg/include/agg_trans_affine.h:309:9: warning: 'register' storage class specifier is deprecated and incompatible with C++17 [-Wdeprecated-register]
        register double tmp = *x;
        ^~~~~~~~~
src-agg/include/agg_trans_affine.h:317:9: warning: 'register' storage class specifier is deprecated and incompatible with C++17 [-Wdeprecated-register]
        register double d = determinant_reciprocal();
        ^~~~~~~~~
src-agg/include/agg_trans_affine.h:318:9: warning: 'register' storage class specifier is deprecated and incompatible with C++17 [-Wdeprecated-register]
        register double a = (*x - tx) * d;
        ^~~~~~~~~
src-agg/include/agg_trans_affine.h:319:9: warning: 'register' storage class specifier is deprecated and incompatible with C++17 [-Wdeprecated-register]
        register double b = (*y - ty) * d;
        ^~~~~~~~~
6 warnings generated.
c++ -O2 -pipe -fstack-protector-strong -fno-strict-aliasing   -Isrc-common -Isrc-unix -Iobjs -Isrc-agg/include -Isrc-common/agg-extras -O3 -Wall -I/usr/local/include/libpng16  -c -o objs/posixVersion.o src-unix/posixVersion.cpp
cc -O2 -pipe  -fstack-protector-strong -fno-strict-aliasing  -Isrc-common -Isrc-unix -Iobjs -Isrc-agg/include -Isrc-common/agg-extras -O3 -Wall -I/usr/local/include/libpng16  -c -o objs/lex.yy.o objs/lex.yy.c
<stdout>:862:8: error: conflicting types for 'yyget_leng'
                        int yyget_leng ( void );
                            ^
src-common/yglue.h:54:8: note: previous declaration is here
size_t yyget_leng  (void);
       ^
<stdout>:2041:40: warning: implicit declaration of function 'isatty' is invalid in C99 [-Wimplicit-function-declaration]
        b->yy_is_interactive = file ? (isatty( fileno(file) ) > 0) : 0;
                                       ^
<stdout>:2314:5: error: conflicting types for 'yyget_leng'
int yyget_leng  (void)
    ^
src-common/yglue.h:54:8: note: previous declaration is here
size_t yyget_leng  (void);
       ^
1 warning and 2 errors generated.
6 warnings generated.
gmake[1]: *** [Makefile:115: objs/lex.yy.o] Error 1
gmake[1]: *** Waiting for unfinished jobs....
gmake[1]: Leaving directory '/wrkdirs/usr/ports/graphics/cfdg/work/ContextFreeSource2.2.2.tgz'
===> Compilation failed unexpectedly.
Try to set MAKE_JOBS_UNSAFE=yes and rebuild before reporting the failure to
the maintainer.
*** Error code 1

Stop.
make: stopped in /usr/ports/graphics/cfdg
Received on Sun Jun 27 2021 - 15:19:27 UTC

Original text of this message