[package - 130powerpc64-quarterly][science/dakota] Failed for dakota-6.13.0_2 in build

From: <pkg-fallout_at_FreeBSD.org>
Date: Sun, 27 Jun 2021 14:45:42 GMT
You are receiving this mail as a port that you maintain
is failing to build on the FreeBSD package build server.
Please investigate the failure and submit a PR to fix
build.

Maintainer:     yuri_at_FreeBSD.org
Log URL:        http://foul1.nyi.freebsd.org/data/130powerpc64-quarterly/3a6240c21278/logs/dakota-6.13.0_2.log
Build URL:      http://foul1.nyi.freebsd.org/build.html?mastername=130powerpc64-quarterly&build=3a6240c21278
Log:

=>> Building science/dakota
build started at Sun Jun 27 14:38:44 UTC 2021
port directory: /usr/ports/science/dakota
package name: dakota-6.13.0_2
building for: FreeBSD 130powerpc64-quarterly-job-13 13.0-RELEASE FreeBSD 13.0-RELEASE powerpc
maintained by: yuri_at_FreeBSD.org
Makefile ident: 
Poudriere version: 3.2.8-8-gaf08dbda
Host OSVERSION: 1400008
Jail OSVERSION: 1300139
Job Id: 13

---Begin Environment---
SHELL=/bin/csh
OSVERSION=1300139
UNAME_v=FreeBSD 13.0-RELEASE
UNAME_r=13.0-RELEASE
BLOCKSIZE=K
MAIL=/var/mail/root
MM_CHARSET=UTF-8
LANG=C.UTF-8
STATUS=1
HOME=/root
PATH=/sbin:/bin:/usr/sbin:/usr/bin:/usr/local/sbin:/usr/local/bin:/root/bin
LOCALBASE=/usr/local
USER=root
LIBEXECPREFIX=/usr/local/libexec/poudriere
POUDRIERE_VERSION=3.2.8-8-gaf08dbda
MASTERMNT=/usr/local/poudriere/data/.m/130powerpc64-quarterly/ref
POUDRIERE_BUILD_TYPE=bulk
PACKAGE_BUILDING=yes
SAVED_TERM=
PWD=/usr/local/poudriere/data/.m/130powerpc64-quarterly/ref/.p/pool
P_PORTS_FEATURES=FLAVORS SELECTED_OPTIONS
MASTERNAME=130powerpc64-quarterly
SCRIPTPREFIX=/usr/local/share/poudriere
OLDPWD=/usr/local/poudriere/data/.m/130powerpc64-quarterly/ref/.p
SCRIPTPATH=/usr/local/share/poudriere/bulk.sh
POUDRIEREPATH=/usr/local/bin/poudriere
---End Environment---

---Begin Poudriere Port Flags/Env---
PORT_FLAGS=
PKGENV=
FLAVOR=
DEPENDS_ARGS=
MAKE_ARGS=
---End Poudriere Port Flags/Env---

---Begin OPTIONS List---
===> The following configuration options are available for dakota-6.13.0_2:
     GSL=on: GSL support
     GUI=off: Build the Dakota/Motif Graphics package
     HDF5=on: HDF-5 data format support
===> Use 'make config' to modify these settings
---End OPTIONS List---

--MAINTAINER--
yuri_at_FreeBSD.org
--End MAINTAINER--

--CONFIGURE_ARGS--

--End CONFIGURE_ARGS--

--CONFIGURE_ENV--
F77="gfortran10" FC="gfortran10" FFLAGS="-O -fallow-argument-mismatch -Wl,-rpath=/usr/local/lib/gcc10" FCFLAGS="-Wl,-rpath=/usr/local/lib/gcc10" ac_cv_path_PERL=/usr/local/bin/perl ac_cv_path_PERL_PATH=/usr/local/bin/perl  PERL_USE_UNSAFE_INC=1 PYTHON="/usr/local/bin/python3.7" XDG_DATA_HOME=/wrkdirs/usr/ports/science/dakota/work  XDG_CONFIG_HOME=/wrkdirs/usr/ports/science/dakota/work  HOME=/wrkdirs/usr/ports/science/dakota/work TMPDIR="/tmp" PATH=/wrkdirs/usr/ports/science/dakota/work/.bin:/sbin:/bin:/usr/sbin:/usr/bin:/usr/local/sbin:/usr/local/bin:/root/bin SHELL=/bin/sh CONFIG_SHELL=/bin/sh
--End CONFIGURE_ENV--

--MAKE_ENV--
F77="gfortran10" FC="gfortran10" FFLAGS="-O -fallow-argument-mismatch -Wl,-rpath=/usr/local/lib/gcc10" FCFLAGS="-Wl,-rpath=/usr/local/lib/gcc10" PERL_USE_UNSAFE_INC=1 XDG_DATA_HOME=/wrkdirs/usr/ports/science/dakota/work  XDG_CONFIG_HOME=/wrkdirs/usr/ports/science/dakota/work  HOME=/wrkdirs/usr/ports/science/dakota/work TMPDIR="/tmp" PATH=/wrkdirs/usr/ports/science/dakota/work/.bin:/sbin:/bin:/usr/sbin:/usr/bin:/usr/local/sbin:/usr/local/bin:/root/bin NO_PIE=yes MK_DEBUG_FILES=no MK_KERNEL_SYMBOLS=no SHELL=/bin/sh NO_LINT=YES ADDR2LINE="/usr/local/bin/addr2line" AR="/usr/local/bin/ar" AS="/usr/local/bin/as" CPPFILT="/usr/local/bin/c++filt" GPROF="/usr/local/bin/gprof" LD="/usr/local/bin/ld" NM="/usr/local/bin/nm" OBJCOPY="/usr/local/bin/objcopy" OBJDUMP="/usr/local/bin/objdump" RANLIB="/usr/local/bin/ranlib" READELF="/usr/local/bin/readelf" SIZE="/usr/local/bin/size" STRINGS="/usr/local/bin/strings" PREFIX=/usr/local  LOCALBASE=/usr/local  CC="cc" CFLAGS="-O2 -pipe  -fstack-protector-
 strong -fno-strict-aliasing "  CPP="cpp" CPPFLAGS=""  LDFLAGS=" -lexecinfo -Wl,-rpath=/usr/local/lib/gcc10  -L/usr/local/lib/gcc10 -B/usr/local/bin -fstack-protector-strong " LIBS=""  CXX="c++" CXXFLAGS="-O2 -pipe -fstack-protector-strong -fno-strict-aliasing  "  MANPREFIX="/usr/local" BSD_INSTALL_PROGRAM="install  -s -m 555"  BSD_INSTALL_LIB="install  -s -m 0644"  BSD_INSTALL_SCRIPT="install  -m 555"  BSD_INSTALL_DATA="install  -m 0644"  BSD_INSTALL_MAN="install  -m 444"
--End MAKE_ENV--

--PLIST_SUB--
GSL="" NO_GSL="_at_comment " GUI="_at_comment " NO_GUI="" HDF5="" NO_HDF5="_at_comment " CMAKE_BUILD_TYPE="release" PYTHON_INCLUDEDIR=include/python3.7m  PYTHON_LIBDIR=lib/python3.7  PYTHON_PLATFORM=freebsd13  PYTHON_SITELIBDIR=lib/python3.7/site-packages  PYTHON_SUFFIX=37  PYTHON_EXT_SUFFIX=  PYTHON_VER=3.7  PYTHON_VERSION=python3.7 PYTHON2="_at_comment " PYTHON3="" OSREL=13.0 PREFIX=%D LOCALBASE=/usr/local  RESETPREFIX=/usr/local LIB32DIR=lib PERL_VERSION=5.32.1  PERL_VER=5.32  PERL5_MAN1=lib/perl5/site_perl/man/man1  PERL5_MAN3=lib/perl5/site_perl/man/man3  SITE_PERL=lib/perl5/site_perl  SITE_ARCH=lib/perl5/site_perl/mach/5.32 DOCSDIR="share/doc/dakota"  EXAMPLESDIR="share/examples/dakota"  DATADIR="share/dakota"  WWWDIR="www/dakota"  ETCDIR="etc/dakota"
--End PLIST_SUB--

--SUB_LIST--
GSL="" NO_GSL="_at_comment " GUI="_at_comment " NO_GUI="" HDF5="" NO_HDF5="_at_comment " PREFIX=/usr/local LOCALBASE=/usr/local  DATADIR=/usr/local/share/dakota DOCSDIR=/usr/local/share/doc/dakota EXAMPLESDIR=/usr/local/share/examples/dakota  WWWDIR=/usr/local/www/dakota ETCDIR=/usr/local/etc/dakota
--End SUB_LIST--

---Begin make.conf---
USE_PACKAGE_DEPENDS=yes
BATCH=yes
WRKDIRPREFIX=/wrkdirs
PORTSDIR=/usr/ports
PACKAGES=/packages
DISTDIR=/distfiles
PACKAGE_BUILDING=yes
PACKAGE_BUILDING_FLAVORS=yes
#### /usr/local/etc/poudriere.d/make.conf ####
# XXX: We really need this but cannot use it while 'make checksum' does not
# try the next mirror on checksum failure.  It currently retries the same
# failed mirror and then fails rather then trying another.  It *does*
# try the next if the size is mismatched though.
#MASTER_SITE_FREEBSD=yes
# Build ALLOW_MAKE_JOBS_PACKAGES with 2 jobs
MAKE_JOBS_NUMBER=2
#### /usr/ports/Mk/Scripts/ports_env.sh ####
_CCVERSION_921dbbb2=FreeBSD clang version 11.0.1 (git_at_github.com:llvm/llvm-project.git llvmorg-11.0.1-0-g43ff75f2c3fe) Target: powerpc64-unknown-freebsd13.0 Thread model: posix InstalledDir: /usr/bin
_ALTCCVERSION_921dbbb2=none
_CXXINTERNAL_acaad9ca=FreeBSD clang version 11.0.1 (git_at_github.com:llvm/llvm-project.git llvmorg-11.0.1-0-g43ff75f2c3fe) Target: powerpc64-unknown-freebsd13.0 Thread model: posix InstalledDir: /usr/bin "/usr/bin/ld" "--eh-frame-hdr" "-dynamic-linker" "/libexec/ld-elf.so.1" "--enable-new-dtags" "-o" "a.out" "/usr/lib/crt1.o" "/usr/lib/crti.o" "/usr/lib/crtbegin.o" "-L/usr/lib" "/dev/null" "-lc++" "-lm" "-lgcc" "--as-needed" "-lgcc_s" "--no-as-needed" "-lc" "-lgcc" "--as-needed" "-lgcc_s" "--no-as-needed" "/usr/lib/crtend.o" "/usr/lib/crtn.o"
CC_OUTPUT_921dbbb2_58173849=yes
CC_OUTPUT_921dbbb2_9bdba57c=yes
CC_OUTPUT_921dbbb2_6a4fe7f5=yes
CC_OUTPUT_921dbbb2_6bcac02b=yes
CC_OUTPUT_921dbbb2_67d20829=yes
CC_OUTPUT_921dbbb2_bfa62e83=yes
CC_OUTPUT_921dbbb2_f0b4d593=yes
CC_OUTPUT_921dbbb2_308abb44=yes
CC_OUTPUT_921dbbb2_f00456e5=yes
CC_OUTPUT_921dbbb2_65ad290d=yes
CC_OUTPUT_921dbbb2_f2776b26=yes
CC_OUTPUT_921dbbb2_b2657cc3=yes
CC_OUTPUT_921dbbb2_380987f7=yes
CC_OUTPUT_921dbbb2_160933ec=yes
CC_OUTPUT_921dbbb2_fb62803b=yes
_OBJC_CCVERSION_921dbbb2=FreeBSD clang version 11.0.1 (git_at_github.com:llvm/llvm-project.git llvmorg-11.0.1-0-g43ff75f2c3fe) Target: powerpc64-unknown-freebsd13.0 Thread model: posix InstalledDir: /usr/bin
_OBJC_ALTCCVERSION_921dbbb2=none
ARCH=powerpc64
PPC_ABI=ELFv2
OPSYS=FreeBSD
_OSRELEASE=13.0-RELEASE
OSREL=13.0
OSVERSION=1300139
PYTHONBASE=/usr/local
CONFIGURE_MAX_CMD_LEN=524288
HAVE_PORTS_ENV=1
#### Misc Poudriere ####
GID=0
UID=0
---End make.conf---
--Resource limits--
cpu time               (seconds, -t)  unlimited
file size           (512-blocks, -f)  unlimited
data seg size           (kbytes, -d)  33554432
stack size              (kbytes, -s)  524288
core file size      (512-blocks, -c)  unlimited
max memory size         (kbytes, -m)  unlimited
locked memory           (kbytes, -l)  unlimited
max user processes              (-u)  89999
open files                      (-n)  1024
virtual mem size        (kbytes, -v)  unlimited
swap limit              (kbytes, -w)  unlimited
socket buffer size       (bytes, -b)  unlimited
pseudo-terminals                (-p)  unlimited
kqueues                         (-k)  unlimited
umtx shared locks               (-o)  unlimited
--End resource limits--
=======================<phase: check-sanity   >============================
===>  License LGPL21 accepted by the user
===========================================================================
=======================<phase: pkg-depends    >============================
===>   dakota-6.13.0_2 depends on file: /usr/local/sbin/pkg - not found
===>   Installing existing package /packages/All/pkg-1.16.3.txz
[130powerpc64-quarterly-job-13] Installing pkg-1.16.3...
[130powerpc64-quarterly-job-13] Extracting pkg-1.16.3: .......... done
===>   dakota-6.13.0_2 depends on file: /usr/local/sbin/pkg - found
===>   Returning to build of dakota-6.13.0_2
===========================================================================
=======================<phase: fetch-depends  >============================
===========================================================================
=======================<phase: fetch          >============================
===>  License LGPL21 accepted by the user
===> Fetching all distfiles required by dakota-6.13.0_2 for building
===========================================================================
=======================<phase: checksum       >============================
===>  License LGPL21 accepted by the user
===> Fetching all distfiles required by dakota-6.13.0_2 for building
=> SHA256 Checksum OK for dakota-6.13.0-release-public.src-UI.tar.gz.
===========================================================================
=======================<phase: extract-depends>============================
===========================================================================
=======================<phase: extract        >============================
===>  License LGPL21 accepted by the user
===> Fetching all distfiles required by dakota-6.13.0_2 for building
===>  Extracting for dakota-6.13.0_2
=> SHA256 Checksum OK for dakota-6.13.0-release-public.src-UI.tar.gz.
===========================================================================
=======================<phase: patch-depends  >============================
===========================================================================
=======================<phase: patch          >============================
===>  Patching for dakota-6.13.0_2
===>  Applying FreeBSD patches for dakota-6.13.0_2 from /usr/ports/science/dakota/files
===========================================================================
=======================<phase: build-depends  >============================
===>   dakota-6.13.0_2 depends on file: /usr/local/bin/cmake - not found
===>   Installing existing package /packages/All/cmake-3.19.6.txz
[130powerpc64-quarterly-job-13] Installing cmake-3.19.6...
[130powerpc64-quarterly-job-13] `-- Installing curl-7.76.0...
[130powerpc64-quarterly-job-13] |   `-- Installing ca_root_nss-3.63...
[130powerpc64-quarterly-job-13] |   `-- Extracting ca_root_nss-3.63: ........ done
[130powerpc64-quarterly-job-13] |   `-- Installing libnghttp2-1.43.0...
[130powerpc64-quarterly-job-13] |   `-- Extracting libnghttp2-1.43.0: .......... done
[130powerpc64-quarterly-job-13] `-- Extracting curl-7.76.0: .......... done
[130powerpc64-quarterly-job-13] `-- Installing expat-2.4.1...
[130powerpc64-quarterly-job-13] `-- Extracting expat-2.4.1: .......... done
[130powerpc64-quarterly-job-13] `-- Installing jsoncpp-1.9.4...
[130powerpc64-quarterly-job-13] `-- Extracting jsoncpp-1.9.4: .......... done
<snip>
cd /wrkdirs/usr/ports/science/dakota/work/.build && /usr/local/bin/cmake -E cmake_depends "Unix Makefiles" /wrkdirs/usr/ports/science/dakota/work/dakota-6.13.0-release-public.src-UI /wrkdirs/usr/ports/science/dakota/work/dakota-6.13.0-release-public.src-UI/packages/external/nidr /wrkdirs/usr/ports/science/dakota/work/.build /wrkdirs/usr/ports/science/dakota/work/.build/packages/external/nidr /wrkdirs/usr/ports/science/dakota/work/.build/packages/external/nidr/CMakeFiles/nidr.dir/DependInfo.cmake
Scanning dependencies of target nidr
/usr/bin/make  -f packages/external/nidr/CMakeFiles/nidr.dir/build.make packages/external/nidr/CMakeFiles/nidr.dir/build
--- packages/external/nidr/CMakeFiles/nidr.dir/nidr-scanner.c.o ---
[  2%] Building C object packages/external/nidr/CMakeFiles/nidr.dir/nidr-scanner.c.o
cd /wrkdirs/usr/ports/science/dakota/work/.build/packages/external/nidr && /usr/bin/cc -DHAVE_CONFIG_H -DHAVE_DAKOTA_SURROGATES -DNO_NIDR_DYNLIB -Dnidr_EXPORTS -I/wrkdirs/usr/ports/science/dakota/work/dakota-6.13.0-release-public.src-UI/packages/external/nidr -I/wrkdirs/usr/ports/science/dakota/work/.build/packages/external/nidr -O2 -pipe  -fstack-protector-strong -fno-strict-aliasing -O2 -pipe  -fstack-protector-strong -fno-strict-aliasing -fPIC -o CMakeFiles/nidr.dir/nidr-scanner.c.o -c /wrkdirs/usr/ports/science/dakota/work/dakota-6.13.0-release-public.src-UI/packages/external/nidr/nidr-scanner.c
/wrkdirs/usr/ports/science/dakota/work/dakota-6.13.0-release-public.src-UI/packages/external/nidr/nidr-scanner.c:1673:35: warning: implicit declaration of function 'isatty' is invalid in C99 [-Wimplicit-function-declaration]
        b->nidr_is_interactive = file ? (isatty( fileno(file) ) > 0) : 0;
                                         ^
1 warning generated.
--- packages/external/nidr/CMakeFiles/nidr.dir/nidr-parser.c.o ---
[  2%] Building C object packages/external/nidr/CMakeFiles/nidr.dir/nidr-parser.c.o
cd /wrkdirs/usr/ports/science/dakota/work/.build/packages/external/nidr && /usr/bin/cc -DHAVE_CONFIG_H -DHAVE_DAKOTA_SURROGATES -DNO_NIDR_DYNLIB -Dnidr_EXPORTS -I/wrkdirs/usr/ports/science/dakota/work/dakota-6.13.0-release-public.src-UI/packages/external/nidr -I/wrkdirs/usr/ports/science/dakota/work/.build/packages/external/nidr -O2 -pipe  -fstack-protector-strong -fno-strict-aliasing -O2 -pipe  -fstack-protector-strong -fno-strict-aliasing -fPIC -o CMakeFiles/nidr.dir/nidr-parser.c.o -c /wrkdirs/usr/ports/science/dakota/work/dakota-6.13.0-release-public.src-UI/packages/external/nidr/nidr-parser.c
--- packages/external/nidr/CMakeFiles/nidr.dir/avltree.c.o ---
[  2%] Building C object packages/external/nidr/CMakeFiles/nidr.dir/avltree.c.o
cd /wrkdirs/usr/ports/science/dakota/work/.build/packages/external/nidr && /usr/bin/cc -DHAVE_CONFIG_H -DHAVE_DAKOTA_SURROGATES -DNO_NIDR_DYNLIB -Dnidr_EXPORTS -I/wrkdirs/usr/ports/science/dakota/work/dakota-6.13.0-release-public.src-UI/packages/external/nidr -I/wrkdirs/usr/ports/science/dakota/work/.build/packages/external/nidr -O2 -pipe  -fstack-protector-strong -fno-strict-aliasing -O2 -pipe  -fstack-protector-strong -fno-strict-aliasing -fPIC -o CMakeFiles/nidr.dir/avltree.c.o -c /wrkdirs/usr/ports/science/dakota/work/dakota-6.13.0-release-public.src-UI/packages/external/nidr/avltree.c
--- packages/external/nidr/CMakeFiles/nidr.dir/nidr.c.o ---
[  2%] Building C object packages/external/nidr/CMakeFiles/nidr.dir/nidr.c.o
cd /wrkdirs/usr/ports/science/dakota/work/.build/packages/external/nidr && /usr/bin/cc -DHAVE_CONFIG_H -DHAVE_DAKOTA_SURROGATES -DNO_NIDR_DYNLIB -Dnidr_EXPORTS -I/wrkdirs/usr/ports/science/dakota/work/dakota-6.13.0-release-public.src-UI/packages/external/nidr -I/wrkdirs/usr/ports/science/dakota/work/.build/packages/external/nidr -O2 -pipe  -fstack-protector-strong -fno-strict-aliasing -O2 -pipe  -fstack-protector-strong -fno-strict-aliasing -fPIC -o CMakeFiles/nidr.dir/nidr.c.o -c /wrkdirs/usr/ports/science/dakota/work/dakota-6.13.0-release-public.src-UI/packages/external/nidr/nidr.c
/wrkdirs/usr/ports/science/dakota/work/dakota-6.13.0-release-public.src-UI/packages/external/nidr/nidr.c:171:11: warning: adding 'int' to a string does not append to the string [-Wstring-plus-int]
                        n, "s" + (n == 1));
                           ~~~~^~~~~~~~~~
/wrkdirs/usr/ports/science/dakota/work/dakota-6.13.0-release-public.src-UI/packages/external/nidr/nidr.c:171:11: note: use array indexing to silence this warning
                        n, "s" + (n == 1));
                               ^
                           &   [         ]
/wrkdirs/usr/ports/science/dakota/work/dakota-6.13.0-release-public.src-UI/packages/external/nidr/nidr.c:430:7: warning: logical not is only applied to the left hand side of this bitwise operator [-Wlogical-not-parentheses]
                if (!pathadj & 2)
                    ^        ~
/wrkdirs/usr/ports/science/dakota/work/dakota-6.13.0-release-public.src-UI/packages/external/nidr/nidr.c:430:7: note: add parentheses after the '!' to evaluate the bitwise operator first
                if (!pathadj & 2)
                    ^
                     (          )
/wrkdirs/usr/ports/science/dakota/work/dakota-6.13.0-release-public.src-UI/packages/external/nidr/nidr.c:430:7: note: add parentheses around left hand side expression to silence this warning
                if (!pathadj & 2)
                    ^
                    (       )
/wrkdirs/usr/ports/science/dakota/work/dakota-6.13.0-release-public.src-UI/packages/external/nidr/nidr.c:2231:7: warning: adding 'int' to a string does not append to the string [-Wstring-plus-int]
                "s" + (n == 1), kw->name);
                ~~~~^~~~~~~~~~
/wrkdirs/usr/ports/science/dakota/work/dakota-6.13.0-release-public.src-UI/packages/external/nidr/nidr.c:2231:7: note: use array indexing to silence this warning
                "s" + (n == 1), kw->name);
                    ^
                &   [         ]
/wrkdirs/usr/ports/science/dakota/work/dakota-6.13.0-release-public.src-UI/packages/external/nidr/nidr.c:2278:11: warning: adding 'int' to a string does not append to the string [-Wstring-plus-int]
                                                "s" + (n == 1), kw->name);
                                                ~~~~^~~~~~~~~~
/wrkdirs/usr/ports/science/dakota/work/dakota-6.13.0-release-public.src-UI/packages/external/nidr/nidr.c:2278:11: note: use array indexing to silence this warning
                                                "s" + (n == 1), kw->name);
                                                    ^
                                                &   [         ]
--- packages/CMakeFiles/MUQ.dir/all ---
Scanning dependencies of target muqModeling
[ 17%] Building CXX object CMakeFiles/muqModeling.dir/modules/Modeling/src/WorkPiece.cpp.o
--- packages/external/nidr/CMakeFiles/nidr.dir/all ---
4 warnings generated.
--- packages/external/nidr/libnidr.so ---
[  2%] Linking C shared library libnidr.so
cd /wrkdirs/usr/ports/science/dakota/work/.build/packages/external/nidr && /usr/local/bin/cmake -E cmake_link_script CMakeFiles/nidr.dir/link.txt --verbose=1
/usr/bin/cc -fPIC -O2 -pipe  -fstack-protector-strong -fno-strict-aliasing -O2 -pipe  -fstack-protector-strong -fno-strict-aliasing  -lexecinfo -Wl,-rpath=/usr/local/lib/gcc10  -L/usr/local/lib/gcc10 -B/usr/local/bin -fstack-protector-strong -shared -Wl,-soname,libnidr.so -o libnidr.so CMakeFiles/nidr.dir/nidr-scanner.c.o CMakeFiles/nidr.dir/nidr-parser.c.o CMakeFiles/nidr.dir/avltree.c.o CMakeFiles/nidr.dir/nidr.c.o  -Wl,-rpath,::::::::::::::::::::::::::::::::::::: 
[  2%] Built target nidr
--- packages/external/nidr/CMakeFiles/nidrgen.dir/all ---
/usr/bin/make  -f packages/external/nidr/CMakeFiles/nidrgen.dir/build.make packages/external/nidr/CMakeFiles/nidrgen.dir/depend
--- packages/external/nidr/CMakeFiles/nidrgen.dir/depend ---
cd /wrkdirs/usr/ports/science/dakota/work/.build && /usr/local/bin/cmake -E cmake_depends "Unix Makefiles" /wrkdirs/usr/ports/science/dakota/work/dakota-6.13.0-release-public.src-UI /wrkdirs/usr/ports/science/dakota/work/dakota-6.13.0-release-public.src-UI/packages/external/nidr /wrkdirs/usr/ports/science/dakota/work/.build /wrkdirs/usr/ports/science/dakota/work/.build/packages/external/nidr /wrkdirs/usr/ports/science/dakota/work/.build/packages/external/nidr/CMakeFiles/nidrgen.dir/DependInfo.cmake
Scanning dependencies of target nidrgen
/usr/bin/make  -f packages/external/nidr/CMakeFiles/nidrgen.dir/build.make packages/external/nidr/CMakeFiles/nidrgen.dir/build
--- packages/external/nidr/CMakeFiles/nidrgen.dir/nidrgen.c.o ---
[  2%] Building C object packages/external/nidr/CMakeFiles/nidrgen.dir/nidrgen.c.o
cd /wrkdirs/usr/ports/science/dakota/work/.build/packages/external/nidr && /usr/bin/cc -DHAVE_CONFIG_H -DHAVE_DAKOTA_SURROGATES -DNO_NIDR_DYNLIB -I/wrkdirs/usr/ports/science/dakota/work/dakota-6.13.0-release-public.src-UI/packages/external/nidr -I/wrkdirs/usr/ports/science/dakota/work/.build/packages/external/nidr -O2 -pipe  -fstack-protector-strong -fno-strict-aliasing -O2 -pipe  -fstack-protector-strong -fno-strict-aliasing -o CMakeFiles/nidrgen.dir/nidrgen.c.o -c /wrkdirs/usr/ports/science/dakota/work/dakota-6.13.0-release-public.src-UI/packages/external/nidr/nidrgen.c
/wrkdirs/usr/ports/science/dakota/work/dakota-6.13.0-release-public.src-UI/packages/external/nidr/nidrgen.c:1544:10: warning: 9 enumeration values not handled in switch: 'PPar_started', 'PPar_leftpar', 'Dupchecking'... [-Wswitch]
                switch(kw1->parstate) {
                       ^
/wrkdirs/usr/ports/science/dakota/work/dakota-6.13.0-release-public.src-UI/packages/external/nidr/nidrgen.c:3800:11: warning: format string is not a string literal (potentially insecure) [-Wformat-security]
                        printf(z->b = z->buf);
                               ^~~~~~~~~~~~~
/wrkdirs/usr/ports/science/dakota/work/dakota-6.13.0-release-public.src-UI/packages/external/nidr/nidrgen.c:3800:11: note: treat the string as an argument to avoid this
                        printf(z->b = z->buf);
                               ^
                               "%s", 
/wrkdirs/usr/ports/science/dakota/work/dakota-6.13.0-release-public.src-UI/packages/external/nidr/nidrgen.c:3835:11: warning: format string is not a string literal (potentially insecure) [-Wformat-security]
                        printf(z->b = z->buf);
                               ^~~~~~~~~~~~~
/wrkdirs/usr/ports/science/dakota/work/dakota-6.13.0-release-public.src-UI/packages/external/nidr/nidrgen.c:3835:11: note: treat the string as an argument to avoid this
                        printf(z->b = z->buf);
                               ^
                               "%s", 
/wrkdirs/usr/ports/science/dakota/work/dakota-6.13.0-release-public.src-UI/packages/external/nidr/nidrgen.c:3858:11: warning: format string is not a string literal (potentially insecure) [-Wformat-security]
                        printf(z->b = z->buf);
                               ^~~~~~~~~~~~~
/wrkdirs/usr/ports/science/dakota/work/dakota-6.13.0-release-public.src-UI/packages/external/nidr/nidrgen.c:3858:11: note: treat the string as an argument to avoid this
                        printf(z->b = z->buf);
                               ^
                               "%s", 
/wrkdirs/usr/ports/science/dakota/work/dakota-6.13.0-release-public.src-UI/packages/external/nidr/nidrgen.c:4202:28: warning: adding 'int' to a string does not append to the string [-Wstring-plus-int]
                sl->val, sl->Lineno, "s" + (sl2 == sl1), sl1->Lineno);
                                     ~~~~^~~~~~~~~~~~~~
/wrkdirs/usr/ports/science/dakota/work/dakota-6.13.0-release-public.src-UI/packages/external/nidr/nidrgen.c:4202:28: note: use array indexing to silence this warning
                sl->val, sl->Lineno, "s" + (sl2 == sl1), sl1->Lineno);
                                         ^
                                     &   [             ]
/wrkdirs/usr/ports/science/dakota/work/dakota-6.13.0-release-public.src-UI/packages/external/nidr/nidrgen.c:4902:10: warning: format string is not a string literal (potentially insecure) [-Wformat-security]
                printf(libfmt1);
                       ^~~~~~~
/wrkdirs/usr/ports/science/dakota/work/dakota-6.13.0-release-public.src-UI/packages/external/nidr/nidrgen.c:4902:10: note: treat the string as an argument to avoid this
                printf(libfmt1);
                       ^
                       "%s", 
/wrkdirs/usr/ports/science/dakota/work/dakota-6.13.0-release-public.src-UI/packages/external/nidr/nidrgen.c:5549:28: warning: adding 'int' to a string does not append to the string [-Wstring-plus-int]
                (unsigned long)nbad, "s" + (nbad == 1), tagfname);
                                     ~~~~^~~~~~~~~~~~~
/wrkdirs/usr/ports/science/dakota/work/dakota-6.13.0-release-public.src-UI/packages/external/nidr/nidrgen.c:5549:28: note: use array indexing to silence this warning
                (unsigned long)nbad, "s" + (nbad == 1), tagfname);
                                         ^
                                     &   [            ]
7 warnings generated.
--- packages/external/nidr/nidrgen ---
[  2%] Linking C executable nidrgen
cd /wrkdirs/usr/ports/science/dakota/work/.build/packages/external/nidr && /usr/local/bin/cmake -E cmake_link_script CMakeFiles/nidrgen.dir/link.txt --verbose=1
/usr/bin/cc -O2 -pipe  -fstack-protector-strong -fno-strict-aliasing -O2 -pipe  -fstack-protector-strong -fno-strict-aliasing  -lexecinfo -Wl,-rpath=/usr/local/lib/gcc10  -L/usr/local/lib/gcc10 -B/usr/local/bin -fstack-protector-strong CMakeFiles/nidrgen.dir/nidrgen.c.o -o nidrgen  -lm 
[  2%] Built target nidrgen
--- packages/external/ampl/CMakeFiles/genarith.dir/all ---
/usr/bin/make  -f packages/external/ampl/CMakeFiles/genarith.dir/build.make packages/external/ampl/CMakeFiles/genarith.dir/depend
--- packages/external/ampl/CMakeFiles/genarith.dir/depend ---
cd /wrkdirs/usr/ports/science/dakota/work/.build && /usr/local/bin/cmake -E cmake_depends "Unix Makefiles" /wrkdirs/usr/ports/science/dakota/work/dakota-6.13.0-release-public.src-UI /wrkdirs/usr/ports/science/dakota/work/dakota-6.13.0-release-public.src-UI/packages/external/ampl /wrkdirs/usr/ports/science/dakota/work/.build /wrkdirs/usr/ports/science/dakota/work/.build/packages/external/ampl /wrkdirs/usr/ports/science/dakota/work/.build/packages/external/ampl/CMakeFiles/genarith.dir/DependInfo.cmake
Scanning dependencies of target genarith
/usr/bin/make  -f packages/external/ampl/CMakeFiles/genarith.dir/build.make packages/external/ampl/CMakeFiles/genarith.dir/build
--- packages/external/ampl/CMakeFiles/genarith.dir/arithchk.c.o ---
[  2%] Building C object packages/external/ampl/CMakeFiles/genarith.dir/arithchk.c.o
cd /wrkdirs/usr/ports/science/dakota/work/.build/packages/external/ampl && /usr/bin/cc -DHAVE_CONFIG_H -DHAVE_DAKOTA_SURROGATES -I/wrkdirs/usr/ports/science/dakota/work/dakota-6.13.0-release-public.src-UI/packages/external/ampl -I/wrkdirs/usr/ports/science/dakota/work/.build/packages/external/ampl -O2 -pipe  -fstack-protector-strong -fno-strict-aliasing -O2 -pipe  -fstack-protector-strong -fno-strict-aliasing -o CMakeFiles/genarith.dir/arithchk.c.o -c /wrkdirs/usr/ports/science/dakota/work/dakota-6.13.0-release-public.src-UI/packages/external/ampl/arithchk.c
/wrkdirs/usr/ports/science/dakota/work/dakota-6.13.0-release-public.src-UI/packages/external/ampl/arithchk.c:125:17: warning: format string is not a string literal (potentially insecure) [-Wformat-security]
        Cray1 = printf(emptyfmt) < 0 ? 0 : 4617762;
                       ^~~~~~~~
/wrkdirs/usr/ports/science/dakota/work/dakota-6.13.0-release-public.src-UI/packages/external/ampl/arithchk.c:125:17: note: treat the string as an argument to avoid this
        Cray1 = printf(emptyfmt) < 0 ? 0 : 4617762;
                       ^
                       "%s", 
1 warning generated.
--- packages/external/ampl/CMakeFiles/genarith.dir/fpinit.c.o ---
[  2%] Building C object packages/external/ampl/CMakeFiles/genarith.dir/fpinit.c.o
cd /wrkdirs/usr/ports/science/dakota/work/.build/packages/external/ampl && /usr/bin/cc -DHAVE_CONFIG_H -DHAVE_DAKOTA_SURROGATES -I/wrkdirs/usr/ports/science/dakota/work/dakota-6.13.0-release-public.src-UI/packages/external/ampl -I/wrkdirs/usr/ports/science/dakota/work/.build/packages/external/ampl -O2 -pipe  -fstack-protector-strong -fno-strict-aliasing -O2 -pipe  -fstack-protector-strong -fno-strict-aliasing -o CMakeFiles/genarith.dir/fpinit.c.o -c /wrkdirs/usr/ports/science/dakota/work/dakota-6.13.0-release-public.src-UI/packages/external/ampl/fpinit.c
In file included from /wrkdirs/usr/ports/science/dakota/work/dakota-6.13.0-release-public.src-UI/packages/external/ampl/fpinit.c:218:
In file included from /usr/include/floatingpoint.h:37:
/usr/include/machine/ieeefp.h:35:1: error: unknown type name '__BEGIN_DECLS'
__BEGIN_DECLS
^
/usr/include/machine/ieeefp.h:36:16: error: expected ';' after top level declarator
extern fp_rnd_t    fpgetround(void);
               ^
/usr/include/machine/ieeefp.h:41:1: error: unknown type name '__END_DECLS'
__END_DECLS
^
/wrkdirs/usr/ports/science/dakota/work/dakota-6.13.0-release-public.src-UI/packages/external/ampl/fpinit.c:223:2: warning: implicit declaration of function 'fpsetprec' is invalid in C99 [-Wimplicit-function-declaration]
        fpsetprec(FP_PD);
        ^
/wrkdirs/usr/ports/science/dakota/work/dakota-6.13.0-release-public.src-UI/packages/external/ampl/fpinit.c:223:12: error: use of undeclared identifier 'FP_PD'
        fpsetprec(FP_PD);
                  ^
1 warning and 4 errors generated.
*** [packages/external/ampl/CMakeFiles/genarith.dir/fpinit.c.o] Error code 1

make[3]: stopped in /wrkdirs/usr/ports/science/dakota/work/.build
1 error

make[3]: stopped in /wrkdirs/usr/ports/science/dakota/work/.build
*** [packages/external/ampl/CMakeFiles/genarith.dir/all] Error code 2

make[2]: stopped in /wrkdirs/usr/ports/science/dakota/work/.build
--- packages/CMakeFiles/MUQ.dir/all ---
*** [all] Error code 6

make[4]: stopped in /wrkdirs/usr/ports/science/dakota/work/.build/packages/external/muq2/src/MUQ-build
1 error

make[4]: stopped in /wrkdirs/usr/ports/science/dakota/work/.build/packages/external/muq2/src/MUQ-build
*** [packages/external/muq2/src/MUQ-stamp/MUQ-build] Error code 2

make[3]: stopped in /wrkdirs/usr/ports/science/dakota/work/.build
1 error

make[3]: stopped in /wrkdirs/usr/ports/science/dakota/work/.build
*** [packages/CMakeFiles/MUQ.dir/all] Error code 2

make[2]: stopped in /wrkdirs/usr/ports/science/dakota/work/.build
2 errors

make[2]: stopped in /wrkdirs/usr/ports/science/dakota/work/.build
*** [all] Error code 2

make[1]: stopped in /wrkdirs/usr/ports/science/dakota/work/.build
1 error

make[1]: stopped in /wrkdirs/usr/ports/science/dakota/work/.build
===> Compilation failed unexpectedly.
Try to set MAKE_JOBS_UNSAFE=yes and rebuild before reporting the failure to
the maintainer.
*** Error code 1

Stop.
make: stopped in /usr/ports/science/dakota
Received on Sun Jun 27 2021 - 14:45:42 UTC

Original text of this message