[package - 122powerpc64-quarterly][multimedia/v4l-utils] Failed for v4l-utils-1.20.0 in stage

From: <pkg-fallout_at_FreeBSD.org>
Date: Sat, 26 Jun 2021 04:13:17 GMT
You are receiving this mail as a port that you maintain
is failing to build on the FreeBSD package build server.
Please investigate the failure and submit a PR to fix
build.

Maintainer:     multimedia_at_FreeBSD.org
Log URL:        http://foul1.nyi.freebsd.org/data/122powerpc64-quarterly/67383f941ca2/logs/v4l-utils-1.20.0.log
Build URL:      http://foul1.nyi.freebsd.org/build.html?mastername=122powerpc64-quarterly&build=67383f941ca2
Log:

=>> Building multimedia/v4l-utils
build started at Sat Jun 26 04:07:36 UTC 2021
port directory: /usr/ports/multimedia/v4l-utils
package name: v4l-utils-1.20.0
building for: FreeBSD 122powerpc64-quarterly-job-04 12.2-RELEASE FreeBSD 12.2-RELEASE powerpc
maintained by: multimedia_at_FreeBSD.org
Makefile ident: 
Poudriere version: 3.2.8-8-gaf08dbda
Host OSVERSION: 1400008
Jail OSVERSION: 1202000
Job Id: 04

---Begin Environment---
SHELL=/bin/csh
OSVERSION=1202000
UNAME_v=FreeBSD 12.2-RELEASE
UNAME_r=12.2-RELEASE
BLOCKSIZE=K
MAIL=/var/mail/root
STATUS=1
HOME=/root
PATH=/sbin:/bin:/usr/sbin:/usr/bin:/usr/local/sbin:/usr/local/bin:/root/bin
LOCALBASE=/usr/local
USER=root
LIBEXECPREFIX=/usr/local/libexec/poudriere
POUDRIERE_VERSION=3.2.8-8-gaf08dbda
MASTERMNT=/usr/local/poudriere/data/.m/122powerpc64-quarterly/ref
POUDRIERE_BUILD_TYPE=bulk
PACKAGE_BUILDING=yes
SAVED_TERM=
PWD=/usr/local/poudriere/data/.m/122powerpc64-quarterly/ref/.p/pool
P_PORTS_FEATURES=FLAVORS SELECTED_OPTIONS
MASTERNAME=122powerpc64-quarterly
SCRIPTPREFIX=/usr/local/share/poudriere
OLDPWD=/usr/local/poudriere/data/.m/122powerpc64-quarterly/ref/.p
SCRIPTPATH=/usr/local/share/poudriere/bulk.sh
POUDRIEREPATH=/usr/local/bin/poudriere
---End Environment---

---Begin Poudriere Port Flags/Env---
PORT_FLAGS=
PKGENV=
FLAVOR=
DEPENDS_ARGS=
MAKE_ARGS=
---End Poudriere Port Flags/Env---

---Begin OPTIONS List---
---End OPTIONS List---

--MAINTAINER--
multimedia_at_FreeBSD.org
--End MAINTAINER--

--CONFIGURE_ARGS--
--disable-qv4l2  --disable-qvidcap  --disable-nls --enable-v4l-utils  --without-v4l2-compliance --prefix=/usr/local ${_LATE_CONFIGURE_ARGS}
--End CONFIGURE_ARGS--

--CONFIGURE_ENV--
MAKE=gmake PKG_CONFIG=pkgconf ac_cv_path_PERL=/usr/local/bin/perl ac_cv_path_PERL_PATH=/usr/local/bin/perl  PERL_USE_UNSAFE_INC=1 XDG_DATA_HOME=/wrkdirs/usr/ports/multimedia/v4l-utils/work  XDG_CONFIG_HOME=/wrkdirs/usr/ports/multimedia/v4l-utils/work  HOME=/wrkdirs/usr/ports/multimedia/v4l-utils/work TMPDIR="/tmp" PATH=/wrkdirs/usr/ports/multimedia/v4l-utils/work/.bin:/sbin:/bin:/usr/sbin:/usr/bin:/usr/local/sbin:/usr/local/bin:/root/bin SHELL=/bin/sh CONFIG_SHELL=/bin/sh ADDR2LINE="/usr/local/bin/addr2line" AR="/usr/local/bin/ar" AS="/usr/local/bin/as" CPPFILT="/usr/local/bin/c++filt" GPROF="/usr/local/bin/gprof" LD="/usr/local/bin/ld" NM="/usr/local/bin/nm" OBJCOPY="/usr/local/bin/objcopy" OBJDUMP="/usr/local/bin/objdump" RANLIB="/usr/local/bin/ranlib" READELF="/usr/local/bin/readelf" SIZE="/usr/local/bin/size" STRINGS="/usr/local/bin/strings" CONFIG_SITE=/usr/ports/Templates/config.site lt_cv_sys_max_cmd_len=524288
--End CONFIGURE_ENV--

--MAKE_ENV--
PERL_USE_UNSAFE_INC=1 XDG_DATA_HOME=/wrkdirs/usr/ports/multimedia/v4l-utils/work  XDG_CONFIG_HOME=/wrkdirs/usr/ports/multimedia/v4l-utils/work  HOME=/wrkdirs/usr/ports/multimedia/v4l-utils/work TMPDIR="/tmp" PATH=/wrkdirs/usr/ports/multimedia/v4l-utils/work/.bin:/sbin:/bin:/usr/sbin:/usr/bin:/usr/local/sbin:/usr/local/bin:/root/bin NO_PIE=yes MK_DEBUG_FILES=no MK_KERNEL_SYMBOLS=no SHELL=/bin/sh NO_LINT=YES ADDR2LINE="/usr/local/bin/addr2line" AR="/usr/local/bin/ar" AS="/usr/local/bin/as" CPPFILT="/usr/local/bin/c++filt" GPROF="/usr/local/bin/gprof" LD="/usr/local/bin/ld" NM="/usr/local/bin/nm" OBJCOPY="/usr/local/bin/objcopy" OBJDUMP="/usr/local/bin/objdump" RANLIB="/usr/local/bin/ranlib" READELF="/usr/local/bin/readelf" SIZE="/usr/local/bin/size" STRINGS="/usr/local/bin/strings" PREFIX=/usr/local  LOCALBASE=/usr/local  CC="gcc10" CFLAGS="-O2 -pipe  -DLIBICONV_PLUG -fstack-protector-strong -Wl,-rpath=/usr/local/lib/gcc10 -fno-strict-aliasing "  CPP="cpp10" CPPFLAGS="-I/usr/local/incl
 ude -DLIBICONV_PLUG"  LDFLAGS=" -L/usr/local/lib -lepoll-shim -fstack-protector-strong -Wl,-rpath=/usr/local/lib/gcc10 -L/usr/local/lib/gcc10 " LIBS=""  CXX="g++10" CXXFLAGS="-O2 -pipe  -DLIBICONV_PLUG -fstack-protector-strong -Wl,-rpath=/usr/local/lib/gcc10  -DLIBICONV_PLUG -Wl,-rpath=/usr/local/lib/gcc10 "  MANPREFIX="/usr/local" BSD_INSTALL_PROGRAM="install  -s -m 555"  BSD_INSTALL_LIB="install  -s -m 0644"  BSD_INSTALL_SCRIPT="install  -m 555"  BSD_INSTALL_DATA="install  -m 0644"  BSD_INSTALL_MAN="install  -m 444"
--End MAKE_ENV--

--PLIST_SUB--
OSREL=12.2 PREFIX=%D LOCALBASE=/usr/local  RESETPREFIX=/usr/local LIB32DIR=lib PERL_VERSION=5.32.1  PERL_VER=5.32  PERL5_MAN1=lib/perl5/site_perl/man/man1  PERL5_MAN3=lib/perl5/site_perl/man/man3  SITE_PERL=lib/perl5/site_perl  SITE_ARCH=lib/perl5/site_perl/mach/5.32 DOCSDIR="share/doc/v4l-utils"  EXAMPLESDIR="share/examples/v4l-utils"  DATADIR="share/v4l-utils"  WWWDIR="www/v4l-utils"  ETCDIR="etc/v4l-utils"
--End PLIST_SUB--

--SUB_LIST--
PREFIX=/usr/local LOCALBASE=/usr/local  DATADIR=/usr/local/share/v4l-utils DOCSDIR=/usr/local/share/doc/v4l-utils EXAMPLESDIR=/usr/local/share/examples/v4l-utils  WWWDIR=/usr/local/www/v4l-utils ETCDIR=/usr/local/etc/v4l-utils
--End SUB_LIST--

---Begin make.conf---
USE_PACKAGE_DEPENDS=yes
BATCH=yes
WRKDIRPREFIX=/wrkdirs
PORTSDIR=/usr/ports
PACKAGES=/packages
DISTDIR=/distfiles
PACKAGE_BUILDING=yes
PACKAGE_BUILDING_FLAVORS=yes
#### /usr/local/etc/poudriere.d/make.conf ####
# XXX: We really need this but cannot use it while 'make checksum' does not
# try the next mirror on checksum failure.  It currently retries the same
# failed mirror and then fails rather then trying another.  It *does*
# try the next if the size is mismatched though.
#MASTER_SITE_FREEBSD=yes
# Build ALLOW_MAKE_JOBS_PACKAGES with 2 jobs
MAKE_JOBS_NUMBER=2
#### /usr/ports/Mk/Scripts/ports_env.sh ####
_CCVERSION_921dbbb2=cc (GCC) 4.2.1 20070831 patched [FreeBSD] Copyright (C) 2007 Free Software Foundation, Inc. This is free software; see the source for copying conditions. There is NO warranty; not even for MERCHANTABILITY or FITNESS FOR A PARTICULAR PURPOSE.
_ALTCCVERSION_921dbbb2=none
_CXXINTERNAL_acaad9ca=Using built-in specs. Target: powerpc64-undermydesk-freebsd Configured with: FreeBSD/powerpc64 system compiler Thread model: posix gcc version 4.2.1 20070831 patched [FreeBSD] "/usr/bin/ld" "--eh-frame-hdr" "-Qy" "-melf64ppc_fbsd" "--enable-new-dtags" "-dynamic-linker" "/libexec/ld-elf.so.1" "/usr/lib/crt1.o" "/usr/lib/crti.o" "/usr/lib/crtbegin.o" "-L/usr/lib" "-L/usr/lib" "/dev/null" "-lstdc++" "-lm" "-lgcc_s" "-lgcc" "-lc" "-lgcc_s" "-lgcc" "/usr/lib/crtsavres.o" "/usr/lib/crtend.o" "/usr/lib/crtn.o"
CC_OUTPUT_921dbbb2_58173849=yes
CC_OUTPUT_921dbbb2_9bdba57c=yes
CC_OUTPUT_921dbbb2_6a4fe7f5=cc1: error: unrecognized command line option "-std=c11"
CC_OUTPUT_921dbbb2_6bcac02b=yes
CC_OUTPUT_921dbbb2_67d20829=yes
CC_OUTPUT_921dbbb2_bfa62e83=cc1: error: unrecognized command line option "-std=gnu11"
CC_OUTPUT_921dbbb2_f0b4d593=yes
CC_OUTPUT_921dbbb2_308abb44=cc1plus: error: unrecognized command line option "-std=c++0x"
CC_OUTPUT_921dbbb2_f00456e5=cc1plus: error: unrecognized command line option "-std=c++11"
CC_OUTPUT_921dbbb2_65ad290d=cc1plus: error: unrecognized command line option "-std=c++14"
CC_OUTPUT_921dbbb2_f2776b26=cc1plus: error: unrecognized command line option "-std=c++17"
CC_OUTPUT_921dbbb2_b2657cc3=yes
CC_OUTPUT_921dbbb2_380987f7=cc1plus: error: unrecognized command line option "-std=gnu++11"
CC_OUTPUT_921dbbb2_160933ec=cc1plus: error: unrecognized command line option "-std=gnu++14"
CC_OUTPUT_921dbbb2_fb62803b=cc1plus: error: unrecognized command line option "-std=gnu++17"
_OBJC_CCVERSION_921dbbb2=cc (GCC) 4.2.1 20070831 patched [FreeBSD] Copyright (C) 2007 Free Software Foundation, Inc. This is free software; see the source for copying conditions. There is NO warranty; not even for MERCHANTABILITY or FITNESS FOR A PARTICULAR PURPOSE.
_OBJC_ALTCCVERSION_921dbbb2=none
ARCH=powerpc64
PPC_ABI=ELFv1
OPSYS=FreeBSD
_OSRELEASE=12.2-RELEASE
OSREL=12.2
OSVERSION=1202000
PYTHONBASE=/usr/local
CONFIGURE_MAX_CMD_LEN=524288
HAVE_PORTS_ENV=1
#### Misc Poudriere ####
GID=0
UID=0
---End make.conf---
--Resource limits--
cpu time               (seconds, -t)  unlimited
file size           (512-blocks, -f)  unlimited
data seg size           (kbytes, -d)  33554432
stack size              (kbytes, -s)  524288
core file size      (512-blocks, -c)  unlimited
max memory size         (kbytes, -m)  unlimited
locked memory           (kbytes, -l)  unlimited
max user processes              (-u)  89999
open files                      (-n)  1024
virtual mem size        (kbytes, -v)  unlimited
swap limit              (kbytes, -w)  unlimited
socket buffer size       (bytes, -b)  unlimited
pseudo-terminals                (-p)  unlimited
kqueues                         (-k)  unlimited
umtx shared locks               (-o)  unlimited
--End resource limits--
=======================<phase: check-sanity   >============================
===>  License GPLv2 LGPL21 accepted by the user
===========================================================================
=======================<phase: pkg-depends    >============================
===>   v4l-utils-1.20.0 depends on file: /usr/local/sbin/pkg - not found
===>   Installing existing package /packages/All/pkg-1.16.3.txz
[122powerpc64-quarterly-job-04] Installing pkg-1.16.3...
[122powerpc64-quarterly-job-04] Extracting pkg-1.16.3: .......... done
===>   v4l-utils-1.20.0 depends on file: /usr/local/sbin/pkg - found
===>   Returning to build of v4l-utils-1.20.0
===========================================================================
=======================<phase: fetch-depends  >============================
===========================================================================
=======================<phase: fetch          >============================
===>  License GPLv2 LGPL21 accepted by the user
===> Fetching all distfiles required by v4l-utils-1.20.0 for building
===========================================================================
=======================<phase: checksum       >============================
===>  License GPLv2 LGPL21 accepted by the user
===> Fetching all distfiles required by v4l-utils-1.20.0 for building
=> SHA256 Checksum OK for hselasky-v4l-utils-v4l-utils-1.20.0_GH0.tar.gz.
=> SHA256 Checksum OK for hselasky-webcamd-v5.10.6.0_GH0.tar.gz.
=> SHA256 Checksum OK for torvalds-linux-v5.10-rc6_GH0.tar.gz.
===========================================================================
=======================<phase: extract-depends>============================
===========================================================================
=======================<phase: extract        >============================
===>  License GPLv2 LGPL21 accepted by the user
===> Fetching all distfiles required by v4l-utils-1.20.0 for building
===>  Extracting for v4l-utils-1.20.0
=> SHA256 Checksum OK for hselasky-v4l-utils-v4l-utils-1.20.0_GH0.tar.gz.
=> SHA256 Checksum OK for hselasky-webcamd-v5.10.6.0_GH0.tar.gz.
=> SHA256 Checksum OK for torvalds-linux-v5.10-rc6_GH0.tar.gz.
===========================================================================
=======================<phase: patch-depends  >============================
===========================================================================
=======================<phase: patch          >============================
===>  Patching for v4l-utils-1.20.0
===>  Applying FreeBSD patches for v4l-utils-1.20.0 from /usr/ports/multimedia/v4l-utils/../libv4l/files
Applying Linux kernel patch: /wrkdirs/usr/ports/multimedia/v4l-utils/work/webcamd-5.10.6.0/patches/0001-Linux-kernel-patches-for-webcamd.patch
Applying Linux kernel patch: /wrkdirs/usr/ports/multimedia/v4l-utils/work/webcamd-5.10.6.0/patches/0002-extra_dbb-tv-dongles.patch
===========================================================================
=======================<phase: build-depends  >============================
===>   v4l-utils-1.20.0 depends on package: gsed>0 - not found
===>   Installing existing package /packages/All/gsed-4.8.txz
[122powerpc64-quarterly-job-04] Installing gsed-4.8...
[122powerpc64-quarterly-job-04] `-- Installing gettext-runtime-0.21...
[122powerpc64-quarterly-job-04] |   `-- Installing indexinfo-0.3.1...
[122powerpc64-quarterly-job-04] |   `-- Extracting indexinfo-0.3.1: .... done
[122powerpc64-quarterly-job-04] `-- Extracting gettext-runtime-0.21: .......... done
[122powerpc64-quarterly-job-04] Extracting gsed-4.8: .......... done
===>   v4l-utils-1.20.0 depends on package: gsed>0 - found
===>   Returning to build of v4l-utils-1.20.0
===>   v4l-utils-1.20.0 depends on package: v4l_compat>=1.20.0 - not found
===>   Installing existing package /packages/All/v4l_compat-1.20.0.txz
[122powerpc64-quarterly-job-04] Installing v4l_compat-1.20.0...
[122powerpc64-quarterly-job-04] `-- Installing evdev-proto-5.8...
<snip>
  456 |   printf("%31s %#8.8x (u32)    : min=%lld max=%lld step=%lld default=%lld",
      |                                                         ~~~^
      |                                                            |
      |                                                            long long int
      |                                                         %ld
.....
  459 |     queryctrl->step, queryctrl->default_value);
      |     ~~~~~~~~~~~~~~~                                         
      |                |
      |                uint64_t {aka long unsigned int}
v4l2-ctl-common.cpp:456:73: warning: format '%lld' expects argument of type 'long long int', but argument 7 has type 'int64_t' {aka 'long int'} [-Wformat=]
  456 |   printf("%31s %#8.8x (u32)    : min=%lld max=%lld step=%lld default=%lld",
      |                                                                      ~~~^
      |                                                                         |
      |                                                                         long long int
      |                                                                      %ld
.....
  459 |     queryctrl->step, queryctrl->default_value);
      |                      ~~~~~~~~~~~~~~~~~~~~~~~~                            
      |                                 |
      |                                 int64_t {aka long int}
v4l2-ctl-common.cpp:481:22: warning: format '%lld' expects argument of type 'long long int', but argument 2 has type 'int64_t' {aka 'long int'} [-Wformat=]
  481 |    printf(" value=%lld", ctrl->value64);
      |                   ~~~^   ~~~~~~~~~~~~~
      |                      |         |
      |                      |         int64_t {aka long int}
      |                      long long int
      |                   %ld
v4l2-ctl-common.cpp:507:28: warning: format '%lld' expects argument of type 'long long int', but argument 3 has type 'int64_t' {aka 'long int'} [-Wformat=]
  507 |     printf("\t\t\t\t%d: %lld (0x%llx)\n", i, qmenu.value, qmenu.value);
      |                         ~~~^                 ~~~~~~~~~~~
      |                            |                       |
      |                            long long int           int64_t {aka long int}
      |                         %ld
v4l2-ctl-common.cpp:507:36: warning: format '%llx' expects argument of type 'long long unsigned int', but argument 4 has type 'int64_t' {aka 'long int'} [-Wformat=]
  507 |     printf("\t\t\t\t%d: %lld (0x%llx)\n", i, qmenu.value, qmenu.value);
      |                                 ~~~^                      ~~~~~~~~~~~
      |                                    |                            |
      |                                    long long unsigned int       int64_t {aka long int}
      |                                 %lx
v4l2-ctl-common.cpp: In function 'void common_control_event(const v4l2_event*)':
v4l2-ctl-common.cpp:717:24: warning: format '%lld' expects argument of type 'long long int', but argument 2 has type 'long int' [-Wformat=]
  717 |    printf("\tvalue: %lld 0x%llx\n", ctrl->value64, ctrl->value64);
      |                     ~~~^            ~~~~~~~~~~~~~
      |                        |                  |
      |                        long long int      long int
      |                     %ld
v4l2-ctl-common.cpp:717:31: warning: format '%llx' expects argument of type 'long long unsigned int', but argument 3 has type 'long int' [-Wformat=]
  717 |    printf("\tvalue: %lld 0x%llx\n", ctrl->value64, ctrl->value64);
      |                            ~~~^                    ~~~~~~~~~~~~~
      |                               |                          |
      |                               long long unsigned int     long int
      |                            %lx
mv -f .deps/v4l2_ctl-v4l2-ctl-common.Tpo .deps/v4l2_ctl-v4l2-ctl-common.Po
g++10   -I. -I../..  -I../../utils/common -I../../lib/include -Wall -Wpointer-arith -D_GNU_SOURCE -I../../contrib/freebsd/include -I/usr/local/include -DLIBICONV_PLUG  -O2 -pipe  -DLIBICONV_PLUG -fstack-protector-strong -Wl,-rpath=/usr/local/lib/gcc10  -DLIBICONV_PLUG -Wl,-rpath=/usr/local/lib/gcc10  -MT v4l2_ctl-v4l2-ctl-tuner.o -MD -MP -MF .deps/v4l2_ctl-v4l2-ctl-tuner.Tpo -c -o v4l2_ctl-v4l2-ctl-tuner.o `test -f 'v4l2-ctl-tuner.cpp' || echo './'`v4l2-ctl-tuner.cpp
mv -f .deps/v4l2_ctl-v4l2-ctl-tuner.Tpo .deps/v4l2_ctl-v4l2-ctl-tuner.Po
g++10   -I. -I../..  -I../../utils/common -I../../lib/include -Wall -Wpointer-arith -D_GNU_SOURCE -I../../contrib/freebsd/include -I/usr/local/include -DLIBICONV_PLUG  -O2 -pipe  -DLIBICONV_PLUG -fstack-protector-strong -Wl,-rpath=/usr/local/lib/gcc10  -DLIBICONV_PLUG -Wl,-rpath=/usr/local/lib/gcc10  -MT v4l2_ctl-v4l2-ctl-io.o -MD -MP -MF .deps/v4l2_ctl-v4l2-ctl-io.Tpo -c -o v4l2_ctl-v4l2-ctl-io.o `test -f 'v4l2-ctl-io.cpp' || echo './'`v4l2-ctl-io.cpp
mv -f .deps/v4l2_ctl-v4l2-ctl-io.Tpo .deps/v4l2_ctl-v4l2-ctl-io.Po
g++10   -I. -I../..  -I../../utils/common -I../../lib/include -Wall -Wpointer-arith -D_GNU_SOURCE -I../../contrib/freebsd/include -I/usr/local/include -DLIBICONV_PLUG  -O2 -pipe  -DLIBICONV_PLUG -fstack-protector-strong -Wl,-rpath=/usr/local/lib/gcc10  -DLIBICONV_PLUG -Wl,-rpath=/usr/local/lib/gcc10  -MT v4l2_ctl-v4l2-ctl-stds.o -MD -MP -MF .deps/v4l2_ctl-v4l2-ctl-stds.Tpo -c -o v4l2_ctl-v4l2-ctl-stds.o `test -f 'v4l2-ctl-stds.cpp' || echo './'`v4l2-ctl-stds.cpp
v4l2-ctl-stds.cpp: In function 'void print_dv_timings(const v4l2_dv_timings*)':
v4l2-ctl-stds.cpp:400:28: warning: format '%lld' expects argument of type 'long long int', but argument 2 has type 'long unsigned int' [-Wformat=]
  400 |   printf("\tPixelclock: %lld Hz", bt->pixelclock);
      |                         ~~~^      ~~~~~~~~~~~~~~
      |                            |          |
      |                            |          long unsigned int
      |                            long long int
      |                         %ld
v4l2-ctl-stds.cpp: In function 'void stds_get(cv4l_fd&)':
v4l2-ctl-stds.cpp:616:34: warning: format '%llu' expects argument of type 'long long unsigned int', but argument 2 has type 'uint64_t' {aka 'long unsigned int'} [-Wformat=]
  616 |     printf("\tMinimum PClock: %llu\n", bt->min_pixelclock);
      |                               ~~~^     ~~~~~~~~~~~~~~~~~~
      |                                  |         |
      |                                  |         uint64_t {aka long unsigned int}
      |                                  long long unsigned int
      |                               %lu
v4l2-ctl-stds.cpp:617:34: warning: format '%llu' expects argument of type 'long long unsigned int', but argument 2 has type 'uint64_t' {aka 'long unsigned int'} [-Wformat=]
  617 |     printf("\tMaximum PClock: %llu\n", bt->max_pixelclock);
      |                               ~~~^     ~~~~~~~~~~~~~~~~~~
      |                                  |         |
      |                                  |         uint64_t {aka long unsigned int}
      |                                  long long unsigned int
      |                               %lu
mv -f .deps/v4l2_ctl-v4l2-ctl-stds.Tpo .deps/v4l2_ctl-v4l2-ctl-stds.Po
g++10   -I. -I../..  -I../../utils/common -I../../lib/include -Wall -Wpointer-arith -D_GNU_SOURCE -I../../contrib/freebsd/include -I/usr/local/include -DLIBICONV_PLUG  -O2 -pipe  -DLIBICONV_PLUG -fstack-protector-strong -Wl,-rpath=/usr/local/lib/gcc10  -DLIBICONV_PLUG -Wl,-rpath=/usr/local/lib/gcc10  -MT v4l2_ctl-v4l2-ctl-vidcap.o -MD -MP -MF .deps/v4l2_ctl-v4l2-ctl-vidcap.Tpo -c -o v4l2_ctl-v4l2-ctl-vidcap.o `test -f 'v4l2-ctl-vidcap.cpp' || echo './'`v4l2-ctl-vidcap.cpp
mv -f .deps/v4l2_ctl-v4l2-ctl-vidcap.Tpo .deps/v4l2_ctl-v4l2-ctl-vidcap.Po
g++10   -I. -I../..  -I../../utils/common -I../../lib/include -Wall -Wpointer-arith -D_GNU_SOURCE -I../../contrib/freebsd/include -I/usr/local/include -DLIBICONV_PLUG  -O2 -pipe  -DLIBICONV_PLUG -fstack-protector-strong -Wl,-rpath=/usr/local/lib/gcc10  -DLIBICONV_PLUG -Wl,-rpath=/usr/local/lib/gcc10  -MT v4l2_ctl-v4l2-ctl-vidout.o -MD -MP -MF .deps/v4l2_ctl-v4l2-ctl-vidout.Tpo -c -o v4l2_ctl-v4l2-ctl-vidout.o `test -f 'v4l2-ctl-vidout.cpp' || echo './'`v4l2-ctl-vidout.cpp
mv -f .deps/v4l2_ctl-v4l2-ctl-vidout.Tpo .deps/v4l2_ctl-v4l2-ctl-vidout.Po
g++10   -I. -I../..  -I../../utils/common -I../../lib/include -Wall -Wpointer-arith -D_GNU_SOURCE -I../../contrib/freebsd/include -I/usr/local/include -DLIBICONV_PLUG  -O2 -pipe  -DLIBICONV_PLUG -fstack-protector-strong -Wl,-rpath=/usr/local/lib/gcc10  -DLIBICONV_PLUG -Wl,-rpath=/usr/local/lib/gcc10  -MT v4l2_ctl-v4l2-ctl-overlay.o -MD -MP -MF .deps/v4l2_ctl-v4l2-ctl-overlay.Tpo -c -o v4l2_ctl-v4l2-ctl-overlay.o `test -f 'v4l2-ctl-overlay.cpp' || echo './'`v4l2-ctl-overlay.cpp
mv -f .deps/v4l2_ctl-v4l2-ctl-overlay.Tpo .deps/v4l2_ctl-v4l2-ctl-overlay.Po
g++10   -I. -I../..  -I../../utils/common -I../../lib/include -Wall -Wpointer-arith -D_GNU_SOURCE -I../../contrib/freebsd/include -I/usr/local/include -DLIBICONV_PLUG  -O2 -pipe  -DLIBICONV_PLUG -fstack-protector-strong -Wl,-rpath=/usr/local/lib/gcc10  -DLIBICONV_PLUG -Wl,-rpath=/usr/local/lib/gcc10  -MT v4l2_ctl-v4l2-ctl-vbi.o -MD -MP -MF .deps/v4l2_ctl-v4l2-ctl-vbi.Tpo -c -o v4l2_ctl-v4l2-ctl-vbi.o `test -f 'v4l2-ctl-vbi.cpp' || echo './'`v4l2-ctl-vbi.cpp
mv -f .deps/v4l2_ctl-v4l2-ctl-vbi.Tpo .deps/v4l2_ctl-v4l2-ctl-vbi.Po
g++10   -I. -I../..  -I../../utils/common -I../../lib/include -Wall -Wpointer-arith -D_GNU_SOURCE -I../../contrib/freebsd/include -I/usr/local/include -DLIBICONV_PLUG  -O2 -pipe  -DLIBICONV_PLUG -fstack-protector-strong -Wl,-rpath=/usr/local/lib/gcc10  -DLIBICONV_PLUG -Wl,-rpath=/usr/local/lib/gcc10  -MT v4l2_ctl-v4l2-ctl-selection.o -MD -MP -MF .deps/v4l2_ctl-v4l2-ctl-selection.Tpo -c -o v4l2_ctl-v4l2-ctl-selection.o `test -f 'v4l2-ctl-selection.cpp' || echo './'`v4l2-ctl-selection.cpp
mv -f .deps/v4l2_ctl-v4l2-ctl-selection.Tpo .deps/v4l2_ctl-v4l2-ctl-selection.Po
g++10   -I. -I../..  -I../../utils/common -I../../lib/include -Wall -Wpointer-arith -D_GNU_SOURCE -I../../contrib/freebsd/include -I/usr/local/include -DLIBICONV_PLUG  -O2 -pipe  -DLIBICONV_PLUG -fstack-protector-strong -Wl,-rpath=/usr/local/lib/gcc10  -DLIBICONV_PLUG -Wl,-rpath=/usr/local/lib/gcc10  -MT v4l2_ctl-v4l2-ctl-misc.o -MD -MP -MF .deps/v4l2_ctl-v4l2-ctl-misc.Tpo -c -o v4l2_ctl-v4l2-ctl-misc.o `test -f 'v4l2-ctl-misc.cpp' || echo './'`v4l2-ctl-misc.cpp
mv -f .deps/v4l2_ctl-v4l2-ctl-misc.Tpo .deps/v4l2_ctl-v4l2-ctl-misc.Po
g++10   -I. -I../..  -I../../utils/common -I../../lib/include -Wall -Wpointer-arith -D_GNU_SOURCE -I../../contrib/freebsd/include -I/usr/local/include -DLIBICONV_PLUG  -O2 -pipe  -DLIBICONV_PLUG -fstack-protector-strong -Wl,-rpath=/usr/local/lib/gcc10  -DLIBICONV_PLUG -Wl,-rpath=/usr/local/lib/gcc10  -MT v4l2_ctl-v4l2-ctl-streaming.o -MD -MP -MF .deps/v4l2_ctl-v4l2-ctl-streaming.Tpo -c -o v4l2_ctl-v4l2-ctl-streaming.o `test -f 'v4l2-ctl-streaming.cpp' || echo './'`v4l2-ctl-streaming.cpp
In file included from v4l2-ctl-streaming.cpp:31:
./../utils/common/v4l2-tpg.h:25: warning: "__packed" redefined
   25 | #define __packed __attribute__((packed))
      | 
In file included from /usr/include/stdlib.h:38,
                 from /usr/local/lib/gcc10/include/c++/cstdlib:75,
                 from v4l2-ctl-streaming.cpp:1:
/usr/include/sys/cdefs.h:227: note: this is the location of the previous definition
  227 | #define __packed __attribute__((__packed__))
      | 
v4l2-ctl-streaming.cpp: In function 'void print_buffer(FILE*, v4l2_buffer&)':
v4l2-ctl-streaming.cpp:515:30: warning: format '%llu' expects argument of type 'long long unsigned int', but argument 3 has type 'uint64_t' {aka 'long unsigned int'} [-Wformat=]
  515 |  fprintf(f, "\tTimestamp: %llu.%06llus (%s, %s)\n",
      |                           ~~~^
      |                              |
      |                              long long unsigned int
      |                           %lu
  516 |   static_cast<uint64_t>(buf.timestamp.tv_sec), static_cast<uint64_t>(buf.timestamp.tv_usec),
      |   ~~~~~~~~~~~~~~~~~~~~~~~~~~~~~~~~~~~~~~~~~~~
      |   |
      |   uint64_t {aka long unsigned int}
v4l2-ctl-streaming.cpp:515:37: warning: format '%llu' expects argument of type 'long long unsigned int', but argument 4 has type 'uint64_t' {aka 'long unsigned int'} [-Wformat=]
  515 |  fprintf(f, "\tTimestamp: %llu.%06llus (%s, %s)\n",
      |                                ~~~~~^
      |                                     |
      |                                     long long unsigned int
      |                                %06lu
  516 |   static_cast<uint64_t>(buf.timestamp.tv_sec), static_cast<uint64_t>(buf.timestamp.tv_usec),
      |                                                ~~~~~~~~~~~~~~~~~~~~~~~~~~~~~~~~~~~~~~~~~~~~
      |                                                |
      |                                                uint64_t {aka long unsigned int}
v4l2-ctl-streaming.cpp: In function 'void stateless_m2m(cv4l_fd&, cv4l_queue&, cv4l_queue&, FILE*, FILE*, cv4l_fmt&, cv4l_fmt&, cv4l_fd*)':
v4l2-ctl-streaming.cpp:2545:35: warning: format '%llu' expects argument of type 'long long unsigned int', but argument 4 has type 'uint64_t' {aka 'long unsigned int'} [-Wformat=]
 2545 |      fprintf(stderr, "%s: ts = %llu\n", __func__, cap_buf.g_timestamp_ns());
      |                                ~~~^               ~~~~~~~~~~~~~~~~~~~~~~~~
      |                                   |                                     |
      |                                   long long unsigned int                uint64_t {aka long unsigned int}
      |                                %lu
mv -f .deps/v4l2_ctl-v4l2-ctl-streaming.Tpo .deps/v4l2_ctl-v4l2-ctl-streaming.Po
g++10   -I. -I../..  -I../../utils/common -I../../lib/include -Wall -Wpointer-arith -D_GNU_SOURCE -I../../contrib/freebsd/include -I/usr/local/include -DLIBICONV_PLUG  -O2 -pipe  -DLIBICONV_PLUG -fstack-protector-strong -Wl,-rpath=/usr/local/lib/gcc10  -DLIBICONV_PLUG -Wl,-rpath=/usr/local/lib/gcc10  -MT v4l2_ctl-v4l2-ctl-sdr.o -MD -MP -MF .deps/v4l2_ctl-v4l2-ctl-sdr.Tpo -c -o v4l2_ctl-v4l2-ctl-sdr.o `test -f 'v4l2-ctl-sdr.cpp' || echo './'`v4l2-ctl-sdr.cpp
mv -f .deps/v4l2_ctl-v4l2-ctl-sdr.Tpo .deps/v4l2_ctl-v4l2-ctl-sdr.Po
g++10   -I. -I../..  -I../../utils/common -I../../lib/include -Wall -Wpointer-arith -D_GNU_SOURCE -I../../contrib/freebsd/include -I/usr/local/include -DLIBICONV_PLUG  -O2 -pipe  -DLIBICONV_PLUG -fstack-protector-strong -Wl,-rpath=/usr/local/lib/gcc10  -DLIBICONV_PLUG -Wl,-rpath=/usr/local/lib/gcc10  -MT v4l2_ctl-v4l2-ctl-edid.o -MD -MP -MF .deps/v4l2_ctl-v4l2-ctl-edid.Tpo -c -o v4l2_ctl-v4l2-ctl-edid.o `test -f 'v4l2-ctl-edid.cpp' || echo './'`v4l2-ctl-edid.cpp
mv -f .deps/v4l2_ctl-v4l2-ctl-edid.Tpo .deps/v4l2_ctl-v4l2-ctl-edid.Po
g++10   -I. -I../..  -I../../utils/common -I../../lib/include -Wall -Wpointer-arith -D_GNU_SOURCE -I../../contrib/freebsd/include -I/usr/local/include -DLIBICONV_PLUG  -O2 -pipe  -DLIBICONV_PLUG -fstack-protector-strong -Wl,-rpath=/usr/local/lib/gcc10  -DLIBICONV_PLUG -Wl,-rpath=/usr/local/lib/gcc10  -MT v4l2_ctl-v4l2-ctl-modes.o -MD -MP -MF .deps/v4l2_ctl-v4l2-ctl-modes.Tpo -c -o v4l2_ctl-v4l2-ctl-modes.o `test -f 'v4l2-ctl-modes.cpp' || echo './'`v4l2-ctl-modes.cpp
mv -f .deps/v4l2_ctl-v4l2-ctl-modes.Tpo .deps/v4l2_ctl-v4l2-ctl-modes.Po
g++10   -I. -I../..  -I../../utils/common -I../../lib/include -Wall -Wpointer-arith -D_GNU_SOURCE -I../../contrib/freebsd/include -I/usr/local/include -DLIBICONV_PLUG  -O2 -pipe  -DLIBICONV_PLUG -fstack-protector-strong -Wl,-rpath=/usr/local/lib/gcc10  -DLIBICONV_PLUG -Wl,-rpath=/usr/local/lib/gcc10  -MT v4l2_ctl-v4l2-ctl-subdev.o -MD -MP -MF .deps/v4l2_ctl-v4l2-ctl-subdev.Tpo -c -o v4l2_ctl-v4l2-ctl-subdev.o `test -f 'v4l2-ctl-subdev.cpp' || echo './'`v4l2-ctl-subdev.cpp
mv -f .deps/v4l2_ctl-v4l2-ctl-subdev.Tpo .deps/v4l2_ctl-v4l2-ctl-subdev.Po
gcc10   -I. -I../..  -I../../utils/common -I../../lib/include -Wall -Wpointer-arith -D_GNU_SOURCE -I../../contrib/freebsd/include -I/usr/local/include -DLIBICONV_PLUG  -O2 -pipe  -DLIBICONV_PLUG -fstack-protector-strong -Wl,-rpath=/usr/local/lib/gcc10 -fno-strict-aliasing  -MT v4l2_ctl-v4l2-tpg-colors.o -MD -MP -MF .deps/v4l2_ctl-v4l2-tpg-colors.Tpo -c -o v4l2_ctl-v4l2-tpg-colors.o `test -f 'v4l2-tpg-colors.c' || echo './'`v4l2-tpg-colors.c
In file included from ../../utils/common/v4l2-tpg-colors.h:23,
                 from v4l2-tpg-colors.c:27:
./../utils/common/v4l2-tpg.h:25: warning: "__packed" redefined
   25 | #define __packed __attribute__((packed))
      | 
In file included from /usr/include/sys/_types.h:34,
                 from /usr/include/sys/_timeval.h:34,
                 from /usr/include/sys/time.h:38,
                 from /usr/local/include/linux/videodev2.h:61,
                 from v4l2-tpg-colors.c:26:
/usr/include/sys/cdefs.h:227: note: this is the location of the previous definition
  227 | #define __packed __attribute__((__packed__))
      | 
mv -f .deps/v4l2_ctl-v4l2-tpg-colors.Tpo .deps/v4l2_ctl-v4l2-tpg-colors.Po
gcc10   -I. -I../..  -I../../utils/common -I../../lib/include -Wall -Wpointer-arith -D_GNU_SOURCE -I../../contrib/freebsd/include -I/usr/local/include -DLIBICONV_PLUG  -O2 -pipe  -DLIBICONV_PLUG -fstack-protector-strong -Wl,-rpath=/usr/local/lib/gcc10 -fno-strict-aliasing  -MT v4l2_ctl-v4l2-tpg-core.o -MD -MP -MF .deps/v4l2_ctl-v4l2-tpg-core.Tpo -c -o v4l2_ctl-v4l2-tpg-core.o `test -f 'v4l2-tpg-core.c' || echo './'`v4l2-tpg-core.c
In file included from ../../utils/common/v4l2-tpg-colors.h:23,
                 from v4l2-tpg-core.c:11:
./../utils/common/v4l2-tpg.h:25: warning: "__packed" redefined
   25 | #define __packed __attribute__((packed))
      | 
In file included from /usr/include/sys/_types.h:34,
                 from /usr/include/sys/_timeval.h:34,
                 from /usr/include/sys/time.h:38,
                 from /usr/local/include/linux/videodev2.h:61,
                 from ../../utils/common/v4l2-tpg.h:11,
                 from ../../utils/common/v4l2-tpg-colors.h:23,
                 from v4l2-tpg-core.c:11:
/usr/include/sys/cdefs.h:227: note: this is the location of the previous definition
  227 | #define __packed __attribute__((__packed__))
      | 
mv -f .deps/v4l2_ctl-v4l2-tpg-core.Tpo .deps/v4l2_ctl-v4l2-tpg-core.Po
gcc10   -I. -I../..  -I../../utils/common -I../../lib/include -Wall -Wpointer-arith -D_GNU_SOURCE -I../../contrib/freebsd/include -I/usr/local/include -DLIBICONV_PLUG  -O2 -pipe  -DLIBICONV_PLUG -fstack-protector-strong -Wl,-rpath=/usr/local/lib/gcc10 -fno-strict-aliasing  -MT v4l2_ctl-v4l-stream.o -MD -MP -MF .deps/v4l2_ctl-v4l-stream.Tpo -c -o v4l2_ctl-v4l-stream.o `test -f 'v4l-stream.c' || echo './'`v4l-stream.c
mv -f .deps/v4l2_ctl-v4l-stream.Tpo .deps/v4l2_ctl-v4l-stream.Po
g++10   -I. -I../..  -I../../utils/common -I../../lib/include -Wall -Wpointer-arith -D_GNU_SOURCE -I../../contrib/freebsd/include -I/usr/local/include -DLIBICONV_PLUG  -O2 -pipe  -DLIBICONV_PLUG -fstack-protector-strong -Wl,-rpath=/usr/local/lib/gcc10  -DLIBICONV_PLUG -Wl,-rpath=/usr/local/lib/gcc10  -MT v4l2_ctl-v4l2-ctl-meta.o -MD -MP -MF .deps/v4l2_ctl-v4l2-ctl-meta.Tpo -c -o v4l2_ctl-v4l2-ctl-meta.o `test -f 'v4l2-ctl-meta.cpp' || echo './'`v4l2-ctl-meta.cpp
v4l2-ctl-meta.cpp: In function 'void print_meta_buffer(FILE*, cv4l_buffer&, cv4l_fmt&, cv4l_queue&)':
v4l2-ctl-meta.cpp:167:27: error: 'le32toh' was not declared in this scope
  167 |    fprintf(f, " PTS: %u", le32toh(*(uint32_t*)(vbuf->buf)));
      |                           ^~~~~~~
v4l2-ctl-meta.cpp:172:5: error: 'le32toh' was not declared in this scope
  172 |     le32toh(*(uint32_t*)(vbuf->buf + buf_off)),
      |     ^~~~~~~
v4l2-ctl-meta.cpp:173:5: error: 'le16toh' was not declared in this scope
  173 |     le16toh(*(uint16_t*)(vbuf->buf + buf_off + 4)));
      |     ^~~~~~~
gmake[4]: *** [Makefile:998: v4l2_ctl-v4l2-ctl-meta.o] Error 1
gmake[4]: Leaving directory '/wrkdirs/usr/ports/multimedia/v4l-utils/work/v4l-utils-4l-utils-1.20.0/utils/v4l2-ctl'
gmake[3]: *** [Makefile:1182: install] Error 2
gmake[3]: Leaving directory '/wrkdirs/usr/ports/multimedia/v4l-utils/work/v4l-utils-4l-utils-1.20.0/utils/v4l2-ctl'
gmake[2]: *** [Makefile:481: install-recursive] Error 1
gmake[2]: Leaving directory '/wrkdirs/usr/ports/multimedia/v4l-utils/work/v4l-utils-4l-utils-1.20.0/utils'
gmake[1]: *** [Makefile:646: install-strip] Error 2
gmake[1]: Leaving directory '/wrkdirs/usr/ports/multimedia/v4l-utils/work/v4l-utils-4l-utils-1.20.0/utils'
*** Error code 2

Stop.
make: stopped in /usr/ports/multimedia/v4l-utils
Received on Sat Jun 26 2021 - 04:13:17 UTC

Original text of this message