[package - 122powerpc64-quarterly][audio/tagutil] Failed for tagutil-3.1 in build

From: <pkg-fallout_at_FreeBSD.org>
Date: Sat, 26 Jun 2021 03:31:48 GMT
You are receiving this mail as a port that you maintain
is failing to build on the FreeBSD package build server.
Please investigate the failure and submit a PR to fix
build.

Maintainer:     alex_at_kaworu.ch
Log URL:        http://foul1.nyi.freebsd.org/data/122powerpc64-quarterly/67383f941ca2/logs/tagutil-3.1.log
Build URL:      http://foul1.nyi.freebsd.org/build.html?mastername=122powerpc64-quarterly&build=67383f941ca2
Log:

=>> Building audio/tagutil
build started at Sat Jun 26 03:30:48 UTC 2021
port directory: /usr/ports/audio/tagutil
package name: tagutil-3.1
building for: FreeBSD 122powerpc64-quarterly-job-13 12.2-RELEASE FreeBSD 12.2-RELEASE powerpc
maintained by: alex_at_kaworu.ch
Makefile ident: 
Poudriere version: 3.2.8-8-gaf08dbda
Host OSVERSION: 1400008
Jail OSVERSION: 1202000
Job Id: 13

---Begin Environment---
SHELL=/bin/csh
OSVERSION=1202000
UNAME_v=FreeBSD 12.2-RELEASE
UNAME_r=12.2-RELEASE
BLOCKSIZE=K
MAIL=/var/mail/root
STATUS=1
HOME=/root
PATH=/sbin:/bin:/usr/sbin:/usr/bin:/usr/local/sbin:/usr/local/bin:/root/bin
LOCALBASE=/usr/local
USER=root
LIBEXECPREFIX=/usr/local/libexec/poudriere
POUDRIERE_VERSION=3.2.8-8-gaf08dbda
MASTERMNT=/usr/local/poudriere/data/.m/122powerpc64-quarterly/ref
POUDRIERE_BUILD_TYPE=bulk
PACKAGE_BUILDING=yes
SAVED_TERM=
PWD=/usr/local/poudriere/data/.m/122powerpc64-quarterly/ref/.p/pool
P_PORTS_FEATURES=FLAVORS SELECTED_OPTIONS
MASTERNAME=122powerpc64-quarterly
SCRIPTPREFIX=/usr/local/share/poudriere
OLDPWD=/usr/local/poudriere/data/.m/122powerpc64-quarterly/ref/.p
SCRIPTPATH=/usr/local/share/poudriere/bulk.sh
POUDRIEREPATH=/usr/local/bin/poudriere
---End Environment---

---Begin Poudriere Port Flags/Env---
PORT_FLAGS=
PKGENV=
FLAVOR=
DEPENDS_ARGS=
MAKE_ARGS=
---End Poudriere Port Flags/Env---

---Begin OPTIONS List---
===> The following configuration options are available for tagutil-3.1:
     JSON=off: JSON output format support
====> Options available for the multi MEDIA: you have to choose at least one of them
     FLAC=on: FLAC lossless audio codec support
     OGG=on: Ogg media format support
     TAGLIB=on: Multiple file format but limited tags support
===> Use 'make config' to modify these settings
---End OPTIONS List---

--MAINTAINER--
alex_at_kaworu.ch
--End MAINTAINER--

--CONFIGURE_ARGS--

--End CONFIGURE_ARGS--

--CONFIGURE_ENV--
PKG_CONFIG=pkgconf XDG_DATA_HOME=/wrkdirs/usr/ports/audio/tagutil/work  XDG_CONFIG_HOME=/wrkdirs/usr/ports/audio/tagutil/work  HOME=/wrkdirs/usr/ports/audio/tagutil/work TMPDIR="/tmp" PATH=/wrkdirs/usr/ports/audio/tagutil/work/.bin:/sbin:/bin:/usr/sbin:/usr/bin:/usr/local/sbin:/usr/local/bin:/root/bin SHELL=/bin/sh CONFIG_SHELL=/bin/sh
--End CONFIGURE_ENV--

--MAKE_ENV--
XDG_DATA_HOME=/wrkdirs/usr/ports/audio/tagutil/work  XDG_CONFIG_HOME=/wrkdirs/usr/ports/audio/tagutil/work  HOME=/wrkdirs/usr/ports/audio/tagutil/work TMPDIR="/tmp" PATH=/wrkdirs/usr/ports/audio/tagutil/work/.bin:/sbin:/bin:/usr/sbin:/usr/bin:/usr/local/sbin:/usr/local/bin:/root/bin NO_PIE=yes MK_DEBUG_FILES=no MK_KERNEL_SYMBOLS=no SHELL=/bin/sh NO_LINT=YES ADDR2LINE="/usr/local/bin/addr2line" AR="/usr/local/bin/ar" AS="/usr/local/bin/as" CPPFILT="/usr/local/bin/c++filt" GPROF="/usr/local/bin/gprof" LD="/usr/local/bin/ld" NM="/usr/local/bin/nm" OBJCOPY="/usr/local/bin/objcopy" OBJDUMP="/usr/local/bin/objdump" RANLIB="/usr/local/bin/ranlib" READELF="/usr/local/bin/readelf" SIZE="/usr/local/bin/size" STRINGS="/usr/local/bin/strings" DESTDIR=/wrkdirs/usr/ports/audio/tagutil/work/stage PREFIX=/usr/local  LOCALBASE=/usr/local  CC="gcc10" CFLAGS="-O2 -pipe  -DLIBICONV_PLUG -fstack-protector-strong -Wl,-rpath=/usr/local/lib/gcc10 -fno-strict-aliasing "  CPP="cpp10" CPPFLAGS="-DLIBICONV_PLUG
 "  LDFLAGS=" -fstack-protector-strong -Wl,-rpath=/usr/local/lib/gcc10 -L/usr/local/lib/gcc10 " LIBS=""  CXX="g++10" CXXFLAGS="-O2 -pipe  -DLIBICONV_PLUG -fstack-protector-strong -Wl,-rpath=/usr/local/lib/gcc10  -DLIBICONV_PLUG -Wl,-rpath=/usr/local/lib/gcc10 "  MANPREFIX="/usr/local" BSD_INSTALL_PROGRAM="install  -s -m 555"  BSD_INSTALL_LIB="install  -s -m 0644"  BSD_INSTALL_SCRIPT="install  -m 555"  BSD_INSTALL_DATA="install  -m 0644"  BSD_INSTALL_MAN="install  -m 444"
--End MAKE_ENV--

--PLIST_SUB--
CMAKE_BUILD_TYPE="release" OSREL=12.2 PREFIX=%D LOCALBASE=/usr/local  RESETPREFIX=/usr/local LIB32DIR=lib DOCSDIR="share/doc/tagutil"  EXAMPLESDIR="share/examples/tagutil"  DATADIR="share/tagutil"  WWWDIR="www/tagutil"  ETCDIR="etc/tagutil"
--End PLIST_SUB--

--SUB_LIST--
PREFIX=/usr/local LOCALBASE=/usr/local  DATADIR=/usr/local/share/tagutil DOCSDIR=/usr/local/share/doc/tagutil EXAMPLESDIR=/usr/local/share/examples/tagutil  WWWDIR=/usr/local/www/tagutil ETCDIR=/usr/local/etc/tagutil
--End SUB_LIST--

---Begin make.conf---
USE_PACKAGE_DEPENDS=yes
BATCH=yes
WRKDIRPREFIX=/wrkdirs
PORTSDIR=/usr/ports
PACKAGES=/packages
DISTDIR=/distfiles
PACKAGE_BUILDING=yes
PACKAGE_BUILDING_FLAVORS=yes
#### /usr/local/etc/poudriere.d/make.conf ####
# XXX: We really need this but cannot use it while 'make checksum' does not
# try the next mirror on checksum failure.  It currently retries the same
# failed mirror and then fails rather then trying another.  It *does*
# try the next if the size is mismatched though.
#MASTER_SITE_FREEBSD=yes
# Build ALLOW_MAKE_JOBS_PACKAGES with 2 jobs
MAKE_JOBS_NUMBER=2
#### /usr/ports/Mk/Scripts/ports_env.sh ####
_CCVERSION_921dbbb2=cc (GCC) 4.2.1 20070831 patched [FreeBSD] Copyright (C) 2007 Free Software Foundation, Inc. This is free software; see the source for copying conditions. There is NO warranty; not even for MERCHANTABILITY or FITNESS FOR A PARTICULAR PURPOSE.
_ALTCCVERSION_921dbbb2=none
_CXXINTERNAL_acaad9ca=Using built-in specs. Target: powerpc64-undermydesk-freebsd Configured with: FreeBSD/powerpc64 system compiler Thread model: posix gcc version 4.2.1 20070831 patched [FreeBSD] "/usr/bin/ld" "--eh-frame-hdr" "-Qy" "-melf64ppc_fbsd" "--enable-new-dtags" "-dynamic-linker" "/libexec/ld-elf.so.1" "/usr/lib/crt1.o" "/usr/lib/crti.o" "/usr/lib/crtbegin.o" "-L/usr/lib" "-L/usr/lib" "/dev/null" "-lstdc++" "-lm" "-lgcc_s" "-lgcc" "-lc" "-lgcc_s" "-lgcc" "/usr/lib/crtsavres.o" "/usr/lib/crtend.o" "/usr/lib/crtn.o"
CC_OUTPUT_921dbbb2_58173849=yes
CC_OUTPUT_921dbbb2_9bdba57c=yes
CC_OUTPUT_921dbbb2_6a4fe7f5=cc1: error: unrecognized command line option "-std=c11"
CC_OUTPUT_921dbbb2_6bcac02b=yes
CC_OUTPUT_921dbbb2_67d20829=yes
CC_OUTPUT_921dbbb2_bfa62e83=cc1: error: unrecognized command line option "-std=gnu11"
CC_OUTPUT_921dbbb2_f0b4d593=yes
CC_OUTPUT_921dbbb2_308abb44=cc1plus: error: unrecognized command line option "-std=c++0x"
CC_OUTPUT_921dbbb2_f00456e5=cc1plus: error: unrecognized command line option "-std=c++11"
CC_OUTPUT_921dbbb2_65ad290d=cc1plus: error: unrecognized command line option "-std=c++14"
CC_OUTPUT_921dbbb2_f2776b26=cc1plus: error: unrecognized command line option "-std=c++17"
CC_OUTPUT_921dbbb2_b2657cc3=yes
CC_OUTPUT_921dbbb2_380987f7=cc1plus: error: unrecognized command line option "-std=gnu++11"
CC_OUTPUT_921dbbb2_160933ec=cc1plus: error: unrecognized command line option "-std=gnu++14"
CC_OUTPUT_921dbbb2_fb62803b=cc1plus: error: unrecognized command line option "-std=gnu++17"
_OBJC_CCVERSION_921dbbb2=cc (GCC) 4.2.1 20070831 patched [FreeBSD] Copyright (C) 2007 Free Software Foundation, Inc. This is free software; see the source for copying conditions. There is NO warranty; not even for MERCHANTABILITY or FITNESS FOR A PARTICULAR PURPOSE.
_OBJC_ALTCCVERSION_921dbbb2=none
ARCH=powerpc64
PPC_ABI=ELFv1
OPSYS=FreeBSD
_OSRELEASE=12.2-RELEASE
OSREL=12.2
OSVERSION=1202000
PYTHONBASE=/usr/local
CONFIGURE_MAX_CMD_LEN=524288
HAVE_PORTS_ENV=1
#### Misc Poudriere ####
GID=0
UID=0
---End make.conf---
--Resource limits--
cpu time               (seconds, -t)  unlimited
file size           (512-blocks, -f)  unlimited
data seg size           (kbytes, -d)  33554432
stack size              (kbytes, -s)  524288
core file size      (512-blocks, -c)  unlimited
max memory size         (kbytes, -m)  unlimited
locked memory           (kbytes, -l)  unlimited
max user processes              (-u)  89999
open files                      (-n)  1024
virtual mem size        (kbytes, -v)  unlimited
swap limit              (kbytes, -w)  unlimited
socket buffer size       (bytes, -b)  unlimited
pseudo-terminals                (-p)  unlimited
kqueues                         (-k)  unlimited
umtx shared locks               (-o)  unlimited
--End resource limits--
=======================<phase: check-sanity   >============================
===>  License BSD2CLAUSE accepted by the user
===========================================================================
=======================<phase: pkg-depends    >============================
===>   tagutil-3.1 depends on file: /usr/local/sbin/pkg - not found
===>   Installing existing package /packages/All/pkg-1.16.3.txz
[122powerpc64-quarterly-job-13] Installing pkg-1.16.3...
[122powerpc64-quarterly-job-13] Extracting pkg-1.16.3: .......... done
===>   tagutil-3.1 depends on file: /usr/local/sbin/pkg - found
===>   Returning to build of tagutil-3.1
===========================================================================
=======================<phase: fetch-depends  >============================
===========================================================================
=======================<phase: fetch          >============================
===>  License BSD2CLAUSE accepted by the user
===> Fetching all distfiles required by tagutil-3.1 for building
===========================================================================
=======================<phase: checksum       >============================
===>  License BSD2CLAUSE accepted by the user
===> Fetching all distfiles required by tagutil-3.1 for building
=> SHA256 Checksum OK for kAworu-tagutil-v3.1_GH0.tar.gz.
===========================================================================
=======================<phase: extract-depends>============================
===========================================================================
=======================<phase: extract        >============================
===>  License BSD2CLAUSE accepted by the user
===> Fetching all distfiles required by tagutil-3.1 for building
===>  Extracting for tagutil-3.1
=> SHA256 Checksum OK for kAworu-tagutil-v3.1_GH0.tar.gz.
===========================================================================
=======================<phase: patch-depends  >============================
===========================================================================
=======================<phase: patch          >============================
===>  Patching for tagutil-3.1
===========================================================================
=======================<phase: build-depends  >============================
===>   tagutil-3.1 depends on file: /usr/local/bin/cmake - not found
===>   Installing existing package /packages/All/cmake-3.19.6.txz
[122powerpc64-quarterly-job-13] Installing cmake-3.19.6...
[122powerpc64-quarterly-job-13] `-- Installing curl-7.76.0...
[122powerpc64-quarterly-job-13] |   `-- Installing ca_root_nss-3.63...
[122powerpc64-quarterly-job-13] |   `-- Extracting ca_root_nss-3.63: ........ done
[122powerpc64-quarterly-job-13] |   `-- Installing libnghttp2-1.43.0...
[122powerpc64-quarterly-job-13] |   | `-- Installing gcc10-10.2.0_1...
[122powerpc64-quarterly-job-13] |   |   `-- Installing binutils-2.33.1_4,1...
[122powerpc64-quarterly-job-13] |   |   | `-- Installing gettext-runtime-0.21...
[122powerpc64-quarterly-job-13] |   |   |   `-- Installing indexinfo-0.3.1...
[122powerpc64-quarterly-job-13] |   |   |   `-- Extracting indexinfo-0.3.1: .... done
[122powerpc64-quarterly-job-13] |   |   | `-- Extracting gettext-runtime-0.21: .......... done
[122powerpc64-quarterly-job-13] |   |   `-- Extracting binutils-2.33.1_4,1: .......... done
<snip>

This enables SSL Certificate Verification by client software without manual
intervention.

If you prefer to do this manually, replace the following symlinks with
either an empty file or your site-local certificate bundle.

  * /etc/ssl/cert.pem
  * /usr/local/etc/ssl/cert.pem
  * /usr/local/openssl/cert.pem
=====
Message from gcc9-9.3.0_3:

--
To ensure binaries built with this toolchain find appropriate versions
of the necessary run-time libraries, you may want to link using

  -Wl,-rpath=/usr/local/lib/gcc9

For ports leveraging USE_GCC, USES=compiler, or USES=fortran this happens
transparently.
=====
Message from gcc10-10.2.0_1:

--
To ensure binaries built with this toolchain find appropriate versions
of the necessary run-time libraries, you may want to link using

  -Wl,-rpath=/usr/local/lib/gcc10

For ports leveraging USE_GCC, USES=compiler, or USES=fortran this happens
transparently.
===>   tagutil-3.1 depends on file: /usr/local/bin/cmake - found
===>   Returning to build of tagutil-3.1
===>   tagutil-3.1 depends on executable: ninja - not found
===>   Installing existing package /packages/All/ninja-1.10.2,2.txz
[122powerpc64-quarterly-job-13] Installing ninja-1.10.2,2...
[122powerpc64-quarterly-job-13] `-- Installing python37-3.7.10...
[122powerpc64-quarterly-job-13] |   `-- Installing libffi-3.3_1...
[122powerpc64-quarterly-job-13] |   `-- Extracting libffi-3.3_1: .......... done
[122powerpc64-quarterly-job-13] |   `-- Installing readline-8.1.0...
[122powerpc64-quarterly-job-13] |   `-- Extracting readline-8.1.0: .......... done
[122powerpc64-quarterly-job-13] `-- Extracting python37-3.7.10: .......... done
[122powerpc64-quarterly-job-13] Extracting ninja-1.10.2,2: ........ done
=====
Message from python37-3.7.10:

--
Note that some standard Python modules are provided as separate ports
as they require additional dependencies. They are available as:

py37-gdbm       databases/py-gdbm_at_py37
py37-sqlite3    databases/py-sqlite3_at_py37
py37-tkinter    x11-toolkits/py-tkinter_at_py37
===>   tagutil-3.1 depends on executable: ninja - found
===>   Returning to build of tagutil-3.1
===>   tagutil-3.1 depends on package: pkgconf>=1.3.0_1 - not found
===>   Installing existing package /packages/All/pkgconf-1.7.4,1.txz
[122powerpc64-quarterly-job-13] Installing pkgconf-1.7.4,1...
[122powerpc64-quarterly-job-13] Extracting pkgconf-1.7.4,1: .......... done
===>   tagutil-3.1 depends on package: pkgconf>=1.3.0_1 - found
===>   Returning to build of tagutil-3.1
===>   tagutil-3.1 depends on executable: gcc10 - found
===>   tagutil-3.1 depends on file: /usr/local/bin/as - found
===========================================================================
=======================<phase: lib-depends    >============================
===>   tagutil-3.1 depends on shared library: libyaml.so - not found
===>   Installing existing package /packages/All/libyaml-0.2.5.txz
[122powerpc64-quarterly-job-13] Installing libyaml-0.2.5...
[122powerpc64-quarterly-job-13] Extracting libyaml-0.2.5: ......... done
===>   tagutil-3.1 depends on shared library: libyaml.so - found (/usr/local/lib/libyaml.so)
===>   Returning to build of tagutil-3.1
===>   tagutil-3.1 depends on shared library: libFLAC.so - not found
===>   Installing existing package /packages/All/flac-1.3.3_1.txz
[122powerpc64-quarterly-job-13] Installing flac-1.3.3_1...
[122powerpc64-quarterly-job-13] `-- Installing libogg-1.3.4,4...
[122powerpc64-quarterly-job-13] `-- Extracting libogg-1.3.4,4: .......... done
[122powerpc64-quarterly-job-13] Extracting flac-1.3.3_1: .......... done
===>   tagutil-3.1 depends on shared library: libFLAC.so - found (/usr/local/lib/libFLAC.so)
===>   Returning to build of tagutil-3.1
===>   tagutil-3.1 depends on shared library: libvorbisfile.so - not found
===>   Installing existing package /packages/All/libvorbis-1.3.7_2,3.txz
[122powerpc64-quarterly-job-13] Installing libvorbis-1.3.7_2,3...
[122powerpc64-quarterly-job-13] Extracting libvorbis-1.3.7_2,3: .......... done
===>   tagutil-3.1 depends on shared library: libvorbisfile.so - found (/usr/local/lib/libvorbisfile.so)
===>   Returning to build of tagutil-3.1
===>   tagutil-3.1 depends on shared library: libogg.so - found (/usr/local/lib/libogg.so)
===>   tagutil-3.1 depends on shared library: libtag_c.so - not found
===>   Installing existing package /packages/All/taglib-1.12.txz
[122powerpc64-quarterly-job-13] Installing taglib-1.12...
[122powerpc64-quarterly-job-13] Extracting taglib-1.12: .......... done
===>   tagutil-3.1 depends on shared library: libtag_c.so - found (/usr/local/lib/libtag_c.so)
===>   Returning to build of tagutil-3.1
===========================================================================
=======================<phase: configure      >============================
===>  Configuring for tagutil-3.1
===>  Performing out-of-source build
/bin/mkdir -p /wrkdirs/usr/ports/audio/tagutil/work/.build
CMake Deprecation Warning at CMakeLists.txt:2 (cmake_minimum_required):
  Compatibility with CMake < 2.8.12 will be removed from a future version of
  CMake.

  Update the VERSION argument <min> value or use a ...<max> suffix to tell
  CMake that the project does not need compatibility with older versions.


CMake Deprecation Warning at CMakeLists.txt:4 (cmake_policy):
  Compatibility with CMake < 2.8.12 will be removed from a future version of
  CMake.

  Update the VERSION argument <min> value or use a ...<max> suffix to tell
  CMake that the project does not need compatibility with older versions.


-- The C compiler identification is GNU 10.2.0
-- Detecting C compiler ABI info
-- Detecting C compiler ABI info - done
-- Check for working C compiler: /usr/local/bin/gcc10 - skipped
-- Detecting C compile features
-- Detecting C compile features - done
-- Performing Test HAS_WSIGN_CONVERSION
-- Performing Test HAS_WSIGN_CONVERSION - Success
-- Performing Test HAS_WDOUBLE_PROMOTION
-- Performing Test HAS_WDOUBLE_PROMOTION - Success
-- Performing Test HAS_WLOGICAL_OP
-- Performing Test HAS_WLOGICAL_OP - Success
-- Performing Test HAS_WJUMP_MISSES_INIT
-- Performing Test HAS_WJUMP_MISSES_INIT - Success
-- Found PkgConfig: pkgconf (found version "1.7.4") 
-- Performing Test ICONV_SECOND_ARGUMENT_IS_CONST
-- Performing Test ICONV_SECOND_ARGUMENT_IS_CONST - Failed
-- Checking for module 'taglib_c>=1.4'
--   Found taglib_c, version 1.12
-- Checking for module 'flac'
--   Found flac, version 1.3.3
-- using libFLAC workaround for <assert.h>
-- Checking for module 'ogg'
--   Found ogg, version 1.3.4
-- Checking for module 'vorbis'
--   Found vorbis, version 1.3.7
-- Checking for module 'vorbisfile'
--   Found vorbisfile, version 1.3.7
-- Checking for module 'yaml-0.1'
--   Found yaml-0.1, version 0.2.5
-- ************ tagutil build options ************
-- Backends:
--   TagLib support:                  YES
--   FLAC (libflac) support:          YES
--   Ogg/Vorbis (vorbisfile) support: YES
--   ID3v1.1 support:                 NO
-- Formats:
--    YAML (libyaml) support:         YES
--    JSON (jansson) support:         NO
-- ***********************************************
-- Configuring done
-- Generating done
CMake Warning:
  Manually-specified variables were not used by the project:

    CMAKE_COLOR_MAKEFILE
    CMAKE_CXX_COMPILER
    CMAKE_CXX_FLAGS
    CMAKE_CXX_FLAGS_DEBUG
    CMAKE_CXX_FLAGS_RELEASE
    CMAKE_C_FLAGS_RELEASE
    CMAKE_MODULE_LINKER_FLAGS
    CMAKE_SHARED_LINKER_FLAGS
    CMAKE_VERBOSE_MAKEFILE
    ICONV_LIBRARY
    LIBICONV_INCLUDE_DIR
    LIBICONV_LIBRARIES
    LIBICONV_LIBRARY
    THREADS_HAVE_PTHREAD_ARG
    WITHOUT_JSON


-- Build files have been written to: /wrkdirs/usr/ports/audio/tagutil/work/.build
===========================================================================
=======================<phase: build          >============================
===>  Building for tagutil-3.1
[1/16] /usr/local/bin/gcc10 -DFLAC_CLASH_WORKAROUND -DHAS_GETPROGNAME -DHAS_SBUF -DHAS_STRDUP -DHAS_STRLCAT -DHAS_STRLCPY -DT_TAGUTIL_VERSION=\"3.1\" -DWITH_FLAC -DWITH_OGGVORBIS -DWITH_TAGLIB -I/wrkdirs/usr/ports/audio/tagutil/work/tagutil-3.1/src -I/usr/local/include/taglib -O2 -pipe  -DLIBICONV_PLUG -fstack-protector-strong -Wl,-rpath=/usr/local/lib/gcc10 -fno-strict-aliasing -O2 -pipe  -DLIBICONV_PLUG -fstack-protector-strong -Wl,-rpath=/usr/local/lib/gcc10 -fno-strict-aliasing -O0 -g -fsanitize=undefined -std=c11 -Wall -Wextra -fstack-protector-strong -o aslr -fpie -D_GNU_SOURCE -D_DEFAULT_SOURCE -D_BSD_SOURCE -MD -MT CMakeFiles/tagutil.dir/tagutil.c.o -MF CMakeFiles/tagutil.dir/tagutil.c.o.d -o CMakeFiles/tagutil.dir/tagutil.c.o -c /wrkdirs/usr/ports/audio/tagutil/work/tagutil-3.1/src/tagutil.c
FAILED: CMakeFiles/tagutil.dir/tagutil.c.o 
/usr/local/bin/gcc10 -DFLAC_CLASH_WORKAROUND -DHAS_GETPROGNAME -DHAS_SBUF -DHAS_STRDUP -DHAS_STRLCAT -DHAS_STRLCPY -DT_TAGUTIL_VERSION=\"3.1\" -DWITH_FLAC -DWITH_OGGVORBIS -DWITH_TAGLIB -I/wrkdirs/usr/ports/audio/tagutil/work/tagutil-3.1/src -I/usr/local/include/taglib -O2 -pipe  -DLIBICONV_PLUG -fstack-protector-strong -Wl,-rpath=/usr/local/lib/gcc10 -fno-strict-aliasing -O2 -pipe  -DLIBICONV_PLUG -fstack-protector-strong -Wl,-rpath=/usr/local/lib/gcc10 -fno-strict-aliasing -O0 -g -fsanitize=undefined -std=c11 -Wall -Wextra -fstack-protector-strong -o aslr -fpie -D_GNU_SOURCE -D_DEFAULT_SOURCE -D_BSD_SOURCE -MD -MT CMakeFiles/tagutil.dir/tagutil.c.o -MF CMakeFiles/tagutil.dir/tagutil.c.o.d -o CMakeFiles/tagutil.dir/tagutil.c.o -c /wrkdirs/usr/ports/audio/tagutil/work/tagutil-3.1/src/tagutil.c
cc1: error: too many filenames given; type 'cc1 --help' for usage
cc1: fatal error: CMakeFiles/tagutil.dir/tagutil.c.d: No such file or directory
compilation terminated.
[2/16] /usr/local/bin/gcc10 -DFLAC_CLASH_WORKAROUND -DHAS_GETPROGNAME -DHAS_SBUF -DHAS_STRDUP -DHAS_STRLCAT -DHAS_STRLCPY -DT_TAGUTIL_VERSION=\"3.1\" -DWITH_FLAC -DWITH_OGGVORBIS -DWITH_TAGLIB -I/wrkdirs/usr/ports/audio/tagutil/work/tagutil-3.1/src -I/usr/local/include/taglib -O2 -pipe  -DLIBICONV_PLUG -fstack-protector-strong -Wl,-rpath=/usr/local/lib/gcc10 -fno-strict-aliasing -O2 -pipe  -DLIBICONV_PLUG -fstack-protector-strong -Wl,-rpath=/usr/local/lib/gcc10 -fno-strict-aliasing -O0 -g -fsanitize=undefined -std=c11 -Wall -Wextra -fstack-protector-strong -o aslr -fpie -D_GNU_SOURCE -D_DEFAULT_SOURCE -D_BSD_SOURCE -MD -MT CMakeFiles/tagutil.dir/t_action.c.o -MF CMakeFiles/tagutil.dir/t_action.c.o.d -o CMakeFiles/tagutil.dir/t_action.c.o -c /wrkdirs/usr/ports/audio/tagutil/work/tagutil-3.1/src/t_action.c
FAILED: CMakeFiles/tagutil.dir/t_action.c.o 
/usr/local/bin/gcc10 -DFLAC_CLASH_WORKAROUND -DHAS_GETPROGNAME -DHAS_SBUF -DHAS_STRDUP -DHAS_STRLCAT -DHAS_STRLCPY -DT_TAGUTIL_VERSION=\"3.1\" -DWITH_FLAC -DWITH_OGGVORBIS -DWITH_TAGLIB -I/wrkdirs/usr/ports/audio/tagutil/work/tagutil-3.1/src -I/usr/local/include/taglib -O2 -pipe  -DLIBICONV_PLUG -fstack-protector-strong -Wl,-rpath=/usr/local/lib/gcc10 -fno-strict-aliasing -O2 -pipe  -DLIBICONV_PLUG -fstack-protector-strong -Wl,-rpath=/usr/local/lib/gcc10 -fno-strict-aliasing -O0 -g -fsanitize=undefined -std=c11 -Wall -Wextra -fstack-protector-strong -o aslr -fpie -D_GNU_SOURCE -D_DEFAULT_SOURCE -D_BSD_SOURCE -MD -MT CMakeFiles/tagutil.dir/t_action.c.o -MF CMakeFiles/tagutil.dir/t_action.c.o.d -o CMakeFiles/tagutil.dir/t_action.c.o -c /wrkdirs/usr/ports/audio/tagutil/work/tagutil-3.1/src/t_action.c
cc1: error: too many filenames given; type 'cc1 --help' for usage
cc1: fatal error: CMakeFiles/tagutil.dir/t_action.c.d: No such file or directory
compilation terminated.
ninja: build stopped: subcommand failed.
===> Compilation failed unexpectedly.
Try to set MAKE_JOBS_UNSAFE=yes and rebuild before reporting the failure to
the maintainer.
*** Error code 1

Stop.
make: stopped in /usr/ports/audio/tagutil
Received on Sat Jun 26 2021 - 03:31:48 UTC

Original text of this message