[package - 122powerpc64-quarterly][security/snoopy] Failed for snoopy-2.4.12 in build

From: <pkg-fallout_at_FreeBSD.org>
Date: Sat, 26 Jun 2021 03:30:44 GMT
You are receiving this mail as a port that you maintain
is failing to build on the FreeBSD package build server.
Please investigate the failure and submit a PR to fix
build.

Maintainer:     sunpoet_at_FreeBSD.org
Log URL:        http://foul1.nyi.freebsd.org/data/122powerpc64-quarterly/67383f941ca2/logs/snoopy-2.4.12.log
Build URL:      http://foul1.nyi.freebsd.org/build.html?mastername=122powerpc64-quarterly&build=67383f941ca2
Log:

=>> Building security/snoopy
build started at Sat Jun 26 03:29:18 UTC 2021
port directory: /usr/ports/security/snoopy
package name: snoopy-2.4.12
building for: FreeBSD 122powerpc64-quarterly-job-06 12.2-RELEASE FreeBSD 12.2-RELEASE powerpc
maintained by: sunpoet_at_FreeBSD.org
Makefile ident: 
Poudriere version: 3.2.8-8-gaf08dbda
Host OSVERSION: 1400008
Jail OSVERSION: 1202000
Job Id: 06

---Begin Environment---
SHELL=/bin/csh
OSVERSION=1202000
UNAME_v=FreeBSD 12.2-RELEASE
UNAME_r=12.2-RELEASE
BLOCKSIZE=K
MAIL=/var/mail/root
STATUS=1
HOME=/root
PATH=/sbin:/bin:/usr/sbin:/usr/bin:/usr/local/sbin:/usr/local/bin:/root/bin
LOCALBASE=/usr/local
USER=root
LIBEXECPREFIX=/usr/local/libexec/poudriere
POUDRIERE_VERSION=3.2.8-8-gaf08dbda
MASTERMNT=/usr/local/poudriere/data/.m/122powerpc64-quarterly/ref
POUDRIERE_BUILD_TYPE=bulk
PACKAGE_BUILDING=yes
SAVED_TERM=
PWD=/usr/local/poudriere/data/.m/122powerpc64-quarterly/ref/.p/pool
P_PORTS_FEATURES=FLAVORS SELECTED_OPTIONS
MASTERNAME=122powerpc64-quarterly
SCRIPTPREFIX=/usr/local/share/poudriere
OLDPWD=/usr/local/poudriere/data/.m/122powerpc64-quarterly/ref/.p
SCRIPTPATH=/usr/local/share/poudriere/bulk.sh
POUDRIEREPATH=/usr/local/bin/poudriere
---End Environment---

---Begin Poudriere Port Flags/Env---
PORT_FLAGS=
PKGENV=
FLAVOR=
DEPENDS_ARGS=
MAKE_ARGS=
---End Poudriere Port Flags/Env---

---Begin OPTIONS List---
===> The following configuration options are available for snoopy-2.4.12:
     DOCS=on: Build and/or install documentation
===> Use 'make config' to modify these settings
---End OPTIONS List---

--MAINTAINER--
sunpoet_at_FreeBSD.org
--End MAINTAINER--

--CONFIGURE_ARGS--
--disable-datasource-tid_kernel  ac_cv_prog_SNOOPY_PROG_SOCAT_FOUND=yes --prefix=/usr/local ${_LATE_CONFIGURE_ARGS}
--End CONFIGURE_ARGS--

--CONFIGURE_ENV--
MAKE=gmake XDG_DATA_HOME=/wrkdirs/usr/ports/security/snoopy/work  XDG_CONFIG_HOME=/wrkdirs/usr/ports/security/snoopy/work  HOME=/wrkdirs/usr/ports/security/snoopy/work TMPDIR="/tmp" PATH=/wrkdirs/usr/ports/security/snoopy/work/.bin:/sbin:/bin:/usr/sbin:/usr/bin:/usr/local/sbin:/usr/local/bin:/root/bin SHELL=/bin/sh CONFIG_SHELL=/bin/sh CONFIG_SITE=/usr/ports/Templates/config.site lt_cv_sys_max_cmd_len=524288
--End CONFIGURE_ENV--

--MAKE_ENV--
XDG_DATA_HOME=/wrkdirs/usr/ports/security/snoopy/work  XDG_CONFIG_HOME=/wrkdirs/usr/ports/security/snoopy/work  HOME=/wrkdirs/usr/ports/security/snoopy/work TMPDIR="/tmp" PATH=/wrkdirs/usr/ports/security/snoopy/work/.bin:/sbin:/bin:/usr/sbin:/usr/bin:/usr/local/sbin:/usr/local/bin:/root/bin NO_PIE=yes MK_DEBUG_FILES=no MK_KERNEL_SYMBOLS=no SHELL=/bin/sh NO_LINT=YES PREFIX=/usr/local  LOCALBASE=/usr/local  CC="cc" CFLAGS="-O2 -pipe  -fstack-protector-strong -fno-strict-aliasing "  CPP="cpp" CPPFLAGS=""  LDFLAGS=" -fstack-protector-strong " LIBS=""  CXX="c++" CXXFLAGS="-O2 -pipe -fstack-protector-strong -fno-strict-aliasing  "  MANPREFIX="/usr/local" BSD_INSTALL_PROGRAM="install  -s -m 555"  BSD_INSTALL_LIB="install  -s -m 0644"  BSD_INSTALL_SCRIPT="install  -m 555"  BSD_INSTALL_DATA="install  -m 0644"  BSD_INSTALL_MAN="install  -m 444"
--End MAKE_ENV--

--PLIST_SUB--
PORTDOCS="" OSREL=12.2 PREFIX=%D LOCALBASE=/usr/local  RESETPREFIX=/usr/local LIB32DIR=lib DOCSDIR="share/doc/snoopy"  EXAMPLESDIR="share/examples/snoopy"  DATADIR="share/snoopy"  WWWDIR="www/snoopy"  ETCDIR="etc/snoopy"
--End PLIST_SUB--

--SUB_LIST--
PREFIX=/usr/local LOCALBASE=/usr/local  DATADIR=/usr/local/share/snoopy DOCSDIR=/usr/local/share/doc/snoopy EXAMPLESDIR=/usr/local/share/examples/snoopy  WWWDIR=/usr/local/www/snoopy ETCDIR=/usr/local/etc/snoopy
--End SUB_LIST--

---Begin make.conf---
USE_PACKAGE_DEPENDS=yes
BATCH=yes
WRKDIRPREFIX=/wrkdirs
PORTSDIR=/usr/ports
PACKAGES=/packages
DISTDIR=/distfiles
PACKAGE_BUILDING=yes
PACKAGE_BUILDING_FLAVORS=yes
#### /usr/local/etc/poudriere.d/make.conf ####
# XXX: We really need this but cannot use it while 'make checksum' does not
# try the next mirror on checksum failure.  It currently retries the same
# failed mirror and then fails rather then trying another.  It *does*
# try the next if the size is mismatched though.
#MASTER_SITE_FREEBSD=yes
# Build ALLOW_MAKE_JOBS_PACKAGES with 2 jobs
MAKE_JOBS_NUMBER=2
#### /usr/ports/Mk/Scripts/ports_env.sh ####
_CCVERSION_921dbbb2=cc (GCC) 4.2.1 20070831 patched [FreeBSD] Copyright (C) 2007 Free Software Foundation, Inc. This is free software; see the source for copying conditions. There is NO warranty; not even for MERCHANTABILITY or FITNESS FOR A PARTICULAR PURPOSE.
_ALTCCVERSION_921dbbb2=none
_CXXINTERNAL_acaad9ca=Using built-in specs. Target: powerpc64-undermydesk-freebsd Configured with: FreeBSD/powerpc64 system compiler Thread model: posix gcc version 4.2.1 20070831 patched [FreeBSD] "/usr/bin/ld" "--eh-frame-hdr" "-Qy" "-melf64ppc_fbsd" "--enable-new-dtags" "-dynamic-linker" "/libexec/ld-elf.so.1" "/usr/lib/crt1.o" "/usr/lib/crti.o" "/usr/lib/crtbegin.o" "-L/usr/lib" "-L/usr/lib" "/dev/null" "-lstdc++" "-lm" "-lgcc_s" "-lgcc" "-lc" "-lgcc_s" "-lgcc" "/usr/lib/crtsavres.o" "/usr/lib/crtend.o" "/usr/lib/crtn.o"
CC_OUTPUT_921dbbb2_58173849=yes
CC_OUTPUT_921dbbb2_9bdba57c=yes
CC_OUTPUT_921dbbb2_6a4fe7f5=cc1: error: unrecognized command line option "-std=c11"
CC_OUTPUT_921dbbb2_6bcac02b=yes
CC_OUTPUT_921dbbb2_67d20829=yes
CC_OUTPUT_921dbbb2_bfa62e83=cc1: error: unrecognized command line option "-std=gnu11"
CC_OUTPUT_921dbbb2_f0b4d593=yes
CC_OUTPUT_921dbbb2_308abb44=cc1plus: error: unrecognized command line option "-std=c++0x"
CC_OUTPUT_921dbbb2_f00456e5=cc1plus: error: unrecognized command line option "-std=c++11"
CC_OUTPUT_921dbbb2_65ad290d=cc1plus: error: unrecognized command line option "-std=c++14"
CC_OUTPUT_921dbbb2_f2776b26=cc1plus: error: unrecognized command line option "-std=c++17"
CC_OUTPUT_921dbbb2_b2657cc3=yes
CC_OUTPUT_921dbbb2_380987f7=cc1plus: error: unrecognized command line option "-std=gnu++11"
CC_OUTPUT_921dbbb2_160933ec=cc1plus: error: unrecognized command line option "-std=gnu++14"
CC_OUTPUT_921dbbb2_fb62803b=cc1plus: error: unrecognized command line option "-std=gnu++17"
_OBJC_CCVERSION_921dbbb2=cc (GCC) 4.2.1 20070831 patched [FreeBSD] Copyright (C) 2007 Free Software Foundation, Inc. This is free software; see the source for copying conditions. There is NO warranty; not even for MERCHANTABILITY or FITNESS FOR A PARTICULAR PURPOSE.
_OBJC_ALTCCVERSION_921dbbb2=none
ARCH=powerpc64
PPC_ABI=ELFv1
OPSYS=FreeBSD
_OSRELEASE=12.2-RELEASE
OSREL=12.2
OSVERSION=1202000
PYTHONBASE=/usr/local
CONFIGURE_MAX_CMD_LEN=524288
HAVE_PORTS_ENV=1
#### Misc Poudriere ####
GID=0
UID=0
---End make.conf---
--Resource limits--
cpu time               (seconds, -t)  unlimited
file size           (512-blocks, -f)  unlimited
data seg size           (kbytes, -d)  33554432
stack size              (kbytes, -s)  524288
core file size      (512-blocks, -c)  unlimited
max memory size         (kbytes, -m)  unlimited
locked memory           (kbytes, -l)  unlimited
max user processes              (-u)  89999
open files                      (-n)  1024
virtual mem size        (kbytes, -v)  unlimited
swap limit              (kbytes, -w)  unlimited
socket buffer size       (bytes, -b)  unlimited
pseudo-terminals                (-p)  unlimited
kqueues                         (-k)  unlimited
umtx shared locks               (-o)  unlimited
--End resource limits--
=======================<phase: check-sanity   >============================
===>  License GPLv2 accepted by the user
===========================================================================
=======================<phase: pkg-depends    >============================
===>   snoopy-2.4.12 depends on file: /usr/local/sbin/pkg - not found
===>   Installing existing package /packages/All/pkg-1.16.3.txz
[122powerpc64-quarterly-job-06] Installing pkg-1.16.3...
[122powerpc64-quarterly-job-06] Extracting pkg-1.16.3: .......... done
===>   snoopy-2.4.12 depends on file: /usr/local/sbin/pkg - found
===>   Returning to build of snoopy-2.4.12
===========================================================================
=======================<phase: fetch-depends  >============================
===========================================================================
=======================<phase: fetch          >============================
===>  License GPLv2 accepted by the user
===> Fetching all distfiles required by snoopy-2.4.12 for building
===========================================================================
=======================<phase: checksum       >============================
===>  License GPLv2 accepted by the user
===> Fetching all distfiles required by snoopy-2.4.12 for building
=> SHA256 Checksum OK for snoopy-2.4.12.tar.gz.
===========================================================================
=======================<phase: extract-depends>============================
===========================================================================
=======================<phase: extract        >============================
===>  License GPLv2 accepted by the user
===> Fetching all distfiles required by snoopy-2.4.12 for building
===>  Extracting for snoopy-2.4.12
=> SHA256 Checksum OK for snoopy-2.4.12.tar.gz.
===========================================================================
=======================<phase: patch-depends  >============================
===========================================================================
=======================<phase: patch          >============================
===>  Patching for snoopy-2.4.12
===>  Applying FreeBSD patches for snoopy-2.4.12 from /usr/ports/security/snoopy/files
===========================================================================
=======================<phase: build-depends  >============================
===>   snoopy-2.4.12 depends on executable: bash - not found
===>   Installing existing package /packages/All/bash-5.1.4_1.txz
[122powerpc64-quarterly-job-06] Installing bash-5.1.4_1...
[122powerpc64-quarterly-job-06] `-- Installing gettext-runtime-0.21...
[122powerpc64-quarterly-job-06] |   `-- Installing indexinfo-0.3.1...
[122powerpc64-quarterly-job-06] |   `-- Extracting indexinfo-0.3.1: .... done
[122powerpc64-quarterly-job-06] `-- Extracting gettext-runtime-0.21: .......... done
[122powerpc64-quarterly-job-06] `-- Installing readline-8.1.0...
[122powerpc64-quarterly-job-06] `-- Extracting readline-8.1.0: .......... done
[122powerpc64-quarterly-job-06] Extracting bash-5.1.4_1: .......... done
===>   snoopy-2.4.12 depends on executable: bash - found
===>   Returning to build of snoopy-2.4.12
===>   snoopy-2.4.12 depends on package: gmake>=4.3 - not found
===>   Installing existing package /packages/All/gmake-4.3_2.txz
[122powerpc64-quarterly-job-06] Installing gmake-4.3_2...
[122powerpc64-quarterly-job-06] Extracting gmake-4.3_2: .......... done
===>   snoopy-2.4.12 depends on package: gmake>=4.3 - found
<snip>
checking for dirname... yes
checking for readlink... yes
checking for socat... (cached) yes
checking for ps... yes
checking for wc... yes
checking for ctype.h... (cached) yes
checking for dlfcn.h... (cached) yes
checking for errno.h... (cached) yes
checking for fcntl.h... (cached) yes
checking grp.h usability... yes
checking grp.h presence... yes
checking for grp.h... yes
checking for limits.h... (cached) yes
checking for pwd.h... (cached) yes
checking for stdio.h... (cached) yes
checking for stdlib.h... (cached) yes
checking for string.h... (cached) yes
checking syslog.h usability... yes
checking syslog.h presence... yes
checking for syslog.h... yes
checking for sys/socket.h... (cached) yes
checking for sys/stat.h... (cached) yes
checking sys/syscall.h usability... yes
checking sys/syscall.h presence... yes
checking for sys/syscall.h... yes
checking for sys/time.h... (cached) yes
checking for sys/types.h... (cached) yes
checking for sys/un.h... (cached) yes
checking for time.h... (cached) yes
checking for unistd.h... (cached) yes
checking for inline... inline
checking for pid_t... (cached) yes
checking for size_t... (cached) yes
checking for ssize_t... (cached) yes
checking for uid_t in sys/types.h... (cached) yes
checking for vfork.h... (cached) no
checking for fork... (cached) yes
checking for vfork... (cached) yes
checking for working fork... yes
checking for working vfork... (cached) yes
checking for stdlib.h... (cached) yes
checking for GNU libc compatible malloc... (cached) yes
checking for stdlib.h... (cached) yes
checking for GNU libc compatible realloc... yes
checking for getcwd... (cached) yes
checking for gethostname... (cached) yes
checking for getsid... yes
checking for gettimeofday... (cached) yes
checking for localtime_r... yes
checking for socket... yes
checking for strchr... (cached) yes
checking for strdup... (cached) yes
checking for strrchr... (cached) yes
checking for strstr... (cached) yes
configure: ======================================================================
configure: Snoopy version: 2.4.12
configure: Snoopy build configuration command: ./configure  '--disable-datasource-tid_kernel' 'ac_cv_prog_SNOOPY_PROG_SOCAT_FOUND=yes' '--prefix=/usr/local' '--localstatedir=/var' '--mandir=/usr/local/man' '--disable-silent-rules' '--infodir=/usr/local/share/info/' '--build=powerpc64-portbld-freebsd12.2' 'build_alias=powerpc64-portbld-freebsd12.2' 'CC=cc' 'CFLAGS=-O2 -pipe  -fstack-protector-strong -fno-strict-aliasing ' 'LDFLAGS= -fstack-protector-strong ' 'LIBS=' 'CPPFLAGS=' 'CPP=cpp'
configure: -
configure: Snoopy all features enabled/disabled: no - using defaults
configure: -
configure: Snoopy config file enabled:   yes
configure: Snoopy config file path:      /usr/local/etc/snoopy.ini
configure: Snoopy error logging enabled: no
configure: Snoopy thread safety enabled: no
configure: -
configure: Snoopy datasource enabled: cmdline ................ YES
configure: Snoopy datasource enabled: cwd .................... YES
configure: Snoopy datasource enabled: datetime ............... YES
configure: Snoopy datasource enabled: domain ................. YES
configure: Snoopy datasource enabled: egid ................... YES
configure: Snoopy datasource enabled: egroup ................. YES
configure: Snoopy datasource enabled: env .................... YES
configure: Snoopy datasource enabled: env_all ................ YES
configure: Snoopy datasource enabled: euid ................... YES
configure: Snoopy datasource enabled: eusername .............. YES
configure: Snoopy datasource enabled: filename ............... YES
configure: Snoopy datasource enabled: gid .................... YES
configure: Snoopy datasource enabled: group .................. YES
configure: Snoopy datasource enabled: hostname ............... YES
configure: Snoopy datasource enabled: login .................. YES
configure: Snoopy datasource enabled: pid .................... YES
configure: Snoopy datasource enabled: ppid ................... YES
configure: Snoopy datasource enabled: rpname ................. YES
configure: Snoopy datasource enabled: sid .................... YES
configure: Snoopy datasource enabled: snoopy_configure_command  YES (forced)
configure: Snoopy datasource enabled: snoopy_literal ......... YES
configure: Snoopy datasource enabled: snoopy_threads ......... YES
configure: Snoopy datasource enabled: snoopy_version ......... YES (forced)
configure: Snoopy datasource enabled: tid .................... YES
configure: Snoopy datasource enabled: tid_kernel ............. no
configure: Snoopy datasource enabled: timestamp .............. YES
configure: Snoopy datasource enabled: timestamp_ms ........... YES
configure: Snoopy datasource enabled: timestamp_us ........... YES
configure: Snoopy datasource enabled: tty .................... YES
configure: Snoopy datasource enabled: tty_uid ................ YES
configure: Snoopy datasource enabled: tty_username ........... YES
configure: Snoopy datasource enabled: uid .................... YES
configure: Snoopy datasource enabled: username ............... YES
configure: Snoopy default message format: "[uid:%{uid} sid:%{sid} tty:%{tty} cwd:%{cwd} filename:%{filename}]: %{cmdline}"
configure: -
configure: Snoopy filtering subsystem enabled: yes
configure: Snoopy filter enabled: exclude_spawns_of .......... YES
configure: Snoopy filter enabled: exclude_uid ................ YES
configure: Snoopy filter enabled: only_root .................. YES
configure: Snoopy filter enabled: only_tty ................... YES
configure: Snoopy filter enabled: only_uid ................... YES
configure: Snoopy default filter chain: (none)
configure: -
configure: Snoopy output enabled: devlog ..................... YES
configure: Snoopy output enabled: devnull .................... YES
configure: Snoopy output enabled: devtty ..................... YES
configure: Snoopy output enabled: file ....................... YES (forced)
configure: Snoopy output enabled: socket ..................... YES (forced)
configure: Snoopy output enabled: stderr ..................... YES
configure: Snoopy output enabled: stdout ..................... YES
configure: Snoopy output enabled: syslog ..................... no
configure: Snoopy default output:          default (system dependent)
configure: Snoopy default output argument: (none)
configure: -
configure: Snoopy default syslog facility: LOG_AUTHPRIV
configure: Snoopy default syslog level:    LOG_INFO
configure: Snoopy default syslog ident:    "snoopy"
configure: -
configure: Snoopy development tools: no
configure: Snoopy code coverage enabled: no
configure: ======================================================================
checking for pthread.h... (cached) yes
checking for pthread_self in -lpthread... yes
checking that generated files are newer than configure... done
configure: creating ./config.status
config.status: creating Makefile
config.status: creating contrib/rhel/snoopy.spec
config.status: creating contrib/sles/snoopy.spec
config.status: creating doc/Makefile
config.status: creating etc/Makefile
config.status: creating etc/snoopy.ini
config.status: creating lib/Makefile
config.status: creating lib/inih/Makefile
config.status: creating lib/inih/src/Makefile
config.status: creating lib/liblcthw/Makefile
config.status: creating lib/liblcthw/src/Makefile
config.status: creating src/Makefile
config.status: creating src/datasource/Makefile
config.status: creating src/eventsource/Makefile
config.status: creating src/filter/Makefile
config.status: creating src/output/Makefile
config.status: creating util/Makefile
config.status: creating tests/Makefile
config.status: creating tests/bin/Makefile
config.status: creating tests/combined/Makefile
config.status: creating tests/configfile/Makefile
config.status: creating tests/datasource/Makefile
config.status: creating tests/filter/Makefile
config.status: creating tests/general/Makefile
config.status: creating tests/message/Makefile
config.status: creating tests/output/Makefile
config.status: creating tests/threads/Makefile
config.status: creating util/snoopy-disable
config.status: creating util/snoopy-enable
config.status: creating config.h
config.status: executing depfiles commands
config.status: executing libtool commands
===========================================================================
=======================<phase: build          >============================
===>  Building for snoopy-2.4.12
gmake[1]: Entering directory '/wrkdirs/usr/ports/security/snoopy/work/snoopy-2.4.12'
gmake  all-recursive
gmake[2]: Entering directory '/wrkdirs/usr/ports/security/snoopy/work/snoopy-2.4.12'
Making all in etc
gmake[3]: Entering directory '/wrkdirs/usr/ports/security/snoopy/work/snoopy-2.4.12/etc'
gmake[3]: Nothing to be done for 'all'.
gmake[3]: Leaving directory '/wrkdirs/usr/ports/security/snoopy/work/snoopy-2.4.12/etc'
Making all in lib
gmake[3]: Entering directory '/wrkdirs/usr/ports/security/snoopy/work/snoopy-2.4.12/lib'
Making all in inih
gmake[4]: Entering directory '/wrkdirs/usr/ports/security/snoopy/work/snoopy-2.4.12/lib/inih'
Making all in src
gmake[5]: Entering directory '/wrkdirs/usr/ports/security/snoopy/work/snoopy-2.4.12/lib/inih/src'
depbase=`echo ini.lo | sed 's|[^/]*$|.deps/&|;s|\.lo$||'`;\
/bin/sh ../../../libtool  --tag=CC   --mode=compile cc -DHAVE_CONFIG_H -I. -I../../..    -Wextra -Wno-unused-parameter -std=c99 -Wpedantic -I../../../src -I../../.. -DINI_MAX_LINE=1024 -DINI_INITIAL_ALLOC=1024 -O2 -pipe  -fstack-protector-strong -fno-strict-aliasing  -MT ini.lo -MD -MP -MF $depbase.Tpo -c -o ini.lo ini.c &&\
mv -f $depbase.Tpo $depbase.Plo
libtool: compile:  cc -DHAVE_CONFIG_H -I. -I../../.. -Wextra -Wno-unused-parameter -std=c99 -Wpedantic -I../../../src -I../../.. -DINI_MAX_LINE=1024 -DINI_INITIAL_ALLOC=1024 -O2 -pipe -fstack-protector-strong -fno-strict-aliasing -MT ini.lo -MD -MP -MF .deps/ini.Tpo -c ini.c  -fPIC -DPIC -o .libs/ini.o
cc1: error: unrecognized command line option "-Wpedantic"
gmake[5]: *** [Makefile:459: ini.lo] Error 1
gmake[5]: Leaving directory '/wrkdirs/usr/ports/security/snoopy/work/snoopy-2.4.12/lib/inih/src'
gmake[4]: *** [Makefile:424: all-recursive] Error 1
gmake[4]: Leaving directory '/wrkdirs/usr/ports/security/snoopy/work/snoopy-2.4.12/lib/inih'
gmake[3]: *** [Makefile:426: all-recursive] Error 1
gmake[3]: Leaving directory '/wrkdirs/usr/ports/security/snoopy/work/snoopy-2.4.12/lib'
gmake[2]: *** [Makefile:509: all-recursive] Error 1
gmake[2]: Leaving directory '/wrkdirs/usr/ports/security/snoopy/work/snoopy-2.4.12'
gmake[1]: *** [Makefile:436: all] Error 2
gmake[1]: Leaving directory '/wrkdirs/usr/ports/security/snoopy/work/snoopy-2.4.12'
===> Compilation failed unexpectedly.
Try to set MAKE_JOBS_UNSAFE=yes and rebuild before reporting the failure to
the maintainer.
*** Error code 1

Stop.
make: stopped in /usr/ports/security/snoopy
Received on Sat Jun 26 2021 - 03:30:44 UTC

Original text of this message