[package - 122powerpc64-quarterly][lang/v8] Failed for v8-8.7.220.23 in build

From: <pkg-fallout_at_FreeBSD.org>
Date: Sat, 26 Jun 2021 03:14:18 GMT
You are receiving this mail as a port that you maintain
is failing to build on the FreeBSD package build server.
Please investigate the failure and submit a PR to fix
build.

Maintainer:     sunpoet_at_FreeBSD.org
Log URL:        http://foul1.nyi.freebsd.org/data/122powerpc64-quarterly/67383f941ca2/logs/v8-8.7.220.23.log
Build URL:      http://foul1.nyi.freebsd.org/build.html?mastername=122powerpc64-quarterly&build=67383f941ca2
Log:

=>> Building lang/v8
build started at Sat Jun 26 03:13:12 UTC 2021
port directory: /usr/ports/lang/v8
package name: v8-8.7.220.23
building for: FreeBSD 122powerpc64-quarterly-job-11 12.2-RELEASE FreeBSD 12.2-RELEASE powerpc
maintained by: sunpoet_at_FreeBSD.org
Makefile ident: 
Poudriere version: 3.2.8-8-gaf08dbda
Host OSVERSION: 1400008
Jail OSVERSION: 1202000
Job Id: 11

---Begin Environment---
SHELL=/bin/csh
OSVERSION=1202000
UNAME_v=FreeBSD 12.2-RELEASE
UNAME_r=12.2-RELEASE
BLOCKSIZE=K
MAIL=/var/mail/root
STATUS=1
HOME=/root
PATH=/sbin:/bin:/usr/sbin:/usr/bin:/usr/local/sbin:/usr/local/bin:/root/bin
LOCALBASE=/usr/local
USER=root
LIBEXECPREFIX=/usr/local/libexec/poudriere
POUDRIERE_VERSION=3.2.8-8-gaf08dbda
MASTERMNT=/usr/local/poudriere/data/.m/122powerpc64-quarterly/ref
POUDRIERE_BUILD_TYPE=bulk
PACKAGE_BUILDING=yes
SAVED_TERM=
PWD=/usr/local/poudriere/data/.m/122powerpc64-quarterly/ref/.p/pool
P_PORTS_FEATURES=FLAVORS SELECTED_OPTIONS
MASTERNAME=122powerpc64-quarterly
SCRIPTPREFIX=/usr/local/share/poudriere
OLDPWD=/usr/local/poudriere/data/.m/122powerpc64-quarterly/ref/.p
SCRIPTPATH=/usr/local/share/poudriere/bulk.sh
POUDRIEREPATH=/usr/local/bin/poudriere
---End Environment---

---Begin Poudriere Port Flags/Env---
PORT_FLAGS=
PKGENV=
FLAVOR=
DEPENDS_ARGS=
MAKE_ARGS=
---End Poudriere Port Flags/Env---

---Begin OPTIONS List---
---End OPTIONS List---

--MAINTAINER--
sunpoet_at_FreeBSD.org
--End MAINTAINER--

--CONFIGURE_ARGS--

--End CONFIGURE_ARGS--

--CONFIGURE_ENV--
PKG_CONFIG=pkgconf PYTHON="/usr/local/bin/python3.7" XDG_DATA_HOME=/wrkdirs/usr/ports/lang/v8/work  XDG_CONFIG_HOME=/wrkdirs/usr/ports/lang/v8/work  HOME=/wrkdirs/usr/ports/lang/v8/work TMPDIR="/tmp" PATH=/wrkdirs/usr/ports/lang/v8/work/.bin:/sbin:/bin:/usr/sbin:/usr/bin:/usr/local/sbin:/usr/local/bin:/root/bin SHELL=/bin/sh CONFIG_SHELL=/bin/sh LANG=en_US.UTF-8 LC_ALL=en_US.UTF-8
--End CONFIGURE_ENV--

--MAKE_ENV--
XDG_DATA_HOME=/wrkdirs/usr/ports/lang/v8/work  XDG_CONFIG_HOME=/wrkdirs/usr/ports/lang/v8/work  HOME=/wrkdirs/usr/ports/lang/v8/work TMPDIR="/tmp" PATH=/wrkdirs/usr/ports/lang/v8/work/.bin:/sbin:/bin:/usr/sbin:/usr/bin:/usr/local/sbin:/usr/local/bin:/root/bin NO_PIE=yes MK_DEBUG_FILES=no MK_KERNEL_SYMBOLS=no SHELL=/bin/sh NO_LINT=YES DESTDIR=/wrkdirs/usr/ports/lang/v8/work/stage LANG=en_US.UTF-8 LC_ALL=en_US.UTF-8 PREFIX=/usr/local  LOCALBASE=/usr/local  CC="cc" CFLAGS="-O2 -pipe  -fstack-protector-strong -fno-strict-aliasing "  CPP="cpp" CPPFLAGS=""  LDFLAGS=" -fstack-protector-strong " LIBS=""  CXX="c++" CXXFLAGS="-O2 -pipe -fstack-protector-strong -fno-strict-aliasing  "  MANPREFIX="/usr/local" BSD_INSTALL_PROGRAM="install  -s -m 555"  BSD_INSTALL_LIB="install  -s -m 0644"  BSD_INSTALL_SCRIPT="install  -m 555"  BSD_INSTALL_DATA="install  -m 0644"  BSD_INSTALL_MAN="install  -m 444"
--End MAKE_ENV--

--PLIST_SUB--
PYTHON_INCLUDEDIR=include/python3.7m  PYTHON_LIBDIR=lib/python3.7  PYTHON_PLATFORM=freebsd12  PYTHON_SITELIBDIR=lib/python3.7/site-packages  PYTHON_SUFFIX=37  PYTHON_EXT_SUFFIX=  PYTHON_VER=3.7  PYTHON_VERSION=python3.7 PYTHON2="_at_comment " PYTHON3="" GTK2_VERSION="2.10.0"  GTK3_VERSION="3.0.0" OSREL=12.2 PREFIX=%D LOCALBASE=/usr/local  RESETPREFIX=/usr/local LIB32DIR=lib DOCSDIR="share/doc/v8"  EXAMPLESDIR="share/examples/v8"  DATADIR="share/v8"  WWWDIR="www/v8"  ETCDIR="etc/v8"
--End PLIST_SUB--

--SUB_LIST--
PREFIX=/usr/local LOCALBASE=/usr/local  DATADIR=/usr/local/share/v8 DOCSDIR=/usr/local/share/doc/v8 EXAMPLESDIR=/usr/local/share/examples/v8  WWWDIR=/usr/local/www/v8 ETCDIR=/usr/local/etc/v8
--End SUB_LIST--

---Begin make.conf---
USE_PACKAGE_DEPENDS=yes
BATCH=yes
WRKDIRPREFIX=/wrkdirs
PORTSDIR=/usr/ports
PACKAGES=/packages
DISTDIR=/distfiles
PACKAGE_BUILDING=yes
PACKAGE_BUILDING_FLAVORS=yes
#### /usr/local/etc/poudriere.d/make.conf ####
# XXX: We really need this but cannot use it while 'make checksum' does not
# try the next mirror on checksum failure.  It currently retries the same
# failed mirror and then fails rather then trying another.  It *does*
# try the next if the size is mismatched though.
#MASTER_SITE_FREEBSD=yes
# Build ALLOW_MAKE_JOBS_PACKAGES with 2 jobs
MAKE_JOBS_NUMBER=2
#### /usr/ports/Mk/Scripts/ports_env.sh ####
_CCVERSION_921dbbb2=cc (GCC) 4.2.1 20070831 patched [FreeBSD] Copyright (C) 2007 Free Software Foundation, Inc. This is free software; see the source for copying conditions. There is NO warranty; not even for MERCHANTABILITY or FITNESS FOR A PARTICULAR PURPOSE.
_ALTCCVERSION_921dbbb2=none
_CXXINTERNAL_acaad9ca=Using built-in specs. Target: powerpc64-undermydesk-freebsd Configured with: FreeBSD/powerpc64 system compiler Thread model: posix gcc version 4.2.1 20070831 patched [FreeBSD] "/usr/bin/ld" "--eh-frame-hdr" "-Qy" "-melf64ppc_fbsd" "--enable-new-dtags" "-dynamic-linker" "/libexec/ld-elf.so.1" "/usr/lib/crt1.o" "/usr/lib/crti.o" "/usr/lib/crtbegin.o" "-L/usr/lib" "-L/usr/lib" "/dev/null" "-lstdc++" "-lm" "-lgcc_s" "-lgcc" "-lc" "-lgcc_s" "-lgcc" "/usr/lib/crtsavres.o" "/usr/lib/crtend.o" "/usr/lib/crtn.o"
CC_OUTPUT_921dbbb2_58173849=yes
CC_OUTPUT_921dbbb2_9bdba57c=yes
CC_OUTPUT_921dbbb2_6a4fe7f5=cc1: error: unrecognized command line option "-std=c11"
CC_OUTPUT_921dbbb2_6bcac02b=yes
CC_OUTPUT_921dbbb2_67d20829=yes
CC_OUTPUT_921dbbb2_bfa62e83=cc1: error: unrecognized command line option "-std=gnu11"
CC_OUTPUT_921dbbb2_f0b4d593=yes
CC_OUTPUT_921dbbb2_308abb44=cc1plus: error: unrecognized command line option "-std=c++0x"
CC_OUTPUT_921dbbb2_f00456e5=cc1plus: error: unrecognized command line option "-std=c++11"
CC_OUTPUT_921dbbb2_65ad290d=cc1plus: error: unrecognized command line option "-std=c++14"
CC_OUTPUT_921dbbb2_f2776b26=cc1plus: error: unrecognized command line option "-std=c++17"
CC_OUTPUT_921dbbb2_b2657cc3=yes
CC_OUTPUT_921dbbb2_380987f7=cc1plus: error: unrecognized command line option "-std=gnu++11"
CC_OUTPUT_921dbbb2_160933ec=cc1plus: error: unrecognized command line option "-std=gnu++14"
CC_OUTPUT_921dbbb2_fb62803b=cc1plus: error: unrecognized command line option "-std=gnu++17"
_OBJC_CCVERSION_921dbbb2=cc (GCC) 4.2.1 20070831 patched [FreeBSD] Copyright (C) 2007 Free Software Foundation, Inc. This is free software; see the source for copying conditions. There is NO warranty; not even for MERCHANTABILITY or FITNESS FOR A PARTICULAR PURPOSE.
_OBJC_ALTCCVERSION_921dbbb2=none
ARCH=powerpc64
PPC_ABI=ELFv1
OPSYS=FreeBSD
_OSRELEASE=12.2-RELEASE
OSREL=12.2
OSVERSION=1202000
PYTHONBASE=/usr/local
CONFIGURE_MAX_CMD_LEN=524288
HAVE_PORTS_ENV=1
#### Misc Poudriere ####
GID=0
UID=0
---End make.conf---
--Resource limits--
cpu time               (seconds, -t)  unlimited
file size           (512-blocks, -f)  unlimited
data seg size           (kbytes, -d)  33554432
stack size              (kbytes, -s)  524288
core file size      (512-blocks, -c)  unlimited
max memory size         (kbytes, -m)  unlimited
locked memory           (kbytes, -l)  unlimited
max user processes              (-u)  89999
open files                      (-n)  1024
virtual mem size        (kbytes, -v)  unlimited
swap limit              (kbytes, -w)  unlimited
socket buffer size       (bytes, -b)  unlimited
pseudo-terminals                (-p)  unlimited
kqueues                         (-k)  unlimited
umtx shared locks               (-o)  unlimited
--End resource limits--
=======================<phase: check-sanity   >============================
===>  License BSD3CLAUSE accepted by the user
===========================================================================
=======================<phase: pkg-depends    >============================
===>   v8-8.7.220.23 depends on file: /usr/local/sbin/pkg - not found
===>   Installing existing package /packages/All/pkg-1.16.3.txz
[122powerpc64-quarterly-job-11] Installing pkg-1.16.3...
[122powerpc64-quarterly-job-11] Extracting pkg-1.16.3: .......... done
===>   v8-8.7.220.23 depends on file: /usr/local/sbin/pkg - found
===>   Returning to build of v8-8.7.220.23
===========================================================================
=======================<phase: fetch-depends  >============================
===========================================================================
=======================<phase: fetch          >============================
===>  License BSD3CLAUSE accepted by the user
===> Fetching all distfiles required by v8-8.7.220.23 for building
===========================================================================
=======================<phase: checksum       >============================
===>  License BSD3CLAUSE accepted by the user
===> Fetching all distfiles required by v8-8.7.220.23 for building
=> SHA256 Checksum OK for build-38a49c12ded01dd8c4628b432cb7eebfb29e77f1.tar.gz.
=> SHA256 Checksum OK for buildtools-3ff4f5027b4b81a6c9c36d64d71444f2709a4896.tar.gz.
=> SHA256 Checksum OK for clang-3017edade60658a699be776d9e282509a902ffe9.tar.gz.
=> SHA256 Checksum OK for common-23ef5333a357fc7314630ef88b44c3a545881dee.tar.gz.
=> SHA256 Checksum OK for googletest-4fe018038f87675c083d0cfb6a6b57c274fb1753.tar.gz.
=> SHA256 Checksum OK for icu-aef20f06d47ba76fdf13abcdb033e2a408b5a94d.tar.gz.
=> SHA256 Checksum OK for zlib-4668feaaa47973a6f9d9f9caeb14cd03731854f1.tar.gz.
=> SHA256 Checksum OK for v8-v8-8.7.220.23_GH0.tar.gz.
===========================================================================
=======================<phase: extract-depends>============================
===========================================================================
=======================<phase: extract        >============================
===>  License BSD3CLAUSE accepted by the user
===> Fetching all distfiles required by v8-8.7.220.23 for building
===>  Extracting for v8-8.7.220.23
=> SHA256 Checksum OK for build-38a49c12ded01dd8c4628b432cb7eebfb29e77f1.tar.gz.
=> SHA256 Checksum OK for buildtools-3ff4f5027b4b81a6c9c36d64d71444f2709a4896.tar.gz.
=> SHA256 Checksum OK for clang-3017edade60658a699be776d9e282509a902ffe9.tar.gz.
=> SHA256 Checksum OK for common-23ef5333a357fc7314630ef88b44c3a545881dee.tar.gz.
=> SHA256 Checksum OK for googletest-4fe018038f87675c083d0cfb6a6b57c274fb1753.tar.gz.
=> SHA256 Checksum OK for icu-aef20f06d47ba76fdf13abcdb033e2a408b5a94d.tar.gz.
=> SHA256 Checksum OK for zlib-4668feaaa47973a6f9d9f9caeb14cd03731854f1.tar.gz.
=> SHA256 Checksum OK for v8-v8-8.7.220.23_GH0.tar.gz.
/bin/mkdir -p  /wrkdirs/usr/ports/lang/v8/work/v8-8.7.220.23/base/trace_event/common  /wrkdirs/usr/ports/lang/v8/work/v8-8.7.220.23/build  /wrkdirs/usr/ports/lang/v8/work/v8-8.7.220.23/buildtools  /wrkdirs/usr/ports/lang/v8/work/v8-8.7.220.23/third_party/googletest/src  /wrkdirs/usr/ports/lang/v8/work/v8-8.7.220.23/third_party/icu  /wrkdirs/usr/ports/lang/v8/work/v8-8.7.220.23/third_party/zlib  /wrkdirs/usr/ports/lang/v8/work/v8-8.7.220.23/tools/clang
/usr/bin/tar -xf /portdistfiles/build-38a49c12ded01dd8c4628b432cb7eebfb29e77f1.tar.gz  -C /wrkdirs/usr/ports/lang/v8/work/v8-8.7.220.23/build
/usr/bin/tar -xf /portdistfiles/buildtools-3ff4f5027b4b81a6c9c36d64d71444f2709a4896.tar.gz  -C /wrkdirs/usr/ports/lang/v8/work/v8-8.7.220.23/buildtools
/usr/bin/tar -xf /portdistfiles/clang-3017edade60658a699be776d9e282509a902ffe9.tar.gz  -C /wrkdirs/usr/ports/lang/v8/work/v8-8.7.220.23/tools/clang
/usr/bin/tar -xf /portdistfiles/common-23ef5333a357fc7314630ef88b44c3a545881dee.tar.gz  -C /wrkdirs/usr/ports/lang/v8/work/v8-8.7.220.23/base/trace_event/common
/usr/bin/tar -xf /portdistfiles/googletest-4fe018038f87675c083d0cfb6a6b57c274fb1753.tar.gz  -C /wrkdirs/usr/ports/lang/v8/work/v8-8.7.220.23/third_party/googletest/src
/usr/bin/tar -xf /portdistfiles/icu-aef20f06d47ba76fdf13abcdb033e2a408b5a94d.tar.gz -C /wrkdirs/usr/ports/lang/v8/work/v8-8.7.220.23/third_party/icu
/usr/bin/tar -xf /portdistfiles/zlib-4668feaaa47973a6f9d9f9caeb14cd03731854f1.tar.gz -C /wrkdirs/usr/ports/lang/v8/work/v8-8.7.220.23/third_party/zlib
===========================================================================
=======================<phase: patch-depends  >============================
===========================================================================
=======================<phase: patch          >============================
===>  Patching for v8-8.7.220.23
===>  Applying FreeBSD patches for v8-8.7.220.23 from /usr/ports/lang/v8/files
<snip>
=======================<phase: build-depends  >============================
===>   v8-8.7.220.23 depends on package: binutils>0 - not found
===>   Installing existing package /packages/All/binutils-2.33.1_4,1.txz
[122powerpc64-quarterly-job-11] Installing binutils-2.33.1_4,1...
[122powerpc64-quarterly-job-11] `-- Installing gettext-runtime-0.21...
[122powerpc64-quarterly-job-11] |   `-- Installing indexinfo-0.3.1...
[122powerpc64-quarterly-job-11] |   `-- Extracting indexinfo-0.3.1: .... done
[122powerpc64-quarterly-job-11] `-- Extracting gettext-runtime-0.21: .......... done
[122powerpc64-quarterly-job-11] Extracting binutils-2.33.1_4,1: .......... done
===>   v8-8.7.220.23 depends on package: binutils>0 - found
===>   Returning to build of v8-8.7.220.23
===>   v8-8.7.220.23 depends on executable: gn - not found
===>   Installing existing package /packages/All/gn-1823_2.txz
[122powerpc64-quarterly-job-11] Installing gn-1823_2...
[122powerpc64-quarterly-job-11] `-- Installing gcc10-10.2.0_1...
[122powerpc64-quarterly-job-11] |   `-- Installing gcc9-9.3.0_3...
[122powerpc64-quarterly-job-11] |   | `-- Installing gmp-6.2.1...
[122powerpc64-quarterly-job-11] |   | `-- Extracting gmp-6.2.1: .......... done
[122powerpc64-quarterly-job-11] |   | `-- Installing mpc-1.2.0...
[122powerpc64-quarterly-job-11] |   |   `-- Installing mpfr-4.1.0...
[122powerpc64-quarterly-job-11] |   |   `-- Extracting mpfr-4.1.0: .......... done
[122powerpc64-quarterly-job-11] |   | `-- Extracting mpc-1.2.0: ......... done
[122powerpc64-quarterly-job-11] |   `-- Extracting gcc9-9.3.0_3: .......... done
[122powerpc64-quarterly-job-11] `-- Extracting gcc10-10.2.0_1: .......... done
[122powerpc64-quarterly-job-11] Extracting gn-1823_2: .... done
=====
Message from gcc9-9.3.0_3:

--
To ensure binaries built with this toolchain find appropriate versions
of the necessary run-time libraries, you may want to link using

  -Wl,-rpath=/usr/local/lib/gcc9

For ports leveraging USE_GCC, USES=compiler, or USES=fortran this happens
transparently.
=====
Message from gcc10-10.2.0_1:

--
To ensure binaries built with this toolchain find appropriate versions
of the necessary run-time libraries, you may want to link using

  -Wl,-rpath=/usr/local/lib/gcc10

For ports leveraging USE_GCC, USES=compiler, or USES=fortran this happens
transparently.
===>   v8-8.7.220.23 depends on executable: gn - found
===>   Returning to build of v8-8.7.220.23
===>   v8-8.7.220.23 depends on package: py37-Jinja2>0 - not found
===>   Installing existing package /packages/All/py37-Jinja2-2.11.2_1.txz
[122powerpc64-quarterly-job-11] Installing py37-Jinja2-2.11.2_1...
[122powerpc64-quarterly-job-11] `-- Installing py37-Babel-2.9.0...
[122powerpc64-quarterly-job-11] |   `-- Installing py37-pytz-2021.1,1...
[122powerpc64-quarterly-job-11] |   | `-- Installing py37-setuptools-44.0.0...
[122powerpc64-quarterly-job-11] |   |   `-- Installing python37-3.7.10...
[122powerpc64-quarterly-job-11] |   |   | `-- Installing libffi-3.3_1...
[122powerpc64-quarterly-job-11] |   |   | `-- Extracting libffi-3.3_1: .......... done
[122powerpc64-quarterly-job-11] |   |   | `-- Installing readline-8.1.0...
[122powerpc64-quarterly-job-11] |   |   | `-- Extracting readline-8.1.0: .......... done
[122powerpc64-quarterly-job-11] |   |   `-- Extracting python37-3.7.10: .......... done
[122powerpc64-quarterly-job-11] |   | `-- Extracting py37-setuptools-44.0.0: .......... done
[122powerpc64-quarterly-job-11] |   `-- Extracting py37-pytz-2021.1,1: .......... done
[122powerpc64-quarterly-job-11] `-- Extracting py37-Babel-2.9.0: .......... done
[122powerpc64-quarterly-job-11] `-- Installing py37-markupsafe-1.1.1_1...
[122powerpc64-quarterly-job-11] `-- Extracting py37-markupsafe-1.1.1_1: .......... done
[122powerpc64-quarterly-job-11] Extracting py37-Jinja2-2.11.2_1: .......... done
=====
Message from python37-3.7.10:

--
Note that some standard Python modules are provided as separate ports
as they require additional dependencies. They are available as:

py37-gdbm       databases/py-gdbm_at_py37
py37-sqlite3    databases/py-sqlite3_at_py37
py37-tkinter    x11-toolkits/py-tkinter_at_py37
===>   v8-8.7.220.23 depends on package: py37-Jinja2>0 - found
===>   Returning to build of v8-8.7.220.23
===>   v8-8.7.220.23 depends on package: libunwind>0 - not found
===>   Installing existing package /packages/All/libunwind-20201110.txz
[122powerpc64-quarterly-job-11] Installing libunwind-20201110...
[122powerpc64-quarterly-job-11] Extracting libunwind-20201110: .......... done
===>   v8-8.7.220.23 depends on package: libunwind>0 - found
===>   Returning to build of v8-8.7.220.23
===>   v8-8.7.220.23 depends on package: pkgconf>=1.3.0_1 - not found
===>   Installing existing package /packages/All/pkgconf-1.7.4,1.txz
[122powerpc64-quarterly-job-11] Installing pkgconf-1.7.4,1...
[122powerpc64-quarterly-job-11] Extracting pkgconf-1.7.4,1: .......... done
===>   v8-8.7.220.23 depends on package: pkgconf>=1.3.0_1 - found
===>   Returning to build of v8-8.7.220.23
===>   v8-8.7.220.23 depends on executable: ninja - not found
===>   Installing existing package /packages/All/ninja-1.10.2,2.txz
[122powerpc64-quarterly-job-11] Installing ninja-1.10.2,2...
[122powerpc64-quarterly-job-11] Extracting ninja-1.10.2,2: ........ done
===>   v8-8.7.220.23 depends on executable: ninja - found
===>   Returning to build of v8-8.7.220.23
===>   v8-8.7.220.23 depends on file: /usr/local/bin/python3.7 - found
===========================================================================
=======================<phase: lib-depends    >============================
===>   v8-8.7.220.23 depends on shared library: libicudata.so - not found
===>   Installing existing package /packages/All/icu-68.2,1.txz
[122powerpc64-quarterly-job-11] Installing icu-68.2,1...
[122powerpc64-quarterly-job-11] Extracting icu-68.2,1: .......... done
===>   v8-8.7.220.23 depends on shared library: libicudata.so - found (/usr/local/lib/libicudata.so)
===>   Returning to build of v8-8.7.220.23
===>   v8-8.7.220.23 depends on shared library: libglib-2.0.so - not found
===>   Installing existing package /packages/All/glib-2.66.7_1,1.txz
[122powerpc64-quarterly-job-11] Installing glib-2.66.7_1,1...
[122powerpc64-quarterly-job-11] `-- Installing libiconv-1.16...
[122powerpc64-quarterly-job-11] `-- Extracting libiconv-1.16: .......... done
[122powerpc64-quarterly-job-11] `-- Installing libxml2-2.9.10_4...
[122powerpc64-quarterly-job-11] `-- Extracting libxml2-2.9.10_4: .......... done
[122powerpc64-quarterly-job-11] `-- Installing pcre-8.44...
[122powerpc64-quarterly-job-11] `-- Extracting pcre-8.44: .......... done
[122powerpc64-quarterly-job-11] Extracting glib-2.66.7_1,1: .......... done
No schema files found: doing nothing.
===>   v8-8.7.220.23 depends on shared library: libglib-2.0.so - found (/usr/local/lib/libglib-2.0.so)
===>   Returning to build of v8-8.7.220.23
===>   v8-8.7.220.23 depends on shared library: libintl.so - found (/usr/local/lib/libintl.so)
===========================================================================
=======================<phase: configure      >============================
===>  Configuring for v8-8.7.220.23
cd /wrkdirs/usr/ports/lang/v8/work/v8-8.7.220.23 && /usr/bin/env PKG_CONFIG=pkgconf PYTHON="/usr/local/bin/python3.7" XDG_DATA_HOME=/wrkdirs/usr/ports/lang/v8/work  XDG_CONFIG_HOME=/wrkdirs/usr/ports/lang/v8/work  HOME=/wrkdirs/usr/ports/lang/v8/work TMPDIR="/tmp" PATH=/wrkdirs/usr/ports/lang/v8/work/.bin:/sbin:/bin:/usr/sbin:/usr/bin:/usr/local/sbin:/usr/local/bin:/root/bin SHELL=/bin/sh CONFIG_SHELL=/bin/sh LANG=en_US.UTF-8 LC_ALL=en_US.UTF-8 /usr/local/bin/python3.7  ./build/linux/unbundle/replace_gn_files.py --system-libraries  icu || false
/bin/mkdir -p /wrkdirs/usr/ports/lang/v8/work/v8-8.7.220.23/out/Release/gen/shim_headers/icuuc_shim/third_party/icu/source/common/unicode  /wrkdirs/usr/ports/lang/v8/work/v8-8.7.220.23/out/Release/gen/shim_headers/icui18n_shim/third_party/icu/source/i18n/unicode  /wrkdirs/usr/ports/lang/v8/work/v8-8.7.220.23/out/Release/gen/include
cp -f -R /usr/local/include/unicode /wrkdirs/usr/ports/lang/v8/work/v8-8.7.220.23/out/Release/gen/include
cd /wrkdirs/usr/ports/lang/v8/work/v8-8.7.220.23 && /usr/bin/env PKG_CONFIG=pkgconf PYTHON="/usr/local/bin/python3.7" XDG_DATA_HOME=/wrkdirs/usr/ports/lang/v8/work  XDG_CONFIG_HOME=/wrkdirs/usr/ports/lang/v8/work  HOME=/wrkdirs/usr/ports/lang/v8/work TMPDIR="/tmp" PATH=/wrkdirs/usr/ports/lang/v8/work/.bin:/sbin:/bin:/usr/sbin:/usr/bin:/usr/local/sbin:/usr/local/bin:/root/bin SHELL=/bin/sh CONFIG_SHELL=/bin/sh LANG=en_US.UTF-8 LC_ALL=en_US.UTF-8 gn gen out/Release --args='clang_use_chrome_plugins=false  is_clang=true  treat_warnings_as_errors=false  use_aura=true  use_lld=true  use_custom_libcxx=false  v8_use_external_startup_data=false  extra_cxxflags="-O2 -pipe -fstack-protector-strong -fno-strict-aliasing  "  extra_ldflags=" -fstack-protector-strong "'
Done. Made 157 targets from 86 files in 1298ms
===========================================================================
=======================<phase: build          >============================
===>  Building for v8-8.7.220.23
ninja: Entering directory `out/Release'
[1/1797] c++ -MMD -MF obj/cppgc_base/default-platform.o.d -DUSE_AURA=1 -DUSE_GLIB=1 -DUSE_NSS_CERTS=1 -DUSE_OZONE=1 -DUSE_X11=1 -D_FILE_OFFSET_BITS=64 -D_LARGEFILE_SOURCE -D_LARGEFILE64_SOURCE -D_GNU_SOURCE -DCR_CLANG_REVISION=\"llvmorg-12-init-5035-gd0abc757-3\" -D__STDC_CONSTANT_MACROS -D__STDC_FORMAT_MACROS -DCOMPONENT_BUILD -D_DEBUG -DDYNAMIC_ANNOTATIONS_ENABLED=1 -DENABLE_DISASSEMBLER -DV8_TYPED_ARRAY_MAX_SIZE_IN_HEAP=64 -DENABLE_GDB_JIT_INTERFACE -DENABLE_MINOR_MC -DOBJECT_PRINT -DVERIFY_HEAP -DV8_TRACE_MAPS -DV8_ENABLE_ALLOCATION_TIMEOUT -DV8_ENABLE_FORCE_SLOW_PATH -DV8_ENABLE_DOUBLE_CONST_STORE_CHECK -DV8_INTL_SUPPORT -DENABLE_HANDLE_ZAPPING -DV8_SNAPSHOT_NATIVE_CODE_COUNTERS -DV8_CONCURRENT_MARKING -DV8_ENABLE_LAZY_SOURCE_POSITIONS -DV8_CHECK_MICROTASKS_SCOPES_CONSISTENCY -DV8_SHARED_RO_HEAP -DV8_WIN64_UNWINDING_INFO -DV8_ENABLE_REGEXP_INTERPRETER_THREADED_DISPATCH -DV8_SNAPSHOT_COMPRESSION -DV8_ENABLE_CHECKS -DV8_DEPRECATION_WARNINGS -DV8_IMMINENT_DEPRECATION_WARNINGS -DV8_
 REVERSE_JSARGS -DV8_TARGET_ARCH_PPC64 -DV8_TARGET_ARCH_PPC_BE -DDEBUG -DDISABLE_UNTRUSTED_CODE_MITIGATIONS -DBUILDING_V8_SHARED -DV8_ENABLE_CHECKS -DV8_DEPRECATION_WARNINGS -DV8_IMMINENT_DEPRECATION_WARNINGS -DV8_REVERSE_JSARGS -DUSING_V8_BASE_SHARED -I../.. -Igen -I../.. -I../../include -Igen -fno-strict-aliasing --param=ssp-buffer-size=4 -fstack-protector -funwind-tables -fPIC -pthread -fcolor-diagnostics -fmerge-all-constants -m64 -Wno-builtin-macro-redefined -D__DATE__= -D__TIME__= -D__TIMESTAMP__= -Xclang -fdebug-compilation-dir -Xclang . -no-canonical-prefixes -Wall -Wextra -Wimplicit-fallthrough -Wunreachable-code -Wthread-safety -Wextra-semi -Wno-missing-field-initializers -Wno-unused-parameter -Wno-c++11-narrowing -Wno-unneeded-internal-declaration -Wno-undefined-var-template -fno-omit-frame-pointer -g0 -Xclang -debug-info-kind=constructor -gsplit-dwarf -fvisibility=hidden -Wheader-hygiene -Wstring-conversion -Wtautological-overlap-compare -Wmissing-field-initializers -Wunr
 eachable-code -O3 -fno-ident -fdata-sections!
  -ffunction-sections -Wexit-time-destructors -Wno-undefined-bool-conversion -Wno-tautological-undefined-compare -std=c++14 -fno-trigraphs -Wno-trigraphs -fno-exceptions -fno-rtti -fvisibility-inlines-hidden -O2 -pipe -fstack-protector-strong -fno-strict-aliasing   -c ../../src/heap/cppgc/default-platform.cc -o obj/cppgc_base/default-platform.o
FAILED: obj/cppgc_base/default-platform.o 
c++ -MMD -MF obj/cppgc_base/default-platform.o.d -DUSE_AURA=1 -DUSE_GLIB=1 -DUSE_NSS_CERTS=1 -DUSE_OZONE=1 -DUSE_X11=1 -D_FILE_OFFSET_BITS=64 -D_LARGEFILE_SOURCE -D_LARGEFILE64_SOURCE -D_GNU_SOURCE -DCR_CLANG_REVISION=\"llvmorg-12-init-5035-gd0abc757-3\" -D__STDC_CONSTANT_MACROS -D__STDC_FORMAT_MACROS -DCOMPONENT_BUILD -D_DEBUG -DDYNAMIC_ANNOTATIONS_ENABLED=1 -DENABLE_DISASSEMBLER -DV8_TYPED_ARRAY_MAX_SIZE_IN_HEAP=64 -DENABLE_GDB_JIT_INTERFACE -DENABLE_MINOR_MC -DOBJECT_PRINT -DVERIFY_HEAP -DV8_TRACE_MAPS -DV8_ENABLE_ALLOCATION_TIMEOUT -DV8_ENABLE_FORCE_SLOW_PATH -DV8_ENABLE_DOUBLE_CONST_STORE_CHECK -DV8_INTL_SUPPORT -DENABLE_HANDLE_ZAPPING -DV8_SNAPSHOT_NATIVE_CODE_COUNTERS -DV8_CONCURRENT_MARKING -DV8_ENABLE_LAZY_SOURCE_POSITIONS -DV8_CHECK_MICROTASKS_SCOPES_CONSISTENCY -DV8_SHARED_RO_HEAP -DV8_WIN64_UNWINDING_INFO -DV8_ENABLE_REGEXP_INTERPRETER_THREADED_DISPATCH -DV8_SNAPSHOT_COMPRESSION -DV8_ENABLE_CHECKS -DV8_DEPRECATION_WARNINGS -DV8_IMMINENT_DEPRECATION_WARNINGS -DV8_REVERSE_J
 SARGS -DV8_TARGET_ARCH_PPC64 -DV8_TARGET_ARCH_PPC_BE -DDEBUG -DDISABLE_UNTRUSTED_CODE_MITIGATIONS -DBUILDING_V8_SHARED -DV8_ENABLE_CHECKS -DV8_DEPRECATION_WARNINGS -DV8_IMMINENT_DEPRECATION_WARNINGS -DV8_REVERSE_JSARGS -DUSING_V8_BASE_SHARED -I../.. -Igen -I../.. -I../../include -Igen -fno-strict-aliasing --param=ssp-buffer-size=4 -fstack-protector -funwind-tables -fPIC -pthread -fcolor-diagnostics -fmerge-all-constants -m64 -Wno-builtin-macro-redefined -D__DATE__= -D__TIME__= -D__TIMESTAMP__= -Xclang -fdebug-compilation-dir -Xclang . -no-canonical-prefixes -Wall -Wextra -Wimplicit-fallthrough -Wunreachable-code -Wthread-safety -Wextra-semi -Wno-missing-field-initializers -Wno-unused-parameter -Wno-c++11-narrowing -Wno-unneeded-internal-declaration -Wno-undefined-var-template -fno-omit-frame-pointer -g0 -Xclang -debug-info-kind=constructor -gsplit-dwarf -fvisibility=hidden -Wheader-hygiene -Wstring-conversion -Wtautological-overlap-compare -Wmissing-field-initializers -Wunreachable-
 code -O3 -fno-ident -fdata-sections -ffuncti!
 on-sections -Wexit-time-destructors -Wno-undefined-bool-conversion -Wno-tautological-undefined-compare -std=c++14 -fno-trigraphs -Wno-trigraphs -fno-exceptions -fno-rtti -fvisibility-inlines-hidden -O2 -pipe -fstack-protector-strong -fno-strict-aliasing   -c ../../src/heap/cppgc/default-platform.cc -o obj/cppgc_base/default-platform.o
c++: unrecognized option '-Xclang'
c++: unrecognized option '-Xclang'
c++: unrecognized option '-no-canonical-prefixes'
c++: unrecognized option '-Xclang'
cc1plus: warning: unrecognized gcc debugging option: e
cc1plus: warning: unrecognized gcc debugging option: b
cc1plus: warning: unrecognized gcc debugging option: -
cc1plus: warning: unrecognized gcc debugging option: -
cc1plus: warning: unrecognized gcc debugging option: =
cc1plus: error: unrecognised debug output level "split-dwarf"
cc1plus: error: unrecognized command line option "-Wno-builtin-macro-redefined"
cc1plus: error: unrecognized command line option "-Wimplicit-fallthrough"
cc1plus: error: unrecognized command line option "-Wthread-safety"
cc1plus: error: unrecognized command line option "-Wextra-semi"
cc1plus: error: unrecognized command line option "-Wno-c++11-narrowing"
cc1plus: error: unrecognized command line option "-Wno-unneeded-internal-declaration"
cc1plus: error: unrecognized command line option "-Wno-undefined-var-template"
cc1plus: error: unrecognized command line option "-Wheader-hygiene"
cc1plus: error: unrecognized command line option "-Wstring-conversion"
cc1plus: error: unrecognized command line option "-Wtautological-overlap-compare"
cc1plus: error: unrecognized command line option "-Wexit-time-destructors"
cc1plus: error: unrecognized command line option "-Wno-undefined-bool-conversion"
cc1plus: error: unrecognized command line option "-Wno-tautological-undefined-compare"
cc1plus: error: unrecognized command line option "-std=c++14"
cc1plus: error: unrecognized command line option "-fcolor-diagnostics"
cc1plus: error: unrecognized command line option "-fdebug-compilation-dir"
cc1plus: error: unrecognized command line option "-fno-trigraphs"
[2/1797] c++ -MMD -MF obj/cppgc_base/allocation.o.d -DUSE_AURA=1 -DUSE_GLIB=1 -DUSE_NSS_CERTS=1 -DUSE_OZONE=1 -DUSE_X11=1 -D_FILE_OFFSET_BITS=64 -D_LARGEFILE_SOURCE -D_LARGEFILE64_SOURCE -D_GNU_SOURCE -DCR_CLANG_REVISION=\"llvmorg-12-init-5035-gd0abc757-3\" -D__STDC_CONSTANT_MACROS -D__STDC_FORMAT_MACROS -DCOMPONENT_BUILD -D_DEBUG -DDYNAMIC_ANNOTATIONS_ENABLED=1 -DENABLE_DISASSEMBLER -DV8_TYPED_ARRAY_MAX_SIZE_IN_HEAP=64 -DENABLE_GDB_JIT_INTERFACE -DENABLE_MINOR_MC -DOBJECT_PRINT -DVERIFY_HEAP -DV8_TRACE_MAPS -DV8_ENABLE_ALLOCATION_TIMEOUT -DV8_ENABLE_FORCE_SLOW_PATH -DV8_ENABLE_DOUBLE_CONST_STORE_CHECK -DV8_INTL_SUPPORT -DENABLE_HANDLE_ZAPPING -DV8_SNAPSHOT_NATIVE_CODE_COUNTERS -DV8_CONCURRENT_MARKING -DV8_ENABLE_LAZY_SOURCE_POSITIONS -DV8_CHECK_MICROTASKS_SCOPES_CONSISTENCY -DV8_SHARED_RO_HEAP -DV8_WIN64_UNWINDING_INFO -DV8_ENABLE_REGEXP_INTERPRETER_THREADED_DISPATCH -DV8_SNAPSHOT_COMPRESSION -DV8_ENABLE_CHECKS -DV8_DEPRECATION_WARNINGS -DV8_IMMINENT_DEPRECATION_WARNINGS -DV8_REVERS
 E_JSARGS -DV8_TARGET_ARCH_PPC64 -DV8_TARGET_ARCH_PPC_BE -DDEBUG -DDISABLE_UNTRUSTED_CODE_MITIGATIONS -DBUILDING_V8_SHARED -DV8_ENABLE_CHECKS -DV8_DEPRECATION_WARNINGS -DV8_IMMINENT_DEPRECATION_WARNINGS -DV8_REVERSE_JSARGS -DUSING_V8_BASE_SHARED -I../.. -Igen -I../.. -I../../include -Igen -fno-strict-aliasing --param=ssp-buffer-size=4 -fstack-protector -funwind-tables -fPIC -pthread -fcolor-diagnostics -fmerge-all-constants -m64 -Wno-builtin-macro-redefined -D__DATE__= -D__TIME__= -D__TIMESTAMP__= -Xclang -fdebug-compilation-dir -Xclang . -no-canonical-prefixes -Wall -Wextra -Wimplicit-fallthrough -Wunreachable-code -Wthread-safety -Wextra-semi -Wno-missing-field-initializers -Wno-unused-parameter -Wno-c++11-narrowing -Wno-unneeded-internal-declaration -Wno-undefined-var-template -fno-omit-frame-pointer -g0 -Xclang -debug-info-kind=constructor -gsplit-dwarf -fvisibility=hidden -Wheader-hygiene -Wstring-conversion -Wtautological-overlap-compare -Wmissing-field-initializers -Wunreachab
 le-code -O3 -fno-ident -fdata-sections -ffun!
 ction-sections -Wexit-time-destructors -Wno-undefined-bool-conversion -Wno-tautological-undefined-compare -std=c++14 -fno-trigraphs -Wno-trigraphs -fno-exceptions -fno-rtti -fvisibility-inlines-hidden -O2 -pipe -fstack-protector-strong -fno-strict-aliasing   -c ../../src/heap/cppgc/allocation.cc -o obj/cppgc_base/allocation.o
FAILED: obj/cppgc_base/allocation.o 
c++ -MMD -MF obj/cppgc_base/allocation.o.d -DUSE_AURA=1 -DUSE_GLIB=1 -DUSE_NSS_CERTS=1 -DUSE_OZONE=1 -DUSE_X11=1 -D_FILE_OFFSET_BITS=64 -D_LARGEFILE_SOURCE -D_LARGEFILE64_SOURCE -D_GNU_SOURCE -DCR_CLANG_REVISION=\"llvmorg-12-init-5035-gd0abc757-3\" -D__STDC_CONSTANT_MACROS -D__STDC_FORMAT_MACROS -DCOMPONENT_BUILD -D_DEBUG -DDYNAMIC_ANNOTATIONS_ENABLED=1 -DENABLE_DISASSEMBLER -DV8_TYPED_ARRAY_MAX_SIZE_IN_HEAP=64 -DENABLE_GDB_JIT_INTERFACE -DENABLE_MINOR_MC -DOBJECT_PRINT -DVERIFY_HEAP -DV8_TRACE_MAPS -DV8_ENABLE_ALLOCATION_TIMEOUT -DV8_ENABLE_FORCE_SLOW_PATH -DV8_ENABLE_DOUBLE_CONST_STORE_CHECK -DV8_INTL_SUPPORT -DENABLE_HANDLE_ZAPPING -DV8_SNAPSHOT_NATIVE_CODE_COUNTERS -DV8_CONCURRENT_MARKING -DV8_ENABLE_LAZY_SOURCE_POSITIONS -DV8_CHECK_MICROTASKS_SCOPES_CONSISTENCY -DV8_SHARED_RO_HEAP -DV8_WIN64_UNWINDING_INFO -DV8_ENABLE_REGEXP_INTERPRETER_THREADED_DISPATCH -DV8_SNAPSHOT_COMPRESSION -DV8_ENABLE_CHECKS -DV8_DEPRECATION_WARNINGS -DV8_IMMINENT_DEPRECATION_WARNINGS -DV8_REVERSE_JSARGS 
 -DV8_TARGET_ARCH_PPC64 -DV8_TARGET_ARCH_PPC_BE -DDEBUG -DDISABLE_UNTRUSTED_CODE_MITIGATIONS -DBUILDING_V8_SHARED -DV8_ENABLE_CHECKS -DV8_DEPRECATION_WARNINGS -DV8_IMMINENT_DEPRECATION_WARNINGS -DV8_REVERSE_JSARGS -DUSING_V8_BASE_SHARED -I../.. -Igen -I../.. -I../../include -Igen -fno-strict-aliasing --param=ssp-buffer-size=4 -fstack-protector -funwind-tables -fPIC -pthread -fcolor-diagnostics -fmerge-all-constants -m64 -Wno-builtin-macro-redefined -D__DATE__= -D__TIME__= -D__TIMESTAMP__= -Xclang -fdebug-compilation-dir -Xclang . -no-canonical-prefixes -Wall -Wextra -Wimplicit-fallthrough -Wunreachable-code -Wthread-safety -Wextra-semi -Wno-missing-field-initializers -Wno-unused-parameter -Wno-c++11-narrowing -Wno-unneeded-internal-declaration -Wno-undefined-var-template -fno-omit-frame-pointer -g0 -Xclang -debug-info-kind=constructor -gsplit-dwarf -fvisibility=hidden -Wheader-hygiene -Wstring-conversion -Wtautological-overlap-compare -Wmissing-field-initializers -Wunreachable-code -
 O3 -fno-ident -fdata-sections -ffunction-sec!
 tions -Wexit-time-destructors -Wno-undefined-bool-conversion -Wno-tautological-undefined-compare -std=c++14 -fno-trigraphs -Wno-trigraphs -fno-exceptions -fno-rtti -fvisibility-inlines-hidden -O2 -pipe -fstack-protector-strong -fno-strict-aliasing   -c ../../src/heap/cppgc/allocation.cc -o obj/cppgc_base/allocation.o
c++: unrecognized option '-Xclang'
c++: unrecognized option '-Xclang'
c++: unrecognized option '-no-canonical-prefixes'
c++: unrecognized option '-Xclang'
cc1plus: warning: unrecognized gcc debugging option: e
cc1plus: warning: unrecognized gcc debugging option: b
cc1plus: warning: unrecognized gcc debugging option: -
cc1plus: warning: unrecognized gcc debugging option: -
cc1plus: warning: unrecognized gcc debugging option: =
cc1plus: error: unrecognised debug output level "split-dwarf"
cc1plus: error: unrecognized command line option "-Wno-builtin-macro-redefined"
cc1plus: error: unrecognized command line option "-Wimplicit-fallthrough"
cc1plus: error: unrecognized command line option "-Wthread-safety"
cc1plus: error: unrecognized command line option "-Wextra-semi"
cc1plus: error: unrecognized command line option "-Wno-c++11-narrowing"
cc1plus: error: unrecognized command line option "-Wno-unneeded-internal-declaration"
cc1plus: error: unrecognized command line option "-Wno-undefined-var-template"
cc1plus: error: unrecognized command line option "-Wheader-hygiene"
cc1plus: error: unrecognized command line option "-Wstring-conversion"
cc1plus: error: unrecognized command line option "-Wtautological-overlap-compare"
cc1plus: error: unrecognized command line option "-Wexit-time-destructors"
cc1plus: error: unrecognized command line option "-Wno-undefined-bool-conversion"
cc1plus: error: unrecognized command line option "-Wno-tautological-undefined-compare"
cc1plus: error: unrecognized command line option "-std=c++14"
cc1plus: error: unrecognized command line option "-fcolor-diagnostics"
cc1plus: error: unrecognized command line option "-fdebug-compilation-dir"
cc1plus: error: unrecognized command line option "-fno-trigraphs"
ninja: build stopped: subcommand failed.
===> Compilation failed unexpectedly.
Try to set MAKE_JOBS_UNSAFE=yes and rebuild before reporting the failure to
the maintainer.
*** Error code 1

Stop.
make: stopped in /usr/ports/lang/v8
Received on Sat Jun 26 2021 - 03:14:18 UTC

Original text of this message