[package - 122powerpc64-quarterly][lang/libobjc2] Failed for libobjc2-2.1_3 in build

From: <pkg-fallout_at_FreeBSD.org>
Date: Sat, 26 Jun 2021 02:38:58 GMT
You are receiving this mail as a port that you maintain
is failing to build on the FreeBSD package build server.
Please investigate the failure and submit a PR to fix
build.

Maintainer:     ports_at_FreeBSD.org
Log URL:        http://foul1.nyi.freebsd.org/data/122powerpc64-quarterly/67383f941ca2/logs/libobjc2-2.1_3.log
Build URL:      http://foul1.nyi.freebsd.org/build.html?mastername=122powerpc64-quarterly&build=67383f941ca2
Log:

=>> Building lang/libobjc2
build started at Sat Jun 26 02:37:07 UTC 2021
port directory: /usr/ports/lang/libobjc2
package name: libobjc2-2.1_3
building for: FreeBSD 122powerpc64-quarterly-job-06 12.2-RELEASE FreeBSD 12.2-RELEASE powerpc
maintained by: ports_at_FreeBSD.org
Makefile ident: 
Poudriere version: 3.2.8-8-gaf08dbda
Host OSVERSION: 1400008
Jail OSVERSION: 1202000
Job Id: 06

---Begin Environment---
SHELL=/bin/csh
OSVERSION=1202000
UNAME_v=FreeBSD 12.2-RELEASE
UNAME_r=12.2-RELEASE
BLOCKSIZE=K
MAIL=/var/mail/root
STATUS=1
HOME=/root
PATH=/sbin:/bin:/usr/sbin:/usr/bin:/usr/local/sbin:/usr/local/bin:/root/bin
LOCALBASE=/usr/local
USER=root
LIBEXECPREFIX=/usr/local/libexec/poudriere
POUDRIERE_VERSION=3.2.8-8-gaf08dbda
MASTERMNT=/usr/local/poudriere/data/.m/122powerpc64-quarterly/ref
POUDRIERE_BUILD_TYPE=bulk
PACKAGE_BUILDING=yes
SAVED_TERM=
PWD=/usr/local/poudriere/data/.m/122powerpc64-quarterly/ref/.p/pool
P_PORTS_FEATURES=FLAVORS SELECTED_OPTIONS
MASTERNAME=122powerpc64-quarterly
SCRIPTPREFIX=/usr/local/share/poudriere
OLDPWD=/usr/local/poudriere/data/.m/122powerpc64-quarterly/ref/.p
SCRIPTPATH=/usr/local/share/poudriere/bulk.sh
POUDRIEREPATH=/usr/local/bin/poudriere
---End Environment---

---Begin Poudriere Port Flags/Env---
PORT_FLAGS=
PKGENV=
FLAVOR=
DEPENDS_ARGS=
MAKE_ARGS=
---End Poudriere Port Flags/Env---

---Begin OPTIONS List---
---End OPTIONS List---

--MAINTAINER--
ports_at_FreeBSD.org
--End MAINTAINER--

--CONFIGURE_ARGS--

--End CONFIGURE_ARGS--

--CONFIGURE_ENV--
OBJC="/usr/local/bin/clang70" OBJCFLAGS=" -O2 -pipe  -fno-strict-aliasing  -Wno-import" XDG_DATA_HOME=/wrkdirs/usr/ports/lang/libobjc2/work  XDG_CONFIG_HOME=/wrkdirs/usr/ports/lang/libobjc2/work  HOME=/wrkdirs/usr/ports/lang/libobjc2/work TMPDIR="/tmp" PATH=/wrkdirs/usr/ports/lang/libobjc2/work/.bin:/sbin:/bin:/usr/sbin:/usr/bin:/usr/local/sbin:/usr/local/bin:/root/bin SHELL=/bin/sh CONFIG_SHELL=/bin/sh
--End CONFIGURE_ENV--

--MAKE_ENV--
OBJC="/usr/local/bin/clang70" OBJCFLAGS=" -O2 -pipe  -fno-strict-aliasing  -Wno-import" XDG_DATA_HOME=/wrkdirs/usr/ports/lang/libobjc2/work  XDG_CONFIG_HOME=/wrkdirs/usr/ports/lang/libobjc2/work  HOME=/wrkdirs/usr/ports/lang/libobjc2/work TMPDIR="/tmp" PATH=/wrkdirs/usr/ports/lang/libobjc2/work/.bin:/sbin:/bin:/usr/sbin:/usr/bin:/usr/local/sbin:/usr/local/bin:/root/bin NO_PIE=yes MK_DEBUG_FILES=no MK_KERNEL_SYMBOLS=no SHELL=/bin/sh NO_LINT=YES DESTDIR=/wrkdirs/usr/ports/lang/libobjc2/work/stage PREFIX=/usr/local  LOCALBASE=/usr/local  CC="/usr/local/bin/clang70" CFLAGS="-O2 -pipe  -fno-strict-aliasing "  CPP="/usr/local/bin/clang-cpp70" CPPFLAGS=""  LDFLAGS=" -lm " LIBS=""  CXX="/usr/local/bin/clang++70" CXXFLAGS="-O2 -pipe -fno-strict-aliasing  -stdlib=libstdc++ "  MANPREFIX="/usr/local" BSD_INSTALL_PROGRAM="install  -s -m 555"  BSD_INSTALL_LIB="install  -s -m 0644"  BSD_INSTALL_SCRIPT="install  -m 555"  BSD_INSTALL_DATA="install  -m 0644"  BSD_INSTALL_MAN="install  -m 444"
--End MAKE_ENV--

--PLIST_SUB--
SHLIB_MAJOR=4 SHLIB_MINOR=6 CMAKE_BUILD_TYPE="release" OSREL=12.2 PREFIX=%D LOCALBASE=/usr/local  RESETPREFIX=/usr/local LIB32DIR=lib DOCSDIR="share/doc/libobjc2"  EXAMPLESDIR="share/examples/libobjc2"  DATADIR="share/libobjc2"  WWWDIR="www/libobjc2"  ETCDIR="etc/libobjc2"
--End PLIST_SUB--

--SUB_LIST--
PREFIX=/usr/local LOCALBASE=/usr/local  DATADIR=/usr/local/share/libobjc2 DOCSDIR=/usr/local/share/doc/libobjc2 EXAMPLESDIR=/usr/local/share/examples/libobjc2  WWWDIR=/usr/local/www/libobjc2 ETCDIR=/usr/local/etc/libobjc2
--End SUB_LIST--

---Begin make.conf---
USE_PACKAGE_DEPENDS=yes
BATCH=yes
WRKDIRPREFIX=/wrkdirs
PORTSDIR=/usr/ports
PACKAGES=/packages
DISTDIR=/distfiles
PACKAGE_BUILDING=yes
PACKAGE_BUILDING_FLAVORS=yes
#### /usr/local/etc/poudriere.d/make.conf ####
# XXX: We really need this but cannot use it while 'make checksum' does not
# try the next mirror on checksum failure.  It currently retries the same
# failed mirror and then fails rather then trying another.  It *does*
# try the next if the size is mismatched though.
#MASTER_SITE_FREEBSD=yes
# Build ALLOW_MAKE_JOBS_PACKAGES with 2 jobs
MAKE_JOBS_NUMBER=2
#### /usr/ports/Mk/Scripts/ports_env.sh ####
_CCVERSION_921dbbb2=cc (GCC) 4.2.1 20070831 patched [FreeBSD] Copyright (C) 2007 Free Software Foundation, Inc. This is free software; see the source for copying conditions. There is NO warranty; not even for MERCHANTABILITY or FITNESS FOR A PARTICULAR PURPOSE.
_ALTCCVERSION_921dbbb2=none
_CXXINTERNAL_acaad9ca=Using built-in specs. Target: powerpc64-undermydesk-freebsd Configured with: FreeBSD/powerpc64 system compiler Thread model: posix gcc version 4.2.1 20070831 patched [FreeBSD] "/usr/bin/ld" "--eh-frame-hdr" "-Qy" "-melf64ppc_fbsd" "--enable-new-dtags" "-dynamic-linker" "/libexec/ld-elf.so.1" "/usr/lib/crt1.o" "/usr/lib/crti.o" "/usr/lib/crtbegin.o" "-L/usr/lib" "-L/usr/lib" "/dev/null" "-lstdc++" "-lm" "-lgcc_s" "-lgcc" "-lc" "-lgcc_s" "-lgcc" "/usr/lib/crtsavres.o" "/usr/lib/crtend.o" "/usr/lib/crtn.o"
CC_OUTPUT_921dbbb2_58173849=yes
CC_OUTPUT_921dbbb2_9bdba57c=yes
CC_OUTPUT_921dbbb2_6a4fe7f5=cc1: error: unrecognized command line option "-std=c11"
CC_OUTPUT_921dbbb2_6bcac02b=yes
CC_OUTPUT_921dbbb2_67d20829=yes
CC_OUTPUT_921dbbb2_bfa62e83=cc1: error: unrecognized command line option "-std=gnu11"
CC_OUTPUT_921dbbb2_f0b4d593=yes
CC_OUTPUT_921dbbb2_308abb44=cc1plus: error: unrecognized command line option "-std=c++0x"
CC_OUTPUT_921dbbb2_f00456e5=cc1plus: error: unrecognized command line option "-std=c++11"
CC_OUTPUT_921dbbb2_65ad290d=cc1plus: error: unrecognized command line option "-std=c++14"
CC_OUTPUT_921dbbb2_f2776b26=cc1plus: error: unrecognized command line option "-std=c++17"
CC_OUTPUT_921dbbb2_b2657cc3=yes
CC_OUTPUT_921dbbb2_380987f7=cc1plus: error: unrecognized command line option "-std=gnu++11"
CC_OUTPUT_921dbbb2_160933ec=cc1plus: error: unrecognized command line option "-std=gnu++14"
CC_OUTPUT_921dbbb2_fb62803b=cc1plus: error: unrecognized command line option "-std=gnu++17"
_OBJC_CCVERSION_921dbbb2=cc (GCC) 4.2.1 20070831 patched [FreeBSD] Copyright (C) 2007 Free Software Foundation, Inc. This is free software; see the source for copying conditions. There is NO warranty; not even for MERCHANTABILITY or FITNESS FOR A PARTICULAR PURPOSE.
_OBJC_ALTCCVERSION_921dbbb2=none
ARCH=powerpc64
PPC_ABI=ELFv1
OPSYS=FreeBSD
_OSRELEASE=12.2-RELEASE
OSREL=12.2
OSVERSION=1202000
PYTHONBASE=/usr/local
CONFIGURE_MAX_CMD_LEN=524288
HAVE_PORTS_ENV=1
#### Misc Poudriere ####
GID=0
UID=0
---End make.conf---
--Resource limits--
cpu time               (seconds, -t)  unlimited
file size           (512-blocks, -f)  unlimited
data seg size           (kbytes, -d)  33554432
stack size              (kbytes, -s)  524288
core file size      (512-blocks, -c)  unlimited
max memory size         (kbytes, -m)  unlimited
locked memory           (kbytes, -l)  unlimited
max user processes              (-u)  89999
open files                      (-n)  1024
virtual mem size        (kbytes, -v)  unlimited
swap limit              (kbytes, -w)  unlimited
socket buffer size       (bytes, -b)  unlimited
pseudo-terminals                (-p)  unlimited
kqueues                         (-k)  unlimited
umtx shared locks               (-o)  unlimited
--End resource limits--
=======================<phase: check-sanity   >============================
===>   NOTICE:

The libobjc2 port currently does not have a maintainer. As a result, it is
more likely to have unresolved issues, not be up-to-date, or even be removed in
the future. To volunteer to maintain this port, please create an issue at:

https://bugs.freebsd.org/bugzilla

More information about port maintainership is available at:

https://www.freebsd.org/doc/en/articles/contributing/ports-contributing.html#maintain-port

===>  License MIT accepted by the user
===========================================================================
=======================<phase: pkg-depends    >============================
===>   libobjc2-2.1_3 depends on file: /usr/local/sbin/pkg - not found
===>   Installing existing package /packages/All/pkg-1.16.3.txz
[122powerpc64-quarterly-job-06] Installing pkg-1.16.3...
[122powerpc64-quarterly-job-06] Extracting pkg-1.16.3: .......... done
===>   libobjc2-2.1_3 depends on file: /usr/local/sbin/pkg - found
===>   Returning to build of libobjc2-2.1_3
===========================================================================
=======================<phase: fetch-depends  >============================
===========================================================================
=======================<phase: fetch          >============================
===>   NOTICE:

The libobjc2 port currently does not have a maintainer. As a result, it is
more likely to have unresolved issues, not be up-to-date, or even be removed in
the future. To volunteer to maintain this port, please create an issue at:

https://bugs.freebsd.org/bugzilla

More information about port maintainership is available at:

https://www.freebsd.org/doc/en/articles/contributing/ports-contributing.html#maintain-port

===>  License MIT accepted by the user
===> Fetching all distfiles required by libobjc2-2.1_3 for building
===========================================================================
=======================<phase: checksum       >============================
===>   NOTICE:

The libobjc2 port currently does not have a maintainer. As a result, it is
more likely to have unresolved issues, not be up-to-date, or even be removed in
the future. To volunteer to maintain this port, please create an issue at:

https://bugs.freebsd.org/bugzilla

More information about port maintainership is available at:

https://www.freebsd.org/doc/en/articles/contributing/ports-contributing.html#maintain-port

===>  License MIT accepted by the user
===> Fetching all distfiles required by libobjc2-2.1_3 for building
=> SHA256 Checksum OK for gnustep-libobjc2-v2.1_GH0.tar.gz.
<snip>
[122powerpc64-quarterly-job-06] `-- Extracting rhash-1.4.1: .......... done
[122powerpc64-quarterly-job-06] Extracting cmake-3.19.6: .......... done
=====
Message from ca_root_nss-3.63:

--
FreeBSD does not, and can not warrant that the certification authorities
whose certificates are included in this package have in any way been
audited for trustworthiness or RFC 3647 compliance.

Assessment and verification of trust is the complete responsibility of the
system administrator.


This package installs symlinks to support root certificates discovery by
default for software that uses OpenSSL.

This enables SSL Certificate Verification by client software without manual
intervention.

If you prefer to do this manually, replace the following symlinks with
either an empty file or your site-local certificate bundle.

  * /etc/ssl/cert.pem
  * /usr/local/etc/ssl/cert.pem
  * /usr/local/openssl/cert.pem
=====
Message from gcc9-9.3.0_3:

--
To ensure binaries built with this toolchain find appropriate versions
of the necessary run-time libraries, you may want to link using

  -Wl,-rpath=/usr/local/lib/gcc9

For ports leveraging USE_GCC, USES=compiler, or USES=fortran this happens
transparently.
=====
Message from gcc10-10.2.0_1:

--
To ensure binaries built with this toolchain find appropriate versions
of the necessary run-time libraries, you may want to link using

  -Wl,-rpath=/usr/local/lib/gcc10

For ports leveraging USE_GCC, USES=compiler, or USES=fortran this happens
transparently.
===>   libobjc2-2.1_3 depends on file: /usr/local/bin/cmake - found
===>   Returning to build of libobjc2-2.1_3
===>   libobjc2-2.1_3 depends on executable: ninja - not found
===>   Installing existing package /packages/All/ninja-1.10.2,2.txz
[122powerpc64-quarterly-job-06] Installing ninja-1.10.2,2...
[122powerpc64-quarterly-job-06] `-- Installing python37-3.7.10...
[122powerpc64-quarterly-job-06] |   `-- Installing libffi-3.3_1...
[122powerpc64-quarterly-job-06] |   `-- Extracting libffi-3.3_1: .......... done
[122powerpc64-quarterly-job-06] |   `-- Installing readline-8.1.0...
[122powerpc64-quarterly-job-06] |   `-- Extracting readline-8.1.0: .......... done
[122powerpc64-quarterly-job-06] `-- Extracting python37-3.7.10: .......... done
[122powerpc64-quarterly-job-06] Extracting ninja-1.10.2,2: ........ done
=====
Message from python37-3.7.10:

--
Note that some standard Python modules are provided as separate ports
as they require additional dependencies. They are available as:

py37-gdbm       databases/py-gdbm_at_py37
py37-sqlite3    databases/py-sqlite3_at_py37
py37-tkinter    x11-toolkits/py-tkinter_at_py37
===>   libobjc2-2.1_3 depends on executable: ninja - found
===>   Returning to build of libobjc2-2.1_3
===>   libobjc2-2.1_3 depends on file: /usr/local/bin/clang70 - not found
===>   Installing existing package /packages/All/llvm70-7.0.1_5.txz
[122powerpc64-quarterly-job-06] Installing llvm70-7.0.1_5...
[122powerpc64-quarterly-job-06] `-- Installing libedit-3.1.20210216,1...
[122powerpc64-quarterly-job-06] `-- Extracting libedit-3.1.20210216,1: .......... done
[122powerpc64-quarterly-job-06] `-- Installing libxml2-2.9.10_4...
[122powerpc64-quarterly-job-06] `-- Extracting libxml2-2.9.10_4: .......... done
[122powerpc64-quarterly-job-06] `-- Installing perl5-5.32.1_1...
[122powerpc64-quarterly-job-06] `-- Extracting perl5-5.32.1_1: .......... done
[122powerpc64-quarterly-job-06] Extracting llvm70-7.0.1_5: .......... done
===>   libobjc2-2.1_3 depends on file: /usr/local/bin/clang70 - found
===>   Returning to build of libobjc2-2.1_3
===========================================================================
=======================<phase: lib-depends    >============================
===========================================================================
=======================<phase: configure      >============================
===>  Configuring for libobjc2-2.1_3
===>  Performing out-of-source build
/bin/mkdir -p /wrkdirs/usr/ports/lang/libobjc2/work/.build
-- The C compiler identification is Clang 7.0.1
-- The ASM compiler identification is Clang
-- Found assembler: /usr/local/bin/clang70
-- The CXX compiler identification is Clang 7.0.1
-- Detecting C compiler ABI info
-- Detecting C compiler ABI info - done
-- Check for working C compiler: /usr/local/bin/clang70 - skipped
-- Detecting C compile features
-- Detecting C compile features - done
-- Detecting CXX compiler ABI info
-- Detecting CXX compiler ABI info - done
-- Check for working CXX compiler: /usr/local/bin/clang++70 - skipped
-- Detecting CXX compile features
-- Detecting CXX compile features - done
-- Testing C++ interop
-- Testing /usr/lib/libsupc++.so as the C++ runtime library
-- Testing C++ standard library
-- Using /usr/local/bin/clang70
-- No useable C++ runtime found
-- Looking for pthread.h
-- Looking for pthread.h - found
-- Found Threads: TRUE  
-- GNUstep install type set to NONE
-- Performing Test CXA_ALLOCATE_EXCEPTION_NOEXCEPT_COMPILES
-- Performing Test CXA_ALLOCATE_EXCEPTION_NOEXCEPT_COMPILES - Success
-- Configuring done
-- Generating done
CMake Warning:
  Manually-specified variables were not used by the project:

    CMAKE_COLOR_MAKEFILE
    CMAKE_CXX_FLAGS_DEBUG
    CMAKE_MODULE_LINKER_FLAGS
    CMAKE_VERBOSE_MAKEFILE


-- Build files have been written to: /wrkdirs/usr/ports/lang/libobjc2/work/.build
===========================================================================
=======================<phase: build          >============================
===>  Building for libobjc2-2.1_3
[1/399] cd /wrkdirs/usr/ports/lang/libobjc2/work/.build && /usr/local/bin/clang++70 -fPIC -S /wrkdirs/usr/ports/lang/libobjc2/work/libobjc2-2.1/eh_trampoline.cc -o - -fexceptions -fno-inline | sed s/__gxx_personality_v0/test_eh_personality/g > /wrkdirs/usr/ports/lang/libobjc2/work/.build/eh_trampoline.s
[2/399] /usr/local/bin/clang70 -DGNUSTEP -DNO_LEGACY -DNO_OBJCXX -DNO_SELECTOR_MISMATCH_WARNINGS -DOLDABI_COMPAT=1 -DTYPE_DEPENDENT_DISPATCH -I/wrkdirs/usr/ports/lang/libobjc2/work/libobjc2-2.1 -O2 -pipe  -fno-strict-aliasing -Xclang -fexceptions -Xclang -fobjc-exceptions -O3 -O2 -pipe  -fno-strict-aliasing -Xclang -fblocks -fobjc-runtime=gnustep-1.7 -MD -MT Test/CMakeFiles/test_runtime_legacy.dir/Test.m.o -MF Test/CMakeFiles/test_runtime_legacy.dir/Test.m.o.d -o Test/CMakeFiles/test_runtime_legacy.dir/Test.m.o -c /wrkdirs/usr/ports/lang/libobjc2/work/libobjc2-2.1/Test/Test.m
[3/399] /usr/local/bin/clang70 -DCXA_ALLOCATE_EXCEPTION_SPECIFIER=noexcept -DGNUSTEP -DNO_LEGACY -DNO_OBJCXX -DNO_SELECTOR_MISMATCH_WARNINGS -DOLDABI_COMPAT=1 -DTYPE_DEPENDENT_DISPATCH -D__OBJC_RUNTIME_INTERNAL__=1 -Dobjc_EXPORTS  -O2 -pipe  -fno-strict-aliasing -Xclang -fexceptions -Xclang -fobjc-exceptions -O3 -O2 -pipe  -fno-strict-aliasing -fPIC -MD -MT CMakeFiles/objc.dir/alias_table.c.o -MF CMakeFiles/objc.dir/alias_table.c.o.d -o CMakeFiles/objc.dir/alias_table.c.o -c /wrkdirs/usr/ports/lang/libobjc2/work/libobjc2-2.1/alias_table.c
[4/399] /usr/local/bin/clang70 -DCXA_ALLOCATE_EXCEPTION_SPECIFIER=noexcept -DGNUSTEP -DNO_LEGACY -DNO_OBJCXX -DNO_SELECTOR_MISMATCH_WARNINGS -DOLDABI_COMPAT=1 -DTYPE_DEPENDENT_DISPATCH -D__OBJC_RUNTIME_INTERNAL__=1 -Dobjc_EXPORTS  -O2 -pipe  -fno-strict-aliasing -Xclang -fexceptions -Xclang -fobjc-exceptions -O3 -O2 -pipe  -fno-strict-aliasing -fPIC -MD -MT CMakeFiles/objc.dir/block_to_imp.c.o -MF CMakeFiles/objc.dir/block_to_imp.c.o.d -o CMakeFiles/objc.dir/block_to_imp.c.o -c /wrkdirs/usr/ports/lang/libobjc2/work/libobjc2-2.1/block_to_imp.c
[5/399] /usr/local/bin/clang70 -DCXA_ALLOCATE_EXCEPTION_SPECIFIER=noexcept -DGNUSTEP -DNO_LEGACY -DNO_OBJCXX -DNO_SELECTOR_MISMATCH_WARNINGS -DOLDABI_COMPAT=1 -DTYPE_DEPENDENT_DISPATCH -D__OBJC_RUNTIME_INTERNAL__=1 -Dobjc_EXPORTS  -O2 -pipe  -fno-strict-aliasing -Xclang -fexceptions -Xclang -fobjc-exceptions -O3 -O2 -pipe  -fno-strict-aliasing -fPIC -MD -MT CMakeFiles/objc.dir/caps.c.o -MF CMakeFiles/objc.dir/caps.c.o.d -o CMakeFiles/objc.dir/caps.c.o -c /wrkdirs/usr/ports/lang/libobjc2/work/libobjc2-2.1/caps.c
[6/399] /usr/local/bin/clang70 -DCXA_ALLOCATE_EXCEPTION_SPECIFIER=noexcept -DGNUSTEP -DNO_LEGACY -DNO_OBJCXX -DNO_SELECTOR_MISMATCH_WARNINGS -DOLDABI_COMPAT=1 -DTYPE_DEPENDENT_DISPATCH -D__OBJC_RUNTIME_INTERNAL__=1 -Dobjc_EXPORTS  -O2 -pipe  -fno-strict-aliasing -Xclang -fexceptions -Xclang -fobjc-exceptions -O3 -O2 -pipe  -fno-strict-aliasing -fPIC -MD -MT CMakeFiles/objc.dir/category_loader.c.o -MF CMakeFiles/objc.dir/category_loader.c.o.d -o CMakeFiles/objc.dir/category_loader.c.o -c /wrkdirs/usr/ports/lang/libobjc2/work/libobjc2-2.1/category_loader.c
[7/399] /usr/local/bin/clang70 -DCXA_ALLOCATE_EXCEPTION_SPECIFIER=noexcept -DGNUSTEP -DNO_LEGACY -DNO_OBJCXX -DNO_SELECTOR_MISMATCH_WARNINGS -DOLDABI_COMPAT=1 -DTYPE_DEPENDENT_DISPATCH -D__OBJC_RUNTIME_INTERNAL__=1 -Dobjc_EXPORTS  -O2 -pipe  -fno-strict-aliasing -Xclang -fexceptions -Xclang -fobjc-exceptions -O3 -O2 -pipe  -fno-strict-aliasing -fPIC -MD -MT CMakeFiles/objc.dir/class_table.c.o -MF CMakeFiles/objc.dir/class_table.c.o.d -o CMakeFiles/objc.dir/class_table.c.o -c /wrkdirs/usr/ports/lang/libobjc2/work/libobjc2-2.1/class_table.c
[8/399] /usr/local/bin/clang70 -DCXA_ALLOCATE_EXCEPTION_SPECIFIER=noexcept -DGNUSTEP -DNO_LEGACY -DNO_OBJCXX -DNO_SELECTOR_MISMATCH_WARNINGS -DOLDABI_COMPAT=1 -DTYPE_DEPENDENT_DISPATCH -D__OBJC_RUNTIME_INTERNAL__=1 -Dobjc_EXPORTS  -O2 -pipe  -fno-strict-aliasing -Xclang -fexceptions -Xclang -fobjc-exceptions -O3 -O2 -pipe  -fno-strict-aliasing -fPIC -MD -MT CMakeFiles/objc.dir/dtable.c.o -MF CMakeFiles/objc.dir/dtable.c.o.d -o CMakeFiles/objc.dir/dtable.c.o -c /wrkdirs/usr/ports/lang/libobjc2/work/libobjc2-2.1/dtable.c
[9/399] /usr/local/bin/clang70 -DCXA_ALLOCATE_EXCEPTION_SPECIFIER=noexcept -DGNUSTEP -DNO_LEGACY -DNO_OBJCXX -DNO_SELECTOR_MISMATCH_WARNINGS -DOLDABI_COMPAT=1 -DTYPE_DEPENDENT_DISPATCH -D__OBJC_RUNTIME_INTERNAL__=1 -Dobjc_EXPORTS  -O2 -pipe  -fno-strict-aliasing -Xclang -fexceptions -Xclang -fobjc-exceptions -O3 -O2 -pipe  -fno-strict-aliasing -fPIC -MD -MT CMakeFiles/objc.dir/hooks.c.o -MF CMakeFiles/objc.dir/hooks.c.o.d -o CMakeFiles/objc.dir/hooks.c.o -c /wrkdirs/usr/ports/lang/libobjc2/work/libobjc2-2.1/hooks.c
[10/399] /usr/local/bin/clang70 -DCXA_ALLOCATE_EXCEPTION_SPECIFIER=noexcept -DGNUSTEP -DNO_LEGACY -DNO_OBJCXX -DNO_SELECTOR_MISMATCH_WARNINGS -DOLDABI_COMPAT=1 -DTYPE_DEPENDENT_DISPATCH -D__OBJC_RUNTIME_INTERNAL__=1 -Dobjc_EXPORTS  -O2 -pipe  -fno-strict-aliasing -Xclang -fexceptions -Xclang -fobjc-exceptions -O3 -O2 -pipe  -fno-strict-aliasing -fPIC -MD -MT CMakeFiles/objc.dir/encoding2.c.o -MF CMakeFiles/objc.dir/encoding2.c.o.d -o CMakeFiles/objc.dir/encoding2.c.o -c /wrkdirs/usr/ports/lang/libobjc2/work/libobjc2-2.1/encoding2.c
[11/399] /usr/local/bin/clang70 -DCXA_ALLOCATE_EXCEPTION_SPECIFIER=noexcept -DGNUSTEP -DNO_LEGACY -DNO_OBJCXX -DNO_SELECTOR_MISMATCH_WARNINGS -DOLDABI_COMPAT=1 -DTYPE_DEPENDENT_DISPATCH -D__OBJC_RUNTIME_INTERNAL__=1 -Dobjc_EXPORTS  -O2 -pipe  -fno-strict-aliasing -Xclang -fexceptions -Xclang -fobjc-exceptions -O3 -O2 -pipe  -fno-strict-aliasing -fPIC -MD -MT CMakeFiles/objc.dir/ivar.c.o -MF CMakeFiles/objc.dir/ivar.c.o.d -o CMakeFiles/objc.dir/ivar.c.o -c /wrkdirs/usr/ports/lang/libobjc2/work/libobjc2-2.1/ivar.c
[12/399] /usr/local/bin/clang70 -DCXA_ALLOCATE_EXCEPTION_SPECIFIER=noexcept -DGNUSTEP -DNO_LEGACY -DNO_OBJCXX -DNO_SELECTOR_MISMATCH_WARNINGS -DOLDABI_COMPAT=1 -DTYPE_DEPENDENT_DISPATCH -D__OBJC_RUNTIME_INTERNAL__=1 -Dobjc_EXPORTS  -O2 -pipe  -fno-strict-aliasing -Xclang -fexceptions -Xclang -fobjc-exceptions -O3 -O2 -pipe  -fno-strict-aliasing -fPIC -MD -MT CMakeFiles/objc.dir/loader.c.o -MF CMakeFiles/objc.dir/loader.c.o.d -o CMakeFiles/objc.dir/loader.c.o -c /wrkdirs/usr/ports/lang/libobjc2/work/libobjc2-2.1/loader.c
[13/399] /usr/local/bin/clang70 -DCXA_ALLOCATE_EXCEPTION_SPECIFIER=noexcept -DGNUSTEP -DNO_LEGACY -DNO_OBJCXX -DNO_SELECTOR_MISMATCH_WARNINGS -DOLDABI_COMPAT=1 -DTYPE_DEPENDENT_DISPATCH -D__OBJC_RUNTIME_INTERNAL__=1 -Dobjc_EXPORTS  -O2 -pipe  -fno-strict-aliasing -Xclang -fexceptions -Xclang -fobjc-exceptions -O3 -O2 -pipe  -fno-strict-aliasing -fPIC -MD -MT CMakeFiles/objc.dir/mutation.m.o -MF CMakeFiles/objc.dir/mutation.m.o.d -o CMakeFiles/objc.dir/mutation.m.o -c /wrkdirs/usr/ports/lang/libobjc2/work/libobjc2-2.1/mutation.m
[14/399] /usr/local/bin/clang70 -DCXA_ALLOCATE_EXCEPTION_SPECIFIER=noexcept -DGNUSTEP -DNO_LEGACY -DNO_OBJCXX -DNO_SELECTOR_MISMATCH_WARNINGS -DOLDABI_COMPAT=1 -DTYPE_DEPENDENT_DISPATCH -D__OBJC_RUNTIME_INTERNAL__=1 -Dobjc_EXPORTS  -O2 -pipe  -fno-strict-aliasing -Xclang -fexceptions -Xclang -fobjc-exceptions -O3 -O2 -pipe  -fno-strict-aliasing -fPIC -MD -MT CMakeFiles/objc.dir/protocol.c.o -MF CMakeFiles/objc.dir/protocol.c.o.d -o CMakeFiles/objc.dir/protocol.c.o -c /wrkdirs/usr/ports/lang/libobjc2/work/libobjc2-2.1/protocol.c
[15/399] /usr/local/bin/clang70 -DCXA_ALLOCATE_EXCEPTION_SPECIFIER=noexcept -DGNUSTEP -DNO_LEGACY -DNO_OBJCXX -DNO_SELECTOR_MISMATCH_WARNINGS -DOLDABI_COMPAT=1 -DTYPE_DEPENDENT_DISPATCH -D__OBJC_RUNTIME_INTERNAL__=1 -Dobjc_EXPORTS  -O2 -pipe  -fno-strict-aliasing -Xclang -fexceptions -Xclang -fobjc-exceptions -O3 -O2 -pipe  -fno-strict-aliasing -fPIC -MD -MT CMakeFiles/objc.dir/runtime.c.o -MF CMakeFiles/objc.dir/runtime.c.o.d -o CMakeFiles/objc.dir/runtime.c.o -c /wrkdirs/usr/ports/lang/libobjc2/work/libobjc2-2.1/runtime.c
[16/399] /usr/local/bin/clang70 -DCXA_ALLOCATE_EXCEPTION_SPECIFIER=noexcept -DGNUSTEP -DNO_LEGACY -DNO_OBJCXX -DNO_SELECTOR_MISMATCH_WARNINGS -DOLDABI_COMPAT=1 -DTYPE_DEPENDENT_DISPATCH -D__OBJC_RUNTIME_INTERNAL__=1 -Dobjc_EXPORTS  -O2 -pipe  -fno-strict-aliasing -Xclang -fexceptions -Xclang -fobjc-exceptions -O3 -O2 -pipe  -fno-strict-aliasing -fPIC -MD -MT CMakeFiles/objc.dir/sarray2.c.o -MF CMakeFiles/objc.dir/sarray2.c.o.d -o CMakeFiles/objc.dir/sarray2.c.o -c /wrkdirs/usr/ports/lang/libobjc2/work/libobjc2-2.1/sarray2.c
[17/399] /usr/local/bin/clang70 -DCXA_ALLOCATE_EXCEPTION_SPECIFIER=noexcept -DGNUSTEP -DNO_LEGACY -DNO_OBJCXX -DNO_SELECTOR_MISMATCH_WARNINGS -DOLDABI_COMPAT=1 -DTYPE_DEPENDENT_DISPATCH -D__OBJC_RUNTIME_INTERNAL__=1 -Dobjc_EXPORTS  -O2 -pipe  -fno-strict-aliasing -Xclang -fexceptions -Xclang -fobjc-exceptions -O3 -O2 -pipe  -fno-strict-aliasing -fPIC -MD -MT CMakeFiles/objc.dir/selector_table.c.o -MF CMakeFiles/objc.dir/selector_table.c.o.d -o CMakeFiles/objc.dir/selector_table.c.o -c /wrkdirs/usr/ports/lang/libobjc2/work/libobjc2-2.1/selector_table.c
[18/399] /usr/local/bin/clang70 -DCXA_ALLOCATE_EXCEPTION_SPECIFIER=noexcept -DGNUSTEP -DNO_LEGACY -DNO_OBJCXX -DNO_SELECTOR_MISMATCH_WARNINGS -DOLDABI_COMPAT=1 -DTYPE_DEPENDENT_DISPATCH -D__OBJC_RUNTIME_INTERNAL__=1 -Dobjc_EXPORTS  -O2 -pipe  -fno-strict-aliasing -Xclang -fexceptions -Xclang -fobjc-exceptions -O3 -O2 -pipe  -fno-strict-aliasing -fPIC -MD -MT CMakeFiles/objc.dir/sendmsg2.c.o -MF CMakeFiles/objc.dir/sendmsg2.c.o.d -o CMakeFiles/objc.dir/sendmsg2.c.o -c /wrkdirs/usr/ports/lang/libobjc2/work/libobjc2-2.1/sendmsg2.c
[19/399] /usr/local/bin/clang70 -DCXA_ALLOCATE_EXCEPTION_SPECIFIER=noexcept -DGNUSTEP -DNO_LEGACY -DNO_OBJCXX -DNO_SELECTOR_MISMATCH_WARNINGS -DOLDABI_COMPAT=1 -DTYPE_DEPENDENT_DISPATCH -D__OBJC_RUNTIME_INTERNAL__=1 -Dobjc_EXPORTS  -O2 -pipe  -fno-strict-aliasing -Xclang -fexceptions -Xclang -fobjc-exceptions -O3 -O2 -pipe  -fno-strict-aliasing -fPIC -MD -MT CMakeFiles/objc.dir/eh_personality.c.o -MF CMakeFiles/objc.dir/eh_personality.c.o.d -o CMakeFiles/objc.dir/eh_personality.c.o -c /wrkdirs/usr/ports/lang/libobjc2/work/libobjc2-2.1/eh_personality.c
[20/399] /usr/local/bin/clang70 -DCXA_ALLOCATE_EXCEPTION_SPECIFIER=noexcept -DGNUSTEP -DNO_LEGACY -DNO_OBJCXX -DNO_SELECTOR_MISMATCH_WARNINGS -DOLDABI_COMPAT=1 -DTYPE_DEPENDENT_DISPATCH -D__OBJC_RUNTIME_INTERNAL__=1 -Dobjc_EXPORTS  -O2 -pipe  -fno-strict-aliasing -Xclang -fexceptions -Xclang -fobjc-exceptions -O3 -O2 -pipe  -fno-strict-aliasing -fPIC -MD -MT CMakeFiles/objc.dir/abi_version.c.o -MF CMakeFiles/objc.dir/abi_version.c.o.d -o CMakeFiles/objc.dir/abi_version.c.o -c /wrkdirs/usr/ports/lang/libobjc2/work/libobjc2-2.1/abi_version.c
[21/399] /usr/local/bin/clang70 -DCXA_ALLOCATE_EXCEPTION_SPECIFIER=noexcept -DGNUSTEP -DNO_LEGACY -DNO_OBJCXX -DNO_SELECTOR_MISMATCH_WARNINGS -DOLDABI_COMPAT=1 -DTYPE_DEPENDENT_DISPATCH -D__OBJC_RUNTIME_INTERNAL__=1 -Dobjc_EXPORTS  -O2 -pipe  -fno-strict-aliasing -Xclang -fexceptions -Xclang -fobjc-exceptions -O3 -O2 -pipe  -fno-strict-aliasing -fPIC -MD -MT CMakeFiles/objc.dir/legacy.c.o -MF CMakeFiles/objc.dir/legacy.c.o.d -o CMakeFiles/objc.dir/legacy.c.o -c /wrkdirs/usr/ports/lang/libobjc2/work/libobjc2-2.1/legacy.c
[22/399] /usr/local/bin/clang70 -DCXA_ALLOCATE_EXCEPTION_SPECIFIER=noexcept -DGNUSTEP -DNO_LEGACY -DNO_OBJCXX -DNO_SELECTOR_MISMATCH_WARNINGS -DOLDABI_COMPAT=1 -DTYPE_DEPENDENT_DISPATCH -D__OBJC_RUNTIME_INTERNAL__=1 -Dobjc_EXPORTS  -O2 -pipe  -fno-strict-aliasing -Xclang -fexceptions -Xclang -fobjc-exceptions -O3 -O2 -pipe  -fno-strict-aliasing -fPIC -MD -MT CMakeFiles/objc.dir/statics_loader.c.o -MF CMakeFiles/objc.dir/statics_loader.c.o.d -o CMakeFiles/objc.dir/statics_loader.c.o -c /wrkdirs/usr/ports/lang/libobjc2/work/libobjc2-2.1/statics_loader.c
[23/399] /usr/local/bin/clang70 -DCXA_ALLOCATE_EXCEPTION_SPECIFIER=noexcept -DGNUSTEP -DNO_LEGACY -DNO_OBJCXX -DNO_SELECTOR_MISMATCH_WARNINGS -DOLDABI_COMPAT=1 -DTYPE_DEPENDENT_DISPATCH -D__OBJC_RUNTIME_INTERNAL__=1 -Dobjc_EXPORTS  -O3 -DNDEBUG -fPIC  -Wno-deprecated-objc-isa-usage -Wno-objc-root-class -fobjc-runtime=gnustep-2.0 -Xclang -x -Xclang assembler-with-cpp -MD -MT CMakeFiles/objc.dir/block_trampolines.S.o -MF CMakeFiles/objc.dir/block_trampolines.S.o.d -o CMakeFiles/objc.dir/block_trampolines.S.o -c /wrkdirs/usr/ports/lang/libobjc2/work/libobjc2-2.1/block_trampolines.S
/wrkdirs/usr/ports/lang/libobjc2/work/libobjc2-2.1/block_trampolines.S:149:2: warning: imp_implementationWithBlock() not implemented for your architecture [-W#warnings]
#warning imp_implementationWithBlock() not implemented for your architecture
 ^
1 warning generated.
[24/399] /usr/local/bin/clang70 -DCXA_ALLOCATE_EXCEPTION_SPECIFIER=noexcept -DGNUSTEP -DNO_LEGACY -DNO_OBJCXX -DNO_SELECTOR_MISMATCH_WARNINGS -DOLDABI_COMPAT=1 -DTYPE_DEPENDENT_DISPATCH -D__OBJC_RUNTIME_INTERNAL__=1 -Dobjc_EXPORTS  -O3 -DNDEBUG -fPIC  -Wno-deprecated-objc-isa-usage -Wno-objc-root-class -fobjc-runtime=gnustep-2.0 -Xclang -x -Xclang assembler-with-cpp -MD -MT CMakeFiles/objc.dir/objc_msgSend.S.o -MF CMakeFiles/objc.dir/objc_msgSend.S.o.d -o CMakeFiles/objc.dir/objc_msgSend.S.o -c /wrkdirs/usr/ports/lang/libobjc2/work/libobjc2-2.1/objc_msgSend.S
/wrkdirs/usr/ports/lang/libobjc2/work/libobjc2-2.1/objc_msgSend.S:14:2: warning: objc_msgSend() not implemented for your architecture [-W#warnings]
#warning objc_msgSend() not implemented for your architecture
 ^
1 warning generated.
[25/399] /usr/local/bin/clang70 -DCXA_ALLOCATE_EXCEPTION_SPECIFIER=noexcept -DGNUSTEP -DNO_LEGACY -DNO_OBJCXX -DNO_SELECTOR_MISMATCH_WARNINGS -DOLDABI_COMPAT=1 -DTYPE_DEPENDENT_DISPATCH -D__OBJC_RUNTIME_INTERNAL__=1 -Dobjc_EXPORTS  -O3 -DNDEBUG -fPIC -MD -MT CMakeFiles/objc.dir/eh_trampoline.s.o -MF CMakeFiles/objc.dir/eh_trampoline.s.o.d -o CMakeFiles/objc.dir/eh_trampoline.s.o -c eh_trampoline.s
clang-7: warning: argument unused during compilation: '-D CXA_ALLOCATE_EXCEPTION_SPECIFIER=noexcept' [-Wunused-command-line-argument]
clang-7: warning: argument unused during compilation: '-D GNUSTEP' [-Wunused-command-line-argument]
clang-7: warning: argument unused during compilation: '-D NO_LEGACY' [-Wunused-command-line-argument]
clang-7: warning: argument unused during compilation: '-D NO_OBJCXX' [-Wunused-command-line-argument]
clang-7: warning: argument unused during compilation: '-D NO_SELECTOR_MISMATCH_WARNINGS' [-Wunused-command-line-argument]
clang-7: warning: argument unused during compilation: '-D OLDABI_COMPAT=1' [-Wunused-command-line-argument]
clang-7: warning: argument unused during compilation: '-D TYPE_DEPENDENT_DISPATCH' [-Wunused-command-line-argument]
clang-7: warning: argument unused during compilation: '-D __OBJC_RUNTIME_INTERNAL__=1' [-Wunused-command-line-argument]
clang-7: warning: argument unused during compilation: '-D objc_EXPORTS' [-Wunused-command-line-argument]
clang-7: warning: argument unused during compilation: '-D NDEBUG' [-Wunused-command-line-argument]
clang-7: warning: argument unused during compilation: '-MD' [-Wunused-command-line-argument]
clang-7: warning: argument unused during compilation: '-MT CMakeFiles/objc.dir/eh_trampoline.s.o' [-Wunused-command-line-argument]
clang-7: warning: argument unused during compilation: '-MF CMakeFiles/objc.dir/eh_trampoline.s.o.d' [-Wunused-command-line-argument]
[26/399] /usr/local/bin/clang70 -DCXA_ALLOCATE_EXCEPTION_SPECIFIER=noexcept -DGNUSTEP -DNO_LEGACY -DNO_OBJCXX -DNO_SELECTOR_MISMATCH_WARNINGS -DOLDABI_COMPAT=1 -DTYPE_DEPENDENT_DISPATCH -D__OBJC_RUNTIME_INTERNAL__=1 -Dobjc_EXPORTS  -O2 -pipe  -fno-strict-aliasing -Xclang -fexceptions -Xclang -fobjc-exceptions -O3 -O2 -pipe  -fno-strict-aliasing -fPIC  -Wno-deprecated-objc-isa-usage -Wno-objc-root-class -fobjc-runtime=gnustep-2.0 -Xclang -x -Xclang objective-c -MD -MT CMakeFiles/objc.dir/NSBlocks.m.o -MF CMakeFiles/objc.dir/NSBlocks.m.o.d -o CMakeFiles/objc.dir/NSBlocks.m.o -c /wrkdirs/usr/ports/lang/libobjc2/work/libobjc2-2.1/NSBlocks.m
[27/399] /usr/local/bin/clang70 -DCXA_ALLOCATE_EXCEPTION_SPECIFIER=noexcept -DGNUSTEP -DNO_LEGACY -DNO_OBJCXX -DNO_SELECTOR_MISMATCH_WARNINGS -DOLDABI_COMPAT=1 -DTYPE_DEPENDENT_DISPATCH -D__OBJC_RUNTIME_INTERNAL__=1 -Dobjc_EXPORTS  -O2 -pipe  -fno-strict-aliasing -Xclang -fexceptions -Xclang -fobjc-exceptions -O3 -O2 -pipe  -fno-strict-aliasing -fPIC  -Wno-deprecated-objc-isa-usage -Wno-objc-root-class -fobjc-runtime=gnustep-2.0 -Xclang -x -Xclang objective-c -MD -MT CMakeFiles/objc.dir/Protocol2.m.o -MF CMakeFiles/objc.dir/Protocol2.m.o.d -o CMakeFiles/objc.dir/Protocol2.m.o -c /wrkdirs/usr/ports/lang/libobjc2/work/libobjc2-2.1/Protocol2.m
[28/399] /usr/local/bin/clang70 -DCXA_ALLOCATE_EXCEPTION_SPECIFIER=noexcept -DGNUSTEP -DNO_LEGACY -DNO_OBJCXX -DNO_SELECTOR_MISMATCH_WARNINGS -DOLDABI_COMPAT=1 -DTYPE_DEPENDENT_DISPATCH -D__OBJC_RUNTIME_INTERNAL__=1 -Dobjc_EXPORTS  -O2 -pipe  -fno-strict-aliasing -Xclang -fexceptions -Xclang -fobjc-exceptions -O3 -O2 -pipe  -fno-strict-aliasing -fPIC  -Wno-deprecated-objc-isa-usage -Wno-objc-root-class -fobjc-runtime=gnustep-2.0 -Xclang -x -Xclang objective-c -MD -MT CMakeFiles/objc.dir/blocks_runtime.m.o -MF CMakeFiles/objc.dir/blocks_runtime.m.o.d -o CMakeFiles/objc.dir/blocks_runtime.m.o -c /wrkdirs/usr/ports/lang/libobjc2/work/libobjc2-2.1/blocks_runtime.m
[29/399] /usr/local/bin/clang70 -DCXA_ALLOCATE_EXCEPTION_SPECIFIER=noexcept -DGNUSTEP -DNO_LEGACY -DNO_OBJCXX -DNO_SELECTOR_MISMATCH_WARNINGS -DOLDABI_COMPAT=1 -DTYPE_DEPENDENT_DISPATCH -D__OBJC_RUNTIME_INTERNAL__=1 -Dobjc_EXPORTS  -O2 -pipe  -fno-strict-aliasing -Xclang -fexceptions -Xclang -fobjc-exceptions -O3 -O2 -pipe  -fno-strict-aliasing -fPIC  -Wno-deprecated-objc-isa-usage -Wno-objc-root-class -fobjc-runtime=gnustep-2.0 -Xclang -x -Xclang objective-c -MD -MT CMakeFiles/objc.dir/associate.m.o -MF CMakeFiles/objc.dir/associate.m.o.d -o CMakeFiles/objc.dir/associate.m.o -c /wrkdirs/usr/ports/lang/libobjc2/work/libobjc2-2.1/associate.m
[30/399] /usr/local/bin/clang70 -DCXA_ALLOCATE_EXCEPTION_SPECIFIER=noexcept -DGNUSTEP -DNO_LEGACY -DNO_OBJCXX -DNO_SELECTOR_MISMATCH_WARNINGS -DOLDABI_COMPAT=1 -DTYPE_DEPENDENT_DISPATCH -D__OBJC_RUNTIME_INTERNAL__=1 -Dobjc_EXPORTS  -O2 -pipe  -fno-strict-aliasing -Xclang -fexceptions -Xclang -fobjc-exceptions -O3 -O2 -pipe  -fno-strict-aliasing -fPIC  -Wno-deprecated-objc-isa-usage -Wno-objc-root-class -fobjc-runtime=gnustep-2.0 -Xclang -x -Xclang objective-c -MD -MT CMakeFiles/objc.dir/gc_none.c.o -MF CMakeFiles/objc.dir/gc_none.c.o.d -o CMakeFiles/objc.dir/gc_none.c.o -c /wrkdirs/usr/ports/lang/libobjc2/work/libobjc2-2.1/gc_none.c
[31/399] /usr/local/bin/clang70 -DCXA_ALLOCATE_EXCEPTION_SPECIFIER=noexcept -DGNUSTEP -DNO_LEGACY -DNO_OBJCXX -DNO_SELECTOR_MISMATCH_WARNINGS -DOLDABI_COMPAT=1 -DTYPE_DEPENDENT_DISPATCH -D__OBJC_RUNTIME_INTERNAL__=1 -Dobjc_EXPORTS  -O2 -pipe  -fno-strict-aliasing -Xclang -fexceptions -Xclang -fobjc-exceptions -O3 -O2 -pipe  -fno-strict-aliasing -fPIC  -Wno-deprecated-objc-isa-usage -Wno-objc-root-class -fobjc-runtime=gnustep-2.0 -Xclang -x -Xclang objective-c -MD -MT CMakeFiles/objc.dir/properties.m.o -MF CMakeFiles/objc.dir/properties.m.o.d -o CMakeFiles/objc.dir/properties.m.o -c /wrkdirs/usr/ports/lang/libobjc2/work/libobjc2-2.1/properties.m
[32/399] /usr/local/bin/clang++70 -DCXA_ALLOCATE_EXCEPTION_SPECIFIER=noexcept -DGNUSTEP -DNO_LEGACY -DNO_OBJCXX -DNO_SELECTOR_MISMATCH_WARNINGS -DOLDABI_COMPAT=1 -DTYPE_DEPENDENT_DISPATCH -D__OBJC_RUNTIME_INTERNAL__=1 -Dobjc_EXPORTS  -O2 -pipe -fno-strict-aliasing  -stdlib=libstdc++ -O2 -pipe -fno-strict-aliasing  -stdlib=libstdc++ -fPIC -std=gnu++14  -Wno-deprecated-objc-isa-usage -Wno-objc-root-class -fobjc-runtime=gnustep-2.0 -Xclang -x -Xclang objective-c++ -MD -MT CMakeFiles/objc.dir/arc.mm.o -MF CMakeFiles/objc.dir/arc.mm.o.d -o CMakeFiles/objc.dir/arc.mm.o -c /wrkdirs/usr/ports/lang/libobjc2/work/libobjc2-2.1/arc.mm
FAILED: CMakeFiles/objc.dir/arc.mm.o 
/usr/local/bin/clang++70 -DCXA_ALLOCATE_EXCEPTION_SPECIFIER=noexcept -DGNUSTEP -DNO_LEGACY -DNO_OBJCXX -DNO_SELECTOR_MISMATCH_WARNINGS -DOLDABI_COMPAT=1 -DTYPE_DEPENDENT_DISPATCH -D__OBJC_RUNTIME_INTERNAL__=1 -Dobjc_EXPORTS  -O2 -pipe -fno-strict-aliasing  -stdlib=libstdc++ -O2 -pipe -fno-strict-aliasing  -stdlib=libstdc++ -fPIC -std=gnu++14  -Wno-deprecated-objc-isa-usage -Wno-objc-root-class -fobjc-runtime=gnustep-2.0 -Xclang -x -Xclang objective-c++ -MD -MT CMakeFiles/objc.dir/arc.mm.o -MF CMakeFiles/objc.dir/arc.mm.o.d -o CMakeFiles/objc.dir/arc.mm.o -c /wrkdirs/usr/ports/lang/libobjc2/work/libobjc2-2.1/arc.mm
In file included from /wrkdirs/usr/ports/lang/libobjc2/work/libobjc2-2.1/arc.mm:6:
/wrkdirs/usr/ports/lang/libobjc2/work/libobjc2-2.1/third_party/robin-map/include/tsl/robin_map.h:30:10: fatal error: 'initializer_list' file not found
#include <initializer_list>
         ^~~~~~~~~~~~~~~~~~
1 error generated.
[33/399] /usr/local/bin/clang70 -DGNUSTEP -DNO_LEGACY -DNO_OBJCXX -DNO_SELECTOR_MISMATCH_WARNINGS -DOLDABI_COMPAT=1 -DTYPE_DEPENDENT_DISPATCH -I/wrkdirs/usr/ports/lang/libobjc2/work/libobjc2-2.1 -O2 -pipe  -fno-strict-aliasing -Xclang -fexceptions -Xclang -fobjc-exceptions -O3 -O2 -pipe  -fno-strict-aliasing -Xclang -fblocks -Xclang -fobjc-exceptions -O3 -fobjc-runtime=gnustep-1.7 -UNDEBUG -MD -MT Test/CMakeFiles/ForwardDeclareProtocolAccess_legacy_optimised.dir/ForwardDeclareProtocolAccess.m.o -MF Test/CMakeFiles/ForwardDeclareProtocolAccess_legacy_optimised.dir/ForwardDeclareProtocolAccess.m.o.d -o Test/CMakeFiles/ForwardDeclareProtocolAccess_legacy_optimised.dir/ForwardDeclareProtocolAccess.m.o -c /wrkdirs/usr/ports/lang/libobjc2/work/libobjc2-2.1/Test/ForwardDeclareProtocolAccess.m
ninja: build stopped: subcommand failed.
===> Compilation failed unexpectedly.
Try to set MAKE_JOBS_UNSAFE=yes and rebuild before reporting the failure to
the maintainer.
*** Error code 1

Stop.
make: stopped in /usr/ports/lang/libobjc2
Received on Sat Jun 26 2021 - 02:38:58 UTC

Original text of this message