[package - 122arm64-quarterly][sysutils/fcode-utils] Failed for fcode-utils-1.0.2 in build

From: <pkg-fallout_at_FreeBSD.org>
Date: Sat, 26 Jun 2021 01:27:21 GMT
You are receiving this mail as a port that you maintain
is failing to build on the FreeBSD package build server.
Please investigate the failure and submit a PR to fix
build.

Maintainer:     pkubaj_at_FreeBSD.org
Log URL:        http://ampere1.nyi.freebsd.org/data/122arm64-quarterly/67383f941ca2/logs/fcode-utils-1.0.2.log
Build URL:      http://ampere1.nyi.freebsd.org/build.html?mastername=122arm64-quarterly&build=67383f941ca2
Log:

=>> Building sysutils/fcode-utils
build started at Sat Jun 26 01:27:14 UTC 2021
port directory: /usr/ports/sysutils/fcode-utils
package name: fcode-utils-1.0.2
building for: FreeBSD 122arm64-quarterly-job-03 12.2-RELEASE FreeBSD 12.2-RELEASE arm64
maintained by: pkubaj_at_FreeBSD.org
Makefile ident: 
Poudriere version: 3.2.8-8-gaf08dbda
Host OSVERSION: 1400008
Jail OSVERSION: 1202000
Job Id: 03

---Begin Environment---
SHELL=/bin/csh
OSVERSION=1202000
UNAME_v=FreeBSD 12.2-RELEASE
UNAME_r=12.2-RELEASE
BLOCKSIZE=K
MAIL=/var/mail/root
STATUS=1
HOME=/root
PATH=/sbin:/bin:/usr/sbin:/usr/bin:/usr/local/sbin:/usr/local/bin:/root/bin
LOCALBASE=/usr/local
USER=root
LIBEXECPREFIX=/usr/local/libexec/poudriere
POUDRIERE_VERSION=3.2.8-8-gaf08dbda
MASTERMNT=/usr/local/poudriere/data/.m/122arm64-quarterly/ref
POUDRIERE_BUILD_TYPE=bulk
PACKAGE_BUILDING=yes
SAVED_TERM=
PWD=/usr/local/poudriere/data/.m/122arm64-quarterly/ref/.p/pool
P_PORTS_FEATURES=FLAVORS SELECTED_OPTIONS
MASTERNAME=122arm64-quarterly
SCRIPTPREFIX=/usr/local/share/poudriere
OLDPWD=/usr/local/poudriere/data/.m/122arm64-quarterly/ref/.p
SCRIPTPATH=/usr/local/share/poudriere/bulk.sh
POUDRIEREPATH=/usr/local/bin/poudriere
---End Environment---

---Begin Poudriere Port Flags/Env---
PORT_FLAGS=
PKGENV=
FLAVOR=
DEPENDS_ARGS=
MAKE_ARGS=
---End Poudriere Port Flags/Env---

---Begin OPTIONS List---
===> The following configuration options are available for fcode-utils-1.0.2:
     DOCS=on: Build and/or install documentation
===> Use 'make config' to modify these settings
---End OPTIONS List---

--MAINTAINER--
pkubaj_at_FreeBSD.org
--End MAINTAINER--

--CONFIGURE_ARGS--

--End CONFIGURE_ARGS--

--CONFIGURE_ENV--
MAKE=gmake XDG_DATA_HOME=/wrkdirs/usr/ports/sysutils/fcode-utils/work  XDG_CONFIG_HOME=/wrkdirs/usr/ports/sysutils/fcode-utils/work  HOME=/wrkdirs/usr/ports/sysutils/fcode-utils/work TMPDIR="/tmp" PATH=/wrkdirs/usr/ports/sysutils/fcode-utils/work/.bin:/sbin:/bin:/usr/sbin:/usr/bin:/usr/local/sbin:/usr/local/bin:/root/bin SHELL=/bin/sh CONFIG_SHELL=/bin/sh
--End CONFIGURE_ENV--

--MAKE_ENV--
XDG_DATA_HOME=/wrkdirs/usr/ports/sysutils/fcode-utils/work  XDG_CONFIG_HOME=/wrkdirs/usr/ports/sysutils/fcode-utils/work  HOME=/wrkdirs/usr/ports/sysutils/fcode-utils/work TMPDIR="/tmp" PATH=/wrkdirs/usr/ports/sysutils/fcode-utils/work/.bin:/sbin:/bin:/usr/sbin:/usr/bin:/usr/local/sbin:/usr/local/bin:/root/bin NO_PIE=yes MK_DEBUG_FILES=no MK_KERNEL_SYMBOLS=no SHELL=/bin/sh NO_LINT=YES PREFIX=/usr/local  LOCALBASE=/usr/local  CC="cc" CFLAGS="-O2 -pipe  -fstack-protector-strong -fno-strict-aliasing "  CPP="cpp" CPPFLAGS=""  LDFLAGS=" -fstack-protector-strong " LIBS=""  CXX="c++" CXXFLAGS="-O2 -pipe -fstack-protector-strong -fno-strict-aliasing  "  MANPREFIX="/usr/local" BSD_INSTALL_PROGRAM="install  -s -m 555"  BSD_INSTALL_LIB="install  -s -m 0644"  BSD_INSTALL_SCRIPT="install  -m 555"  BSD_INSTALL_DATA="install  -m 0644"  BSD_INSTALL_MAN="install  -m 444"
--End MAKE_ENV--

--PLIST_SUB--
PORTDOCS="" OSREL=12.2 PREFIX=%D LOCALBASE=/usr/local  RESETPREFIX=/usr/local LIB32DIR=lib DOCSDIR="share/doc/fcode-utils"  EXAMPLESDIR="share/examples/fcode-utils"  DATADIR="share/fcode-utils"  WWWDIR="www/fcode-utils"  ETCDIR="etc/fcode-utils"
--End PLIST_SUB--

--SUB_LIST--
PREFIX=/usr/local LOCALBASE=/usr/local  DATADIR=/usr/local/share/fcode-utils DOCSDIR=/usr/local/share/doc/fcode-utils EXAMPLESDIR=/usr/local/share/examples/fcode-utils  WWWDIR=/usr/local/www/fcode-utils ETCDIR=/usr/local/etc/fcode-utils
--End SUB_LIST--

---Begin make.conf---
USE_PACKAGE_DEPENDS=yes
BATCH=yes
WRKDIRPREFIX=/wrkdirs
PORTSDIR=/usr/ports
PACKAGES=/packages
DISTDIR=/distfiles
PACKAGE_BUILDING=yes
PACKAGE_BUILDING_FLAVORS=yes
#### /usr/local/etc/poudriere.d/make.conf ####
# XXX: We really need this but cannot use it while 'make checksum' does not
# try the next mirror on checksum failure.  It currently retries the same
# failed mirror and then fails rather then trying another.  It *does*
# try the next if the size is mismatched though.
#MASTER_SITE_FREEBSD=yes
# Build ALLOW_MAKE_JOBS_PACKAGES with 2 jobs
MAKE_JOBS_NUMBER=2
#### /usr/ports/Mk/Scripts/ports_env.sh ####
_CCVERSION_921dbbb2=FreeBSD clang version 10.0.1 (git_at_github.com:llvm/llvm-project.git llvmorg-10.0.1-0-gef32c611aa2) Target: aarch64-unknown-freebsd12.2 Thread model: posix InstalledDir: /usr/bin
_ALTCCVERSION_921dbbb2=none
_CXXINTERNAL_acaad9ca=FreeBSD clang version 10.0.1 (git_at_github.com:llvm/llvm-project.git llvmorg-10.0.1-0-gef32c611aa2) Target: aarch64-unknown-freebsd12.2 Thread model: posix InstalledDir: /usr/bin "/usr/bin/ld" "--eh-frame-hdr" "-dynamic-linker" "/libexec/ld-elf.so.1" "--enable-new-dtags" "-o" "a.out" "/usr/lib/crt1.o" "/usr/lib/crti.o" "/usr/lib/crtbegin.o" "-L/usr/lib" "/dev/null" "-lc++" "-lm" "-lgcc" "--as-needed" "-lgcc_s" "--no-as-needed" "-lc" "-lgcc" "--as-needed" "-lgcc_s" "--no-as-needed" "/usr/lib/crtend.o" "/usr/lib/crtn.o"
CC_OUTPUT_921dbbb2_58173849=yes
CC_OUTPUT_921dbbb2_9bdba57c=yes
CC_OUTPUT_921dbbb2_6a4fe7f5=yes
CC_OUTPUT_921dbbb2_6bcac02b=yes
CC_OUTPUT_921dbbb2_67d20829=yes
CC_OUTPUT_921dbbb2_bfa62e83=yes
CC_OUTPUT_921dbbb2_f0b4d593=yes
CC_OUTPUT_921dbbb2_308abb44=yes
CC_OUTPUT_921dbbb2_f00456e5=yes
CC_OUTPUT_921dbbb2_65ad290d=yes
CC_OUTPUT_921dbbb2_f2776b26=yes
CC_OUTPUT_921dbbb2_b2657cc3=yes
CC_OUTPUT_921dbbb2_380987f7=yes
CC_OUTPUT_921dbbb2_160933ec=yes
CC_OUTPUT_921dbbb2_fb62803b=yes
_OBJC_CCVERSION_921dbbb2=FreeBSD clang version 10.0.1 (git_at_github.com:llvm/llvm-project.git llvmorg-10.0.1-0-gef32c611aa2) Target: aarch64-unknown-freebsd12.2 Thread model: posix InstalledDir: /usr/bin
_OBJC_ALTCCVERSION_921dbbb2=none
ARCH=aarch64
OPSYS=FreeBSD
_OSRELEASE=12.2-RELEASE
OSREL=12.2
OSVERSION=1202000
PYTHONBASE=/usr/local
CONFIGURE_MAX_CMD_LEN=524288
HAVE_PORTS_ENV=1
#### Misc Poudriere ####
GID=0
UID=0
---End make.conf---
--Resource limits--
cpu time               (seconds, -t)  unlimited
file size           (512-blocks, -f)  unlimited
data seg size           (kbytes, -d)  1048576
stack size              (kbytes, -s)  1048576
core file size      (512-blocks, -c)  unlimited
max memory size         (kbytes, -m)  unlimited
locked memory           (kbytes, -l)  unlimited
max user processes              (-u)  89999
open files                      (-n)  1024
virtual mem size        (kbytes, -v)  unlimited
swap limit              (kbytes, -w)  unlimited
socket buffer size       (bytes, -b)  unlimited
pseudo-terminals                (-p)  unlimited
kqueues                         (-k)  unlimited
umtx shared locks               (-o)  unlimited
--End resource limits--
=======================<phase: check-sanity   >============================
===>  License GPLv2 accepted by the user
===========================================================================
=======================<phase: pkg-depends    >============================
===>   fcode-utils-1.0.2 depends on file: /usr/local/sbin/pkg - not found
===>   Installing existing package /packages/All/pkg-1.16.3.txz
[122arm64-quarterly-job-03] Installing pkg-1.16.3...
[122arm64-quarterly-job-03] Extracting pkg-1.16.3: .......... done
===>   fcode-utils-1.0.2 depends on file: /usr/local/sbin/pkg - found
===>   Returning to build of fcode-utils-1.0.2
===========================================================================
=======================<phase: fetch-depends  >============================
===========================================================================
=======================<phase: fetch          >============================
===>  License GPLv2 accepted by the user
===> Fetching all distfiles required by fcode-utils-1.0.2 for building
===========================================================================
=======================<phase: checksum       >============================
===>  License GPLv2 accepted by the user
===> Fetching all distfiles required by fcode-utils-1.0.2 for building
=> SHA256 Checksum OK for openbios-fcode-utils-v1.0.2_GH0.tar.gz.
===========================================================================
=======================<phase: extract-depends>============================
===========================================================================
=======================<phase: extract        >============================
===>  License GPLv2 accepted by the user
===> Fetching all distfiles required by fcode-utils-1.0.2 for building
===>  Extracting for fcode-utils-1.0.2
=> SHA256 Checksum OK for openbios-fcode-utils-v1.0.2_GH0.tar.gz.
===========================================================================
=======================<phase: patch-depends  >============================
===========================================================================
=======================<phase: patch          >============================
===>  Patching for fcode-utils-1.0.2
===>  Applying FreeBSD patches for fcode-utils-1.0.2 from /usr/ports/sysutils/fcode-utils/files
===========================================================================
=======================<phase: build-depends  >============================
===>   fcode-utils-1.0.2 depends on package: gmake>=4.3 - not found
===>   Installing existing package /packages/All/gmake-4.3_2.txz
[122arm64-quarterly-job-03] Installing gmake-4.3_2...
[122arm64-quarterly-job-03] `-- Installing gettext-runtime-0.21...
[122arm64-quarterly-job-03] |   `-- Installing indexinfo-0.3.1...
[122arm64-quarterly-job-03] |   `-- Extracting indexinfo-0.3.1: .... done
[122arm64-quarterly-job-03] `-- Extracting gettext-runtime-0.21: .......... done
[122arm64-quarterly-job-03] Extracting gmake-4.3_2: .......... done
===>   fcode-utils-1.0.2 depends on package: gmake>=4.3 - found
===>   Returning to build of fcode-utils-1.0.2
===========================================================================
=======================<phase: lib-depends    >============================
===========================================================================
=======================<phase: configure      >============================
===>  Configuring for fcode-utils-1.0.2
===========================================================================
=======================<phase: build          >============================
===>  Building for fcode-utils-1.0.2
gmake[1]: Entering directory '/wrkdirs/usr/ports/sysutils/fcode-utils/work/fcode-utils-1.0.2/detok'
cc -c -O2 -Wall -Wno-pointer-sign  -I../shared addfcodes.c -o addfcodes.o 
cc -c -O2 -Wall -Wno-pointer-sign  -I../shared decode.c -o decode.o 
cc -c -O2 -Wall -Wno-pointer-sign  -I../shared detok.c -o detok.o 
cc -c -O2 -Wall -Wno-pointer-sign  -I../shared dictionary.c -o dictionary.o 
cc -c -O2 -Wall -Wno-pointer-sign  -I../shared pcihdr.c -o pcihdr.o 
cc -c -O2 -Wall -Wno-pointer-sign  -I../shared printformats.c -o printformats.o 
cc -c -O2 -Wall -Wno-pointer-sign  -I../shared stream.c -o stream.o 
cc -c -O2 -Wall -Wno-pointer-sign  -I../shared ../shared/classcodes.c -o ../shared/classcodes.o 
cc -o detok addfcodes.o decode.o detok.o dictionary.o pcihdr.o printformats.o stream.o ../shared/classcodes.o 
strip -s detok
gmake[1]: Leaving directory '/wrkdirs/usr/ports/sysutils/fcode-utils/work/fcode-utils-1.0.2/detok'
gmake[1]: Entering directory '/wrkdirs/usr/ports/sysutils/fcode-utils/work/fcode-utils-1.0.2/romheaders'
cc -O2 -Wall -W -ansi -I../shared romheaders.c ../shared/classcodes.c -o romheaders
strip romheaders
gmake[1]: Leaving directory '/wrkdirs/usr/ports/sysutils/fcode-utils/work/fcode-utils-1.0.2/romheaders'
gmake[1]: Entering directory '/wrkdirs/usr/ports/sysutils/fcode-utils/work/fcode-utils-1.0.2/toke'
cc -c -O2 -Wall -Wno-pointer-sign -fno-strict-aliasing  -I../shared clflags.c -o clflags.o 
cc -c -O2 -Wall -Wno-pointer-sign -fno-strict-aliasing  -I../shared conditl.c -o conditl.o 
cc -c -O2 -Wall -Wno-pointer-sign -fno-strict-aliasing  -I../shared devnode.c -o devnode.o 
cc -c -O2 -Wall -Wno-pointer-sign -fno-strict-aliasing  -I../shared dictionary.c -o dictionary.o 
cc -c -O2 -Wall -Wno-pointer-sign -fno-strict-aliasing  -I../shared emit.c -o emit.o 
cc -c -O2 -Wall -Wno-pointer-sign -fno-strict-aliasing  -I../shared errhandler.c -o errhandler.o 
cc -c -O2 -Wall -Wno-pointer-sign -fno-strict-aliasing  -I../shared flowcontrol.c -o flowcontrol.o 
cc -c -O2 -Wall -Wno-pointer-sign -fno-strict-aliasing  -I../shared macros.c -o macros.o 
cc -c -O2 -Wall -Wno-pointer-sign -fno-strict-aliasing  -I../shared nextfcode.c -o nextfcode.o 
cc -c -O2 -Wall -Wno-pointer-sign -fno-strict-aliasing  -I../shared parselocals.c -o parselocals.o 
cc -c -O2 -Wall -Wno-pointer-sign -fno-strict-aliasing  -I../shared scanner.c -o scanner.o 
cc -c -O2 -Wall -Wno-pointer-sign -fno-strict-aliasing  -I../shared stack.c -o stack.o 
cc -c -O2 -Wall -Wno-pointer-sign -fno-strict-aliasing  -I../shared stream.c -o stream.o 
cc -c -O2 -Wall -Wno-pointer-sign -fno-strict-aliasing  -I../shared strsubvocab.c -o strsubvocab.o 
cc -c -O2 -Wall -Wno-pointer-sign -fno-strict-aliasing  -I../shared ticvocab.c -o ticvocab.o 
cc -c -O2 -Wall -Wno-pointer-sign -fno-strict-aliasing  -I../shared toke.c -o toke.o 
cc -c -O2 -Wall -Wno-pointer-sign -fno-strict-aliasing  -I../shared tokzesc.c -o tokzesc.o 
tokzesc.c:741:25: warning: variable 'dummy_param' is uninitialized when used here [-Wuninitialized]
   tokz_esc_next_fcode( dummy_param);
                        ^~~~~~~~~~~
tokzesc.c:740:4: note: variable 'dummy_param' is declared here
   tic_param_t dummy_param;
   ^
1 warning generated.
cc -c -O2 -Wall -Wno-pointer-sign -fno-strict-aliasing  -I../shared tracesyms.c -o tracesyms.o 
cc -c -O2 -Wall -Wno-pointer-sign -fno-strict-aliasing  -I../shared usersymbols.c -o usersymbols.o 
cc -o toke clflags.o conditl.o devnode.o dictionary.o emit.o errhandler.o flowcontrol.o macros.o nextfcode.o parselocals.o scanner.o stack.o stream.o strsubvocab.o ticvocab.o toke.o tokzesc.o tracesyms.o usersymbols.o ../shared/classcodes.o 
ld: error: stream.c:(function init_inbuf: .text+0x170): improper alignment for relocation R_AARCH64_LDST64_ABS_LO12_NC: 0x24E434 is not aligned to 8 bytes
ld: error: parselocals.c:(function declare_locals: .text+0xD4): improper alignment for relocation R_AARCH64_LDST64_ABS_LO12_NC: 0x24E434 is not aligned to 8 bytes
ld: error: scanner.c:(function skip_until: .text+0xC): improper alignment for relocation R_AARCH64_LDST64_ABS_LO12_NC: 0x24E434 is not aligned to 8 bytes
ld: error: stream.c:(function init_stream: .text+0x830): improper alignment for relocation R_AARCH64_LDST64_ABS_LO12_NC: 0x24E434 is not aligned to 8 bytes
ld: error: scanner.c:(function push_source: .text+0xB8): improper alignment for relocation R_AARCH64_LDST64_ABS_LO12_NC: 0x24E434 is not aligned to 8 bytes
ld: error: scanner.c:(function get_word: .text+0x17C): improper alignment for relocation R_AARCH64_LDST64_ABS_LO12_NC: 0x24E434 is not aligned to 8 bytes
ld: error: scanner.c:(function get_word: .text+0x1BC): improper alignment for relocation R_AARCH64_LDST64_ABS_LO12_NC: 0x24E434 is not aligned to 8 bytes
ld: error: scanner.c:(function get_word: .text+0x1EC): improper alignment for relocation R_AARCH64_LDST64_ABS_LO12_NC: 0x24E434 is not aligned to 8 bytes
ld: error: scanner.c:(function get_rest_of_line: .text+0x438): improper alignment for relocation R_AARCH64_LDST64_ABS_LO12_NC: 0x24E434 is not aligned to 8 bytes
ld: error: scanner.c:(function handle_user_message: .text+0x710): improper alignment for relocation R_AARCH64_LDST64_ABS_LO12_NC: 0x24E434 is not aligned to 8 bytes
ld: error: scanner.c:(function eval_string: .text+0x1040): improper alignment for relocation R_AARCH64_LDST64_ABS_LO12_NC: 0x24E434 is not aligned to 8 bytes
ld: error: scanner.c:(function handle_internal: .text+0x1BB8): improper alignment for relocation R_AARCH64_LDST64_ABS_LO12_NC: 0x24E434 is not aligned to 8 bytes
ld: error: scanner.c:(function handle_internal: .text+0x1CA0): improper alignment for relocation R_AARCH64_LDST64_ABS_LO12_NC: 0x24E434 is not aligned to 8 bytes
ld: error: scanner.c:(function get_string: .text+0x3624): improper alignment for relocation R_AARCH64_LDST64_ABS_LO12_NC: 0x24E434 is not aligned to 8 bytes
ld: error: scanner.c:(function get_string: .text+0x36DC): improper alignment for relocation R_AARCH64_LDST64_ABS_LO12_NC: 0x24E434 is not aligned to 8 bytes
ld: error: scanner.c:(function get_string: .text+0x37DC): improper alignment for relocation R_AARCH64_LDST64_ABS_LO12_NC: 0x24E434 is not aligned to 8 bytes
ld: error: scanner.c:(function get_string: .text+0x38F4): improper alignment for relocation R_AARCH64_LDST64_ABS_LO12_NC: 0x24E434 is not aligned to 8 bytes
ld: error: scanner.c:(function get_string: .text+0x3AEC): improper alignment for relocation R_AARCH64_LDST64_ABS_LO12_NC: 0x24E434 is not aligned to 8 bytes
ld: error: scanner.c:(function skip_string: .text+0x409C): improper alignment for relocation R_AARCH64_LDST64_ABS_LO12_NC: 0x24E434 is not aligned to 8 bytes
ld: error: scanner.c:(function process_remark: .text+0x4244): improper alignment for relocation R_AARCH64_LDST64_ABS_LO12_NC: 0x24E434 is not aligned to 8 bytes
cc: error: linker command failed with exit code 1 (use -v to see invocation)
gmake[1]: *** [Makefile:50: toke] Error 1
gmake[1]: Leaving directory '/wrkdirs/usr/ports/sysutils/fcode-utils/work/fcode-utils-1.0.2/toke'
*** Error code 2

Stop.
make: stopped in /usr/ports/sysutils/fcode-utils
Received on Sat Jun 26 2021 - 01:27:21 UTC

Original text of this message