[package - main-arm64-default][security/aws-c-cal] Failed for aws-c-cal-0.4.5 in build

From: <pkg-fallout_at_FreeBSD.org>
Date: Thu, 24 Jun 2021 05:43:23 GMT
You are receiving this mail as a port that you maintain
is failing to build on the FreeBSD package build server.
Please investigate the failure and submit a PR to fix
build.

Maintainer:     danilo_at_FreeBSD.org
Log URL:        http://ampere2.nyi.freebsd.org/data/main-arm64-default/pf9e3cb9fcd9a_s33e1287b6a/logs/aws-c-cal-0.4.5.log
Build URL:      http://ampere2.nyi.freebsd.org/build.html?mastername=main-arm64-default&build=pf9e3cb9fcd9a_s33e1287b6a
Log:

=>> Building security/aws-c-cal
build started at Thu Jun 24 05:43:11 UTC 2021
port directory: /usr/ports/security/aws-c-cal
package name: aws-c-cal-0.4.5
building for: FreeBSD main-arm64-default-job-11 14.0-CURRENT FreeBSD 14.0-CURRENT 1400024 arm64
maintained by: danilo_at_FreeBSD.org
Makefile ident: 
Poudriere version: 3.2.8-8-gaf08dbda
Host OSVERSION: 1400008
Jail OSVERSION: 1400024
Job Id: 11




!!! Jail is newer than host. (Jail: 1400024, Host: 1400008) !!!
!!! This is not supported. !!!
!!! Host kernel must be same or newer than jail. !!!
!!! Expect build failures. !!!



---Begin Environment---
SHELL=/bin/csh
OSVERSION=1400024
UNAME_v=FreeBSD 14.0-CURRENT 1400024
UNAME_r=14.0-CURRENT
BLOCKSIZE=K
MAIL=/var/mail/root
MM_CHARSET=UTF-8
LANG=C.UTF-8
STATUS=1
HOME=/root
PATH=/sbin:/bin:/usr/sbin:/usr/bin:/usr/local/sbin:/usr/local/bin:/root/bin
LOCALBASE=/usr/local
USER=root
LIBEXECPREFIX=/usr/local/libexec/poudriere
POUDRIERE_VERSION=3.2.8-8-gaf08dbda
MASTERMNT=/usr/local/poudriere/data/.m/main-arm64-default/ref
POUDRIERE_BUILD_TYPE=bulk
PACKAGE_BUILDING=yes
SAVED_TERM=
PWD=/usr/local/poudriere/data/.m/main-arm64-default/ref/.p/pool
P_PORTS_FEATURES=FLAVORS SELECTED_OPTIONS
MASTERNAME=main-arm64-default
SCRIPTPREFIX=/usr/local/share/poudriere
OLDPWD=/usr/local/poudriere/data/.m/main-arm64-default/ref/.p
SCRIPTPATH=/usr/local/share/poudriere/bulk.sh
POUDRIEREPATH=/usr/local/bin/poudriere
---End Environment---

---Begin Poudriere Port Flags/Env---
PORT_FLAGS=
PKGENV=
FLAVOR=
DEPENDS_ARGS=
MAKE_ARGS=
---End Poudriere Port Flags/Env---

---Begin OPTIONS List---
---End OPTIONS List---

--MAINTAINER--
danilo_at_FreeBSD.org
--End MAINTAINER--

--CONFIGURE_ARGS--

--End CONFIGURE_ARGS--

--CONFIGURE_ENV--
XDG_DATA_HOME=/wrkdirs/usr/ports/security/aws-c-cal/work  XDG_CONFIG_HOME=/wrkdirs/usr/ports/security/aws-c-cal/work  HOME=/wrkdirs/usr/ports/security/aws-c-cal/work TMPDIR="/tmp" PATH=/wrkdirs/usr/ports/security/aws-c-cal/work/.bin:/sbin:/bin:/usr/sbin:/usr/bin:/usr/local/sbin:/usr/local/bin:/root/bin SHELL=/bin/sh CONFIG_SHELL=/bin/sh
--End CONFIGURE_ENV--

--MAKE_ENV--
NINJA_STATUS="[%p %s/%t] " OPENSSLBASE=/usr OPENSSLDIR=/etc/ssl OPENSSLINC=/usr/include OPENSSLLIB=/usr/lib XDG_DATA_HOME=/wrkdirs/usr/ports/security/aws-c-cal/work  XDG_CONFIG_HOME=/wrkdirs/usr/ports/security/aws-c-cal/work  HOME=/wrkdirs/usr/ports/security/aws-c-cal/work TMPDIR="/tmp" PATH=/wrkdirs/usr/ports/security/aws-c-cal/work/.bin:/sbin:/bin:/usr/sbin:/usr/bin:/usr/local/sbin:/usr/local/bin:/root/bin NO_PIE=yes MK_DEBUG_FILES=no MK_KERNEL_SYMBOLS=no SHELL=/bin/sh NO_LINT=YES DESTDIR=/wrkdirs/usr/ports/security/aws-c-cal/work/stage PREFIX=/usr/local  LOCALBASE=/usr/local  CC="cc" CFLAGS="-O2 -pipe  -fstack-protector-strong -fno-strict-aliasing "  CPP="cpp" CPPFLAGS=""  LDFLAGS="  -fstack-protector-strong " LIBS=""  CXX="c++" CXXFLAGS="-O2 -pipe -fstack-protector-strong -fno-strict-aliasing  "  MANPREFIX="/usr/local" BSD_INSTALL_PROGRAM="install  -s -m 555"  BSD_INSTALL_LIB="install  -s -m 0644"  BSD_INSTALL_SCRIPT="install  -m 555"  BSD_INSTALL_DATA="install  -m 0644"  BSD_INS
 TALL_MAN="install  -m 444"
--End MAKE_ENV--

--PLIST_SUB--
CMAKE_BUILD_TYPE="release" OSREL=14.0 PREFIX=%D LOCALBASE=/usr/local  RESETPREFIX=/usr/local LIB32DIR=lib DOCSDIR="share/doc/aws-c-cal"  EXAMPLESDIR="share/examples/aws-c-cal"  DATADIR="share/aws-c-cal"  WWWDIR="www/aws-c-cal"  ETCDIR="etc/aws-c-cal"
--End PLIST_SUB--

--SUB_LIST--
PREFIX=/usr/local LOCALBASE=/usr/local  DATADIR=/usr/local/share/aws-c-cal DOCSDIR=/usr/local/share/doc/aws-c-cal EXAMPLESDIR=/usr/local/share/examples/aws-c-cal  WWWDIR=/usr/local/www/aws-c-cal ETCDIR=/usr/local/etc/aws-c-cal
--End SUB_LIST--

---Begin make.conf---
USE_PACKAGE_DEPENDS=yes
BATCH=yes
WRKDIRPREFIX=/wrkdirs
PORTSDIR=/usr/ports
PACKAGES=/packages
DISTDIR=/distfiles
PACKAGE_BUILDING=yes
PACKAGE_BUILDING_FLAVORS=yes
#### /usr/local/etc/poudriere.d/make.conf ####
# XXX: We really need this but cannot use it while 'make checksum' does not
# try the next mirror on checksum failure.  It currently retries the same
# failed mirror and then fails rather then trying another.  It *does*
# try the next if the size is mismatched though.
#MASTER_SITE_FREEBSD=yes
# Build ALLOW_MAKE_JOBS_PACKAGES with 2 jobs
MAKE_JOBS_NUMBER=2
#### /usr/ports/Mk/Scripts/ports_env.sh ####
_CCVERSION_921dbbb2=FreeBSD clang version 12.0.1 (git_at_github.com:llvm/llvm-project.git llvmorg-12.0.1-rc2-0-ge7dac564cd0e) Target: aarch64-unknown-freebsd14.0 Thread model: posix InstalledDir: /usr/bin
_ALTCCVERSION_921dbbb2=none
_CXXINTERNAL_acaad9ca=FreeBSD clang version 12.0.1 (git_at_github.com:llvm/llvm-project.git llvmorg-12.0.1-rc2-0-ge7dac564cd0e) Target: aarch64-unknown-freebsd14.0 Thread model: posix InstalledDir: /usr/bin "/usr/bin/ld" "--eh-frame-hdr" "-dynamic-linker" "/libexec/ld-elf.so.1" "--enable-new-dtags" "-o" "a.out" "/usr/lib/crt1.o" "/usr/lib/crti.o" "/usr/lib/crtbegin.o" "-L/usr/lib" "/dev/null" "-lc++" "-lm" "-lgcc" "--as-needed" "-lgcc_s" "--no-as-needed" "-lc" "-lgcc" "--as-needed" "-lgcc_s" "--no-as-needed" "/usr/lib/crtend.o" "/usr/lib/crtn.o"
CC_OUTPUT_921dbbb2_58173849=yes
CC_OUTPUT_921dbbb2_9bdba57c=yes
CC_OUTPUT_921dbbb2_6a4fe7f5=yes
CC_OUTPUT_921dbbb2_6bcac02b=yes
CC_OUTPUT_921dbbb2_67d20829=yes
CC_OUTPUT_921dbbb2_bfa62e83=yes
CC_OUTPUT_921dbbb2_f0b4d593=yes
CC_OUTPUT_921dbbb2_308abb44=yes
CC_OUTPUT_921dbbb2_f00456e5=yes
CC_OUTPUT_921dbbb2_65ad290d=yes
CC_OUTPUT_921dbbb2_f2776b26=yes
CC_OUTPUT_921dbbb2_b2657cc3=yes
CC_OUTPUT_921dbbb2_380987f7=yes
CC_OUTPUT_921dbbb2_160933ec=yes
CC_OUTPUT_921dbbb2_fb62803b=yes
_OBJC_CCVERSION_921dbbb2=FreeBSD clang version 12.0.1 (git_at_github.com:llvm/llvm-project.git llvmorg-12.0.1-rc2-0-ge7dac564cd0e) Target: aarch64-unknown-freebsd14.0 Thread model: posix InstalledDir: /usr/bin
_OBJC_ALTCCVERSION_921dbbb2=none
ARCH=aarch64
OPSYS=FreeBSD
_OSRELEASE=14.0-CURRENT
OSREL=14.0
OSVERSION=1400024
PYTHONBASE=/usr/local
CONFIGURE_MAX_CMD_LEN=524288
HAVE_PORTS_ENV=1
#### Misc Poudriere ####
GID=0
UID=0
---End make.conf---
--Resource limits--
cpu time               (seconds, -t)  unlimited
file size           (512-blocks, -f)  unlimited
data seg size           (kbytes, -d)  1048576
stack size              (kbytes, -s)  1048576
core file size      (512-blocks, -c)  unlimited
max memory size         (kbytes, -m)  unlimited
locked memory           (kbytes, -l)  unlimited
max user processes              (-u)  89999
open files                      (-n)  1024
virtual mem size        (kbytes, -v)  unlimited
swap limit              (kbytes, -w)  unlimited
socket buffer size       (bytes, -b)  unlimited
pseudo-terminals                (-p)  unlimited
kqueues                         (-k)  unlimited
umtx shared locks               (-o)  unlimited
--End resource limits--
=======================<phase: check-sanity   >============================
===>  License APACHE20 accepted by the user
===========================================================================
=======================<phase: pkg-depends    >============================
===>   aws-c-cal-0.4.5 depends on file: /usr/local/sbin/pkg - not found
===>   Installing existing package /packages/All/pkg-1.16.3.txz
[main-arm64-default-job-11] Installing pkg-1.16.3...
[main-arm64-default-job-11] Extracting pkg-1.16.3: .......... done
===>   aws-c-cal-0.4.5 depends on file: /usr/local/sbin/pkg - found
===>   Returning to build of aws-c-cal-0.4.5
===========================================================================
=======================<phase: fetch-depends  >============================
===========================================================================
=======================<phase: fetch          >============================
===>  License APACHE20 accepted by the user
===> Fetching all distfiles required by aws-c-cal-0.4.5 for building
===========================================================================
=======================<phase: checksum       >============================
===>  License APACHE20 accepted by the user
===> Fetching all distfiles required by aws-c-cal-0.4.5 for building
=> SHA256 Checksum OK for awslabs-aws-c-cal-v0.4.5_GH0.tar.gz.
===========================================================================
=======================<phase: extract-depends>============================
===========================================================================
=======================<phase: extract        >============================
===>  License APACHE20 accepted by the user
===> Fetching all distfiles required by aws-c-cal-0.4.5 for building
===>  Extracting for aws-c-cal-0.4.5
=> SHA256 Checksum OK for awslabs-aws-c-cal-v0.4.5_GH0.tar.gz.
===========================================================================
=======================<phase: patch-depends  >============================
===========================================================================
=======================<phase: patch          >============================
===>  Patching for aws-c-cal-0.4.5
===========================================================================
=======================<phase: build-depends  >============================
===>   aws-c-cal-0.4.5 depends on file: /usr/local/bin/cmake - not found
===>   Installing existing package /packages/All/cmake-3.20.3.txz
[main-arm64-default-job-11] Installing cmake-3.20.3...
[main-arm64-default-job-11] `-- Installing curl-7.77.0...
[main-arm64-default-job-11] |   `-- Installing ca_root_nss-3.63...
[main-arm64-default-job-11] |   `-- Extracting ca_root_nss-3.63: ........ done
[main-arm64-default-job-11] |   `-- Installing libnghttp2-1.43.0...
[main-arm64-default-job-11] |   `-- Extracting libnghttp2-1.43.0: .......... done
[main-arm64-default-job-11] `-- Extracting curl-7.77.0: .......... done
[main-arm64-default-job-11] `-- Installing expat-2.4.1...
[main-arm64-default-job-11] `-- Extracting expat-2.4.1: .......... done
[main-arm64-default-job-11] `-- Installing jsoncpp-1.9.4...
[main-arm64-default-job-11] `-- Extracting jsoncpp-1.9.4: .......... done
[main-arm64-default-job-11] `-- Installing libarchive-3.5.1,1...
[main-arm64-default-job-11] |   `-- Installing liblz4-1.9.3,1...
[main-arm64-default-job-11] |   `-- Extracting liblz4-1.9.3,1: .......... done
[main-arm64-default-job-11] `-- Extracting libarchive-3.5.1,1: .......... done
[main-arm64-default-job-11] `-- Installing libuv-1.41.0...
[main-arm64-default-job-11] `-- Extracting libuv-1.41.0: .......... done
[main-arm64-default-job-11] `-- Installing rhash-1.4.1...
[main-arm64-default-job-11] |   `-- Installing gettext-runtime-0.21...
[main-arm64-default-job-11] |   | `-- Installing indexinfo-0.3.1...
[main-arm64-default-job-11] |   | `-- Extracting indexinfo-0.3.1: .... done
[main-arm64-default-job-11] |   `-- Extracting gettext-runtime-0.21: .......... done
[main-arm64-default-job-11] `-- Extracting rhash-1.4.1: .......... done
[main-arm64-default-job-11] Extracting cmake-3.20.3: .......... done
=====
Message from ca_root_nss-3.63:

--
FreeBSD does not, and can not warrant that the certification authorities
whose certificates are included in this package have in any way been
audited for trustworthiness or RFC 3647 compliance.

Assessment and verification of trust is the complete responsibility of the
system administrator.


This package installs symlinks to support root certificates discovery by
default for software that uses OpenSSL.

This enables SSL Certificate Verification by client software without manual
intervention.

If you prefer to do this manually, replace the following symlinks with
either an empty file or your site-local certificate bundle.

  * /etc/ssl/cert.pem
  * /usr/local/etc/ssl/cert.pem
  * /usr/local/openssl/cert.pem
===>   aws-c-cal-0.4.5 depends on file: /usr/local/bin/cmake - found
===>   Returning to build of aws-c-cal-0.4.5
===>   aws-c-cal-0.4.5 depends on executable: ninja - not found
===>   Installing existing package /packages/All/ninja-1.10.2,2.txz
[main-arm64-default-job-11] Installing ninja-1.10.2,2...
[main-arm64-default-job-11] `-- Installing python38-3.8.10...
[main-arm64-default-job-11] |   `-- Installing libffi-3.3_1...
[main-arm64-default-job-11] |   `-- Extracting libffi-3.3_1: .......... done
[main-arm64-default-job-11] |   `-- Installing mpdecimal-2.5.1...
[main-arm64-default-job-11] |   `-- Extracting mpdecimal-2.5.1: .......... done
[main-arm64-default-job-11] |   `-- Installing readline-8.1.1...
[main-arm64-default-job-11] |   `-- Extracting readline-8.1.1: .......... done
[main-arm64-default-job-11] `-- Extracting python38-3.8.10: .......... done
[main-arm64-default-job-11] Extracting ninja-1.10.2,2: ........ done
=====
Message from python38-3.8.10:

--
Note that some standard Python modules are provided as separate ports
as they require additional dependencies. They are available as:

py38-gdbm       databases/py-gdbm_at_py38
py38-sqlite3    databases/py-sqlite3_at_py38
py38-tkinter    x11-toolkits/py-tkinter_at_py38
===>   aws-c-cal-0.4.5 depends on executable: ninja - found
===>   Returning to build of aws-c-cal-0.4.5
===========================================================================
=======================<phase: lib-depends    >============================
===>   aws-c-cal-0.4.5 depends on shared library: libaws-c-common.so - not found
===>   Installing existing package /packages/All/aws-c-common-0.4.64,1.txz
[main-arm64-default-job-11] Installing aws-c-common-0.4.64,1...
[main-arm64-default-job-11] Extracting aws-c-common-0.4.64,1: .......... done
===>   aws-c-cal-0.4.5 depends on shared library: libaws-c-common.so - found (/usr/local/lib/libaws-c-common.so)
===>   Returning to build of aws-c-cal-0.4.5
===========================================================================
=======================<phase: configure      >============================
===>  Configuring for aws-c-cal-0.4.5
===>  Performing out-of-source build
/bin/mkdir -p /wrkdirs/usr/ports/security/aws-c-cal/work/.build
-- The C compiler identification is Clang 12.0.1
-- Detecting C compiler ABI info
-- Detecting C compiler ABI info - done
-- Check for working C compiler: /usr/bin/cc - skipped
-- Detecting C compile features
-- Detecting C compile features - done
-- Found LibCrypto: /usr/lib/libcrypto.so  
-- LibCrypto Include Dir: /usr/include
-- LibCrypto Shared Lib:  /usr/lib/libcrypto.so
-- LibCrypto Static Lib:  /usr/lib/libcrypto.a
-- Looking for pthread.h
-- Looking for pthread.h - found
-- Found Threads: TRUE  
-- Performing Test HAS_MOUTLINE_ATOMICS
-- Performing Test HAS_MOUTLINE_ATOMICS - Success
-- Looking for stdint.h
-- Looking for stdint.h - found
-- Looking for stdbool.h
-- Looking for stdbool.h - found
-- Performing Test HAS_WGNU
-- Performing Test HAS_WGNU - Success
-- Performing Test NO_GNU_EXPR
-- Performing Test NO_GNU_EXPR - Success
-- Performing Test HAVE_SYSCONF
-- Performing Test HAVE_SYSCONF - Success
-- Performing Test HAS_SANITIZERS
-- Performing Test HAS_SANITIZERS - Success
-- attempting to use sanitizer list address;undefined
INFO sha256_profile will be built with shared libs, but you may need to set LD_LIBRARY_PATH=/usr/local/lib to run the application
-- attempting to use sanitizer list address;undefined
-- Configuring done
-- Generating done
CMake Warning:
  Manually-specified variables were not used by the project:

    CMAKE_COLOR_MAKEFILE
    CMAKE_CXX_FLAGS
    CMAKE_CXX_FLAGS_DEBUG
    CMAKE_CXX_FLAGS_RELEASE
    CMAKE_C_FLAGS_DEBUG
    CMAKE_MODULE_LINKER_FLAGS
    CMAKE_VERBOSE_MAKEFILE


-- Build files have been written to: /wrkdirs/usr/ports/security/aws-c-cal/work/.build
===========================================================================
=======================<phase: build          >============================
===>  Building for aws-c-cal-0.4.5
[  5% 2/20] /usr/bin/cc -DAWS_CAL_EXPORTS -DAWS_CAL_USE_IMPORT_EXPORT -DAWS_COMMON_USE_IMPORT_EXPORT -DHAVE_SYSCONF -Daws_c_cal_EXPORTS -I/wrkdirs/usr/ports/security/aws-c-cal/work/aws-c-cal-0.4.5/include -isystem /usr/local/include -O2 -pipe  -fstack-protector-strong -fno-strict-aliasing -O2 -pipe  -fstack-protector-strong -fno-strict-aliasing -fPIC -Wall -Werror -Wstrict-prototypes -fno-omit-frame-pointer -pedantic -Wno-long-long -fPIC -moutline-atomics -Wgnu -Wno-gnu-zero-variadic-macro-arguments -fvisibility=hidden -std=gnu99 -MD -MT CMakeFiles/aws-c-cal.dir/source/cal.c.o -MF CMakeFiles/aws-c-cal.dir/source/cal.c.o.d -o CMakeFiles/aws-c-cal.dir/source/cal.c.o -c /wrkdirs/usr/ports/security/aws-c-cal/work/aws-c-cal-0.4.5/source/cal.c
[ 10% 3/20] /usr/bin/cc -DAWS_CAL_EXPORTS -DAWS_CAL_USE_IMPORT_EXPORT -DAWS_COMMON_USE_IMPORT_EXPORT -DHAVE_SYSCONF -Daws_c_cal_EXPORTS -I/wrkdirs/usr/ports/security/aws-c-cal/work/aws-c-cal-0.4.5/include -isystem /usr/local/include -O2 -pipe  -fstack-protector-strong -fno-strict-aliasing -O2 -pipe  -fstack-protector-strong -fno-strict-aliasing -fPIC -Wall -Werror -Wstrict-prototypes -fno-omit-frame-pointer -pedantic -Wno-long-long -fPIC -moutline-atomics -Wgnu -Wno-gnu-zero-variadic-macro-arguments -fvisibility=hidden -std=gnu99 -MD -MT CMakeFiles/aws-c-cal.dir/source/ecc.c.o -MF CMakeFiles/aws-c-cal.dir/source/ecc.c.o.d -o CMakeFiles/aws-c-cal.dir/source/ecc.c.o -c /wrkdirs/usr/ports/security/aws-c-cal/work/aws-c-cal-0.4.5/source/ecc.c
[ 15% 4/20] /usr/bin/cc -DAWS_CAL_EXPORTS -DAWS_CAL_USE_IMPORT_EXPORT -DAWS_COMMON_USE_IMPORT_EXPORT -DHAVE_SYSCONF -Daws_c_cal_EXPORTS -I/wrkdirs/usr/ports/security/aws-c-cal/work/aws-c-cal-0.4.5/include -isystem /usr/local/include -O2 -pipe  -fstack-protector-strong -fno-strict-aliasing -O2 -pipe  -fstack-protector-strong -fno-strict-aliasing -fPIC -Wall -Werror -Wstrict-prototypes -fno-omit-frame-pointer -pedantic -Wno-long-long -fPIC -moutline-atomics -Wgnu -Wno-gnu-zero-variadic-macro-arguments -fvisibility=hidden -std=gnu99 -MD -MT CMakeFiles/aws-c-cal.dir/source/der.c.o -MF CMakeFiles/aws-c-cal.dir/source/der.c.o.d -o CMakeFiles/aws-c-cal.dir/source/der.c.o -c /wrkdirs/usr/ports/security/aws-c-cal/work/aws-c-cal-0.4.5/source/der.c
[ 20% 5/20] /usr/bin/cc -DAWS_CAL_EXPORTS -DAWS_CAL_USE_IMPORT_EXPORT -DAWS_COMMON_USE_IMPORT_EXPORT -DHAVE_SYSCONF -Daws_c_cal_EXPORTS -I/wrkdirs/usr/ports/security/aws-c-cal/work/aws-c-cal-0.4.5/include -isystem /usr/local/include -O2 -pipe  -fstack-protector-strong -fno-strict-aliasing -O2 -pipe  -fstack-protector-strong -fno-strict-aliasing -fPIC -Wall -Werror -Wstrict-prototypes -fno-omit-frame-pointer -pedantic -Wno-long-long -fPIC -moutline-atomics -Wgnu -Wno-gnu-zero-variadic-macro-arguments -fvisibility=hidden -std=gnu99 -MD -MT CMakeFiles/aws-c-cal.dir/source/hash.c.o -MF CMakeFiles/aws-c-cal.dir/source/hash.c.o.d -o CMakeFiles/aws-c-cal.dir/source/hash.c.o -c /wrkdirs/usr/ports/security/aws-c-cal/work/aws-c-cal-0.4.5/source/hash.c
[ 25% 6/20] /usr/bin/cc -DAWS_CAL_EXPORTS -DAWS_CAL_USE_IMPORT_EXPORT -DAWS_COMMON_USE_IMPORT_EXPORT -DHAVE_SYSCONF -Daws_c_cal_EXPORTS -I/wrkdirs/usr/ports/security/aws-c-cal/work/aws-c-cal-0.4.5/include -isystem /usr/local/include -O2 -pipe  -fstack-protector-strong -fno-strict-aliasing -O2 -pipe  -fstack-protector-strong -fno-strict-aliasing -fPIC -Wall -Werror -Wstrict-prototypes -fno-omit-frame-pointer -pedantic -Wno-long-long -fPIC -moutline-atomics -Wgnu -Wno-gnu-zero-variadic-macro-arguments -fvisibility=hidden -std=gnu99 -MD -MT CMakeFiles/aws-c-cal.dir/source/hmac.c.o -MF CMakeFiles/aws-c-cal.dir/source/hmac.c.o.d -o CMakeFiles/aws-c-cal.dir/source/hmac.c.o -c /wrkdirs/usr/ports/security/aws-c-cal/work/aws-c-cal-0.4.5/source/hmac.c
[ 30% 7/20] /usr/bin/cc -DAWS_CAL_EXPORTS -DAWS_CAL_USE_IMPORT_EXPORT -DAWS_COMMON_USE_IMPORT_EXPORT -DHAVE_SYSCONF -Daws_c_cal_EXPORTS -I/wrkdirs/usr/ports/security/aws-c-cal/work/aws-c-cal-0.4.5/include -isystem /usr/local/include -O2 -pipe  -fstack-protector-strong -fno-strict-aliasing -O2 -pipe  -fstack-protector-strong -fno-strict-aliasing -fPIC -Wall -Werror -Wstrict-prototypes -fno-omit-frame-pointer -pedantic -Wno-long-long -fPIC -moutline-atomics -Wgnu -Wno-gnu-zero-variadic-macro-arguments -fvisibility=hidden -std=gnu99 -MD -MT CMakeFiles/aws-c-cal.dir/source/unix/openssl_platform_init.c.o -MF CMakeFiles/aws-c-cal.dir/source/unix/openssl_platform_init.c.o.d -o CMakeFiles/aws-c-cal.dir/source/unix/openssl_platform_init.c.o -c /wrkdirs/usr/ports/security/aws-c-cal/work/aws-c-cal-0.4.5/source/unix/openssl_platform_init.c
[ 35% 8/20] /usr/bin/cc -DAWS_CAL_EXPORTS -DAWS_CAL_USE_IMPORT_EXPORT -DAWS_COMMON_USE_IMPORT_EXPORT -DHAVE_SYSCONF -Daws_c_cal_EXPORTS -I/wrkdirs/usr/ports/security/aws-c-cal/work/aws-c-cal-0.4.5/include -isystem /usr/local/include -O2 -pipe  -fstack-protector-strong -fno-strict-aliasing -O2 -pipe  -fstack-protector-strong -fno-strict-aliasing -fPIC -Wall -Werror -Wstrict-prototypes -fno-omit-frame-pointer -pedantic -Wno-long-long -fPIC -moutline-atomics -Wgnu -Wno-gnu-zero-variadic-macro-arguments -fvisibility=hidden -std=gnu99 -MD -MT CMakeFiles/aws-c-cal.dir/source/unix/opensslcrypto_ecc.c.o -MF CMakeFiles/aws-c-cal.dir/source/unix/opensslcrypto_ecc.c.o.d -o CMakeFiles/aws-c-cal.dir/source/unix/opensslcrypto_ecc.c.o -c /wrkdirs/usr/ports/security/aws-c-cal/work/aws-c-cal-0.4.5/source/unix/opensslcrypto_ecc.c
[ 40% 9/20] /usr/bin/cc -DAWS_CAL_EXPORTS -DAWS_CAL_USE_IMPORT_EXPORT -DAWS_COMMON_USE_IMPORT_EXPORT -DHAVE_SYSCONF -Daws_c_cal_EXPORTS -I/wrkdirs/usr/ports/security/aws-c-cal/work/aws-c-cal-0.4.5/include -isystem /usr/local/include -O2 -pipe  -fstack-protector-strong -fno-strict-aliasing -O2 -pipe  -fstack-protector-strong -fno-strict-aliasing -fPIC -Wall -Werror -Wstrict-prototypes -fno-omit-frame-pointer -pedantic -Wno-long-long -fPIC -moutline-atomics -Wgnu -Wno-gnu-zero-variadic-macro-arguments -fvisibility=hidden -std=gnu99 -MD -MT CMakeFiles/aws-c-cal.dir/source/unix/opensslcrypto_hash.c.o -MF CMakeFiles/aws-c-cal.dir/source/unix/opensslcrypto_hash.c.o.d -o CMakeFiles/aws-c-cal.dir/source/unix/opensslcrypto_hash.c.o -c /wrkdirs/usr/ports/security/aws-c-cal/work/aws-c-cal-0.4.5/source/unix/opensslcrypto_hash.c
[ 45% 10/20] /usr/bin/cc -DAWS_CAL_USE_IMPORT_EXPORT -DAWS_COMMON_USE_IMPORT_EXPORT -DHAVE_SYSCONF -I/wrkdirs/usr/ports/security/aws-c-cal/work/aws-c-cal-0.4.5/bin/sha256_profile/include -I/wrkdirs/usr/ports/security/aws-c-cal/work/aws-c-cal-0.4.5/include -isystem /usr/local/include -O2 -pipe  -fstack-protector-strong -fno-strict-aliasing -O2 -pipe  -fstack-protector-strong -fno-strict-aliasing -Wall -Werror -Wstrict-prototypes -fno-omit-frame-pointer -Wextra -pedantic -Wno-long-long -fPIC -moutline-atomics -Wgnu -Wno-gnu-zero-variadic-macro-arguments -fvisibility=hidden -std=gnu99 -MD -MT bin/sha256_profile/CMakeFiles/sha256_profile.dir/main.c.o -MF bin/sha256_profile/CMakeFiles/sha256_profile.dir/main.c.o.d -o bin/sha256_profile/CMakeFiles/sha256_profile.dir/main.c.o -c /wrkdirs/usr/ports/security/aws-c-cal/work/aws-c-cal-0.4.5/bin/sha256_profile/main.c
[ 50% 11/20] /usr/bin/cc -DAWS_CAL_EXPORTS -DAWS_CAL_USE_IMPORT_EXPORT -DAWS_COMMON_USE_IMPORT_EXPORT -DHAVE_SYSCONF -Daws_c_cal_EXPORTS -I/wrkdirs/usr/ports/security/aws-c-cal/work/aws-c-cal-0.4.5/include -isystem /usr/local/include -O2 -pipe  -fstack-protector-strong -fno-strict-aliasing -O2 -pipe  -fstack-protector-strong -fno-strict-aliasing -fPIC -Wall -Werror -Wstrict-prototypes -fno-omit-frame-pointer -pedantic -Wno-long-long -fPIC -moutline-atomics -Wgnu -Wno-gnu-zero-variadic-macro-arguments -fvisibility=hidden -std=gnu99 -MD -MT CMakeFiles/aws-c-cal.dir/source/unix/opensslcrypto_hmac.c.o -MF CMakeFiles/aws-c-cal.dir/source/unix/opensslcrypto_hmac.c.o.d -o CMakeFiles/aws-c-cal.dir/source/unix/opensslcrypto_hmac.c.o -c /wrkdirs/usr/ports/security/aws-c-cal/work/aws-c-cal-0.4.5/source/unix/opensslcrypto_hmac.c
[ 55% 12/20] : && /usr/bin/cc -fPIC -O2 -pipe  -fstack-protector-strong -fno-strict-aliasing -O2 -pipe  -fstack-protector-strong -fno-strict-aliasing  -fstack-protector-strong -shared -Wl,-soname,libaws-c-cal.so.1.0.0 -o libaws-c-cal.so.1.0.0 CMakeFiles/aws-c-cal.dir/source/cal.c.o CMakeFiles/aws-c-cal.dir/source/der.c.o CMakeFiles/aws-c-cal.dir/source/ecc.c.o CMakeFiles/aws-c-cal.dir/source/hash.c.o CMakeFiles/aws-c-cal.dir/source/hmac.c.o CMakeFiles/aws-c-cal.dir/source/unix/openssl_platform_init.c.o CMakeFiles/aws-c-cal.dir/source/unix/opensslcrypto_ecc.c.o CMakeFiles/aws-c-cal.dir/source/unix/opensslcrypto_hash.c.o CMakeFiles/aws-c-cal.dir/source/unix/opensslcrypto_hmac.c.o  -Wl,-rpath,/usr/local/lib:  /usr/local/lib/libaws-c-common.so.1.0.0  /usr/lib/libcrypto.so  -ldl  -lm  -lthr  -lexecinfo && :
[ 60% 13/20] /usr/bin/cc -DAWS_CAL_USE_IMPORT_EXPORT -DAWS_COMMON_USE_IMPORT_EXPORT -DAWS_UNSTABLE_TESTING_API=1 -DHAVE_SYSCONF -I/wrkdirs/usr/ports/security/aws-c-cal/work/aws-c-cal-0.4.5/tests -I/wrkdirs/usr/ports/security/aws-c-cal/work/aws-c-cal-0.4.5/include -isystem /usr/local/include -O2 -pipe  -fstack-protector-strong -fno-strict-aliasing -O2 -pipe  -fstack-protector-strong -fno-strict-aliasing -Wall -Werror -Wstrict-prototypes -fno-omit-frame-pointer -Wno-long-long -fPIC -moutline-atomics -Wgnu -Wno-gnu-zero-variadic-macro-arguments -fvisibility=hidden -std=gnu99 -MD -MT tests/CMakeFiles/aws-c-cal-tests.dir/test_runner.c.o -MF tests/CMakeFiles/aws-c-cal-tests.dir/test_runner.c.o.d -o tests/CMakeFiles/aws-c-cal-tests.dir/test_runner.c.o -c tests/test_runner.c
[ 65% 14/20] /usr/local/bin/cmake -E cmake_symlink_library libaws-c-cal.so.1.0.0 libaws-c-cal.so.1.0.0 libaws-c-cal.so && :
[ 70% 15/20] : && /usr/bin/cc -O2 -pipe  -fstack-protector-strong -fno-strict-aliasing -O2 -pipe  -fstack-protector-strong -fno-strict-aliasing -fstack-protector-strong bin/sha256_profile/CMakeFiles/sha256_profile.dir/main.c.o -o bin/sha256_profile/sha256_profile  -Wl,-rpath,/wrkdirs/usr/ports/security/aws-c-cal/work/.build:/usr/local/lib:  libaws-c-cal.so.1.0.0  /usr/local/lib/libaws-c-common.so.1.0.0  -lm  -lthr  -lexecinfo  /usr/lib/libcrypto.so  -ldl && :
FAILED: bin/sha256_profile/sha256_profile 
: && /usr/bin/cc -O2 -pipe  -fstack-protector-strong -fno-strict-aliasing -O2 -pipe  -fstack-protector-strong -fno-strict-aliasing -fstack-protector-strong bin/sha256_profile/CMakeFiles/sha256_profile.dir/main.c.o -o bin/sha256_profile/sha256_profile  -Wl,-rpath,/wrkdirs/usr/ports/security/aws-c-cal/work/.build:/usr/local/lib:  libaws-c-cal.so.1.0.0  /usr/local/lib/libaws-c-common.so.1.0.0  -lm  -lthr  -lexecinfo  /usr/lib/libcrypto.so  -ldl && :
ld: error: libaws-c-cal.so.1.0.0: undefined reference to __aarch64_ldadd8_acq_rel [--no-allow-shlib-undefined]
cc: error: linker command failed with exit code 1 (use -v to see invocation)
[ 75% 15/20] /usr/bin/cc -DAWS_CAL_USE_IMPORT_EXPORT -DAWS_COMMON_USE_IMPORT_EXPORT -DAWS_UNSTABLE_TESTING_API=1 -DHAVE_SYSCONF -I/wrkdirs/usr/ports/security/aws-c-cal/work/aws-c-cal-0.4.5/tests -I/wrkdirs/usr/ports/security/aws-c-cal/work/aws-c-cal-0.4.5/include -isystem /usr/local/include -O2 -pipe  -fstack-protector-strong -fno-strict-aliasing -O2 -pipe  -fstack-protector-strong -fno-strict-aliasing -Wall -Werror -Wstrict-prototypes -fno-omit-frame-pointer -Wno-long-long -fPIC -moutline-atomics -Wgnu -Wno-gnu-zero-variadic-macro-arguments -fvisibility=hidden -std=gnu99 -MD -MT tests/CMakeFiles/aws-c-cal-tests.dir/der_test.c.o -MF tests/CMakeFiles/aws-c-cal-tests.dir/der_test.c.o.d -o tests/CMakeFiles/aws-c-cal-tests.dir/der_test.c.o -c /wrkdirs/usr/ports/security/aws-c-cal/work/aws-c-cal-0.4.5/tests/der_test.c
ninja: build stopped: subcommand failed.
===> Compilation failed unexpectedly.
Try to set MAKE_JOBS_UNSAFE=yes and rebuild before reporting the failure to
the maintainer.
*** Error code 1

Stop.
make: stopped in /usr/ports/security/aws-c-cal
Received on Thu Jun 24 2021 - 05:43:23 UTC

Original text of this message