[package - 122powerpc64-quarterly][devel/opendht] Failed for opendht-1.10.1_3 in build

From: <pkg-fallout_at_FreeBSD.org>
Date: Thu, 24 Jun 2021 02:59:39 GMT
You are receiving this mail as a port that you maintain
is failing to build on the FreeBSD package build server.
Please investigate the failure and submit a PR to fix
build.

Maintainer:     yuri_at_FreeBSD.org
Log URL:        http://foul1.nyi.freebsd.org/data/122powerpc64-quarterly/3e55273e25e2/logs/opendht-1.10.1_3.log
Build URL:      http://foul1.nyi.freebsd.org/build.html?mastername=122powerpc64-quarterly&build=3e55273e25e2
Log:

=>> Building devel/opendht
build started at Thu Jun 24 02:57:09 UTC 2021
port directory: /usr/ports/devel/opendht
package name: opendht-1.10.1_3
building for: FreeBSD 122powerpc64-quarterly-job-07 12.2-RELEASE FreeBSD 12.2-RELEASE powerpc
maintained by: yuri_at_FreeBSD.org
Makefile ident: 
Poudriere version: 3.2.8-8-gaf08dbda
Host OSVERSION: 1400008
Jail OSVERSION: 1202000
Job Id: 07

---Begin Environment---
SHELL=/bin/csh
OSVERSION=1202000
UNAME_v=FreeBSD 12.2-RELEASE
UNAME_r=12.2-RELEASE
BLOCKSIZE=K
MAIL=/var/mail/root
STATUS=1
HOME=/root
PATH=/sbin:/bin:/usr/sbin:/usr/bin:/usr/local/sbin:/usr/local/bin:/root/bin
LOCALBASE=/usr/local
USER=root
LIBEXECPREFIX=/usr/local/libexec/poudriere
POUDRIERE_VERSION=3.2.8-8-gaf08dbda
MASTERMNT=/usr/local/poudriere/data/.m/122powerpc64-quarterly/ref
POUDRIERE_BUILD_TYPE=bulk
PACKAGE_BUILDING=yes
SAVED_TERM=
PWD=/usr/local/poudriere/data/.m/122powerpc64-quarterly/ref/.p/pool
P_PORTS_FEATURES=FLAVORS SELECTED_OPTIONS
MASTERNAME=122powerpc64-quarterly
SCRIPTPREFIX=/usr/local/share/poudriere
OLDPWD=/usr/local/poudriere/data/.m/122powerpc64-quarterly/ref/.p
SCRIPTPATH=/usr/local/share/poudriere/bulk.sh
POUDRIEREPATH=/usr/local/bin/poudriere
---End Environment---

---Begin Poudriere Port Flags/Env---
PORT_FLAGS=
PKGENV=
FLAVOR=
DEPENDS_ARGS=
MAKE_ARGS=
---End Poudriere Port Flags/Env---

---Begin OPTIONS List---
===> The following configuration options are available for opendht-1.10.1_3:
     DOCS=on: Build and/or install documentation
     PROXY_CLIENT=off: Enable DHT proxy client
     PROXY_SERVER=off: Enable DHT proxy server
     PUSH_NOTIFICATIONS=off: Enable push notifications support
===> Use 'make config' to modify these settings
---End OPTIONS List---

--MAINTAINER--
yuri_at_FreeBSD.org
--End MAINTAINER--

--CONFIGURE_ARGS--

--End CONFIGURE_ARGS--

--CONFIGURE_ENV--
PKG_CONFIG=pkgconf XDG_DATA_HOME=/wrkdirs/usr/ports/devel/opendht/work  XDG_CONFIG_HOME=/wrkdirs/usr/ports/devel/opendht/work  HOME=/wrkdirs/usr/ports/devel/opendht/work TMPDIR="/tmp" PATH=/wrkdirs/usr/ports/devel/opendht/work/.bin:/sbin:/bin:/usr/sbin:/usr/bin:/usr/local/sbin:/usr/local/bin:/root/bin SHELL=/bin/sh CONFIG_SHELL=/bin/sh
--End CONFIGURE_ENV--

--MAKE_ENV--
XDG_DATA_HOME=/wrkdirs/usr/ports/devel/opendht/work  XDG_CONFIG_HOME=/wrkdirs/usr/ports/devel/opendht/work  HOME=/wrkdirs/usr/ports/devel/opendht/work TMPDIR="/tmp" PATH=/wrkdirs/usr/ports/devel/opendht/work/.bin:/sbin:/bin:/usr/sbin:/usr/bin:/usr/local/sbin:/usr/local/bin:/root/bin NO_PIE=yes MK_DEBUG_FILES=no MK_KERNEL_SYMBOLS=no SHELL=/bin/sh NO_LINT=YES ADDR2LINE="/usr/local/bin/addr2line" AR="/usr/local/bin/ar" AS="/usr/local/bin/as" CPPFILT="/usr/local/bin/c++filt" GPROF="/usr/local/bin/gprof" LD="/usr/local/bin/ld" NM="/usr/local/bin/nm" OBJCOPY="/usr/local/bin/objcopy" OBJDUMP="/usr/local/bin/objdump" RANLIB="/usr/local/bin/ranlib" READELF="/usr/local/bin/readelf" SIZE="/usr/local/bin/size" STRINGS="/usr/local/bin/strings" DESTDIR=/wrkdirs/usr/ports/devel/opendht/work/stage PREFIX=/usr/local  LOCALBASE=/usr/local  CC="gcc10" CFLAGS="-O2 -pipe  -fstack-protector-strong -Wl,-rpath=/usr/local/lib/gcc10 -fno-strict-aliasing "  CPP="cpp10" CPPFLAGS="-I/usr/local/include"  LDFLAGS=
 " -L/usr/local/lib -fstack-protector-strong -Wl,-rpath=/usr/local/lib/gcc10 -L/usr/local/lib/gcc10 " LIBS=""  CXX="g++10" CXXFLAGS="-O2 -pipe  -fstack-protector-strong -Wl,-rpath=/usr/local/lib/gcc10  -Wl,-rpath=/usr/local/lib/gcc10 "  MANPREFIX="/usr/local" BSD_INSTALL_PROGRAM="install  -s -m 555"  BSD_INSTALL_LIB="install  -s -m 0644"  BSD_INSTALL_SCRIPT="install  -m 555"  BSD_INSTALL_DATA="install  -m 0644"  BSD_INSTALL_MAN="install  -m 444"
--End MAKE_ENV--

--PLIST_SUB--
SHL3=1.10.1 SHL1=1 PORTDOCS="" CMAKE_BUILD_TYPE="release" OSREL=12.2 PREFIX=%D LOCALBASE=/usr/local  RESETPREFIX=/usr/local LIB32DIR=lib DOCSDIR="share/doc/opendht"  EXAMPLESDIR="share/examples/opendht"  DATADIR="share/opendht"  WWWDIR="www/opendht"  ETCDIR="etc/opendht"
--End PLIST_SUB--

--SUB_LIST--
PREFIX=/usr/local LOCALBASE=/usr/local  DATADIR=/usr/local/share/opendht DOCSDIR=/usr/local/share/doc/opendht EXAMPLESDIR=/usr/local/share/examples/opendht  WWWDIR=/usr/local/www/opendht ETCDIR=/usr/local/etc/opendht
--End SUB_LIST--

---Begin make.conf---
USE_PACKAGE_DEPENDS=yes
BATCH=yes
WRKDIRPREFIX=/wrkdirs
PORTSDIR=/usr/ports
PACKAGES=/packages
DISTDIR=/distfiles
PACKAGE_BUILDING=yes
PACKAGE_BUILDING_FLAVORS=yes
#### /usr/local/etc/poudriere.d/make.conf ####
# XXX: We really need this but cannot use it while 'make checksum' does not
# try the next mirror on checksum failure.  It currently retries the same
# failed mirror and then fails rather then trying another.  It *does*
# try the next if the size is mismatched though.
#MASTER_SITE_FREEBSD=yes
# Build ALLOW_MAKE_JOBS_PACKAGES with 2 jobs
MAKE_JOBS_NUMBER=2
#### /usr/ports/Mk/Scripts/ports_env.sh ####
_CCVERSION_921dbbb2=cc (GCC) 4.2.1 20070831 patched [FreeBSD] Copyright (C) 2007 Free Software Foundation, Inc. This is free software; see the source for copying conditions. There is NO warranty; not even for MERCHANTABILITY or FITNESS FOR A PARTICULAR PURPOSE.
_ALTCCVERSION_921dbbb2=none
_CXXINTERNAL_acaad9ca=Using built-in specs. Target: powerpc64-undermydesk-freebsd Configured with: FreeBSD/powerpc64 system compiler Thread model: posix gcc version 4.2.1 20070831 patched [FreeBSD] "/usr/bin/ld" "--eh-frame-hdr" "-Qy" "-melf64ppc_fbsd" "--enable-new-dtags" "-dynamic-linker" "/libexec/ld-elf.so.1" "/usr/lib/crt1.o" "/usr/lib/crti.o" "/usr/lib/crtbegin.o" "-L/usr/lib" "-L/usr/lib" "/dev/null" "-lstdc++" "-lm" "-lgcc_s" "-lgcc" "-lc" "-lgcc_s" "-lgcc" "/usr/lib/crtsavres.o" "/usr/lib/crtend.o" "/usr/lib/crtn.o"
CC_OUTPUT_921dbbb2_58173849=yes
CC_OUTPUT_921dbbb2_9bdba57c=yes
CC_OUTPUT_921dbbb2_6a4fe7f5=cc1: error: unrecognized command line option "-std=c11"
CC_OUTPUT_921dbbb2_6bcac02b=yes
CC_OUTPUT_921dbbb2_67d20829=yes
CC_OUTPUT_921dbbb2_bfa62e83=cc1: error: unrecognized command line option "-std=gnu11"
CC_OUTPUT_921dbbb2_f0b4d593=yes
CC_OUTPUT_921dbbb2_308abb44=cc1plus: error: unrecognized command line option "-std=c++0x"
CC_OUTPUT_921dbbb2_f00456e5=cc1plus: error: unrecognized command line option "-std=c++11"
CC_OUTPUT_921dbbb2_65ad290d=cc1plus: error: unrecognized command line option "-std=c++14"
CC_OUTPUT_921dbbb2_f2776b26=cc1plus: error: unrecognized command line option "-std=c++17"
CC_OUTPUT_921dbbb2_b2657cc3=yes
CC_OUTPUT_921dbbb2_380987f7=cc1plus: error: unrecognized command line option "-std=gnu++11"
CC_OUTPUT_921dbbb2_160933ec=cc1plus: error: unrecognized command line option "-std=gnu++14"
CC_OUTPUT_921dbbb2_fb62803b=cc1plus: error: unrecognized command line option "-std=gnu++17"
_OBJC_CCVERSION_921dbbb2=cc (GCC) 4.2.1 20070831 patched [FreeBSD] Copyright (C) 2007 Free Software Foundation, Inc. This is free software; see the source for copying conditions. There is NO warranty; not even for MERCHANTABILITY or FITNESS FOR A PARTICULAR PURPOSE.
_OBJC_ALTCCVERSION_921dbbb2=none
ARCH=powerpc64
PPC_ABI=ELFv1
OPSYS=FreeBSD
_OSRELEASE=12.2-RELEASE
OSREL=12.2
OSVERSION=1202000
PYTHONBASE=/usr/local
CONFIGURE_MAX_CMD_LEN=524288
HAVE_PORTS_ENV=1
#### Misc Poudriere ####
GID=0
UID=0
---End make.conf---
--Resource limits--
cpu time               (seconds, -t)  unlimited
file size           (512-blocks, -f)  unlimited
data seg size           (kbytes, -d)  33554432
stack size              (kbytes, -s)  524288
core file size      (512-blocks, -c)  unlimited
max memory size         (kbytes, -m)  unlimited
locked memory           (kbytes, -l)  unlimited
max user processes              (-u)  89999
open files                      (-n)  1024
virtual mem size        (kbytes, -v)  unlimited
swap limit              (kbytes, -w)  unlimited
socket buffer size       (bytes, -b)  unlimited
pseudo-terminals                (-p)  unlimited
kqueues                         (-k)  unlimited
umtx shared locks               (-o)  unlimited
--End resource limits--
=======================<phase: check-sanity   >============================
===>  License GPLv3 accepted by the user
===========================================================================
=======================<phase: pkg-depends    >============================
===>   opendht-1.10.1_3 depends on file: /usr/local/sbin/pkg - not found
===>   Installing existing package /packages/All/pkg-1.16.3.txz
[122powerpc64-quarterly-job-07] Installing pkg-1.16.3...
[122powerpc64-quarterly-job-07] Extracting pkg-1.16.3: .......... done
===>   opendht-1.10.1_3 depends on file: /usr/local/sbin/pkg - found
===>   Returning to build of opendht-1.10.1_3
===========================================================================
=======================<phase: fetch-depends  >============================
===========================================================================
=======================<phase: fetch          >============================
===>  License GPLv3 accepted by the user
===> Fetching all distfiles required by opendht-1.10.1_3 for building
===========================================================================
=======================<phase: checksum       >============================
===>  License GPLv3 accepted by the user
===> Fetching all distfiles required by opendht-1.10.1_3 for building
=> SHA256 Checksum OK for savoirfairelinux-opendht-1.10.1_GH0.tar.gz.
===========================================================================
=======================<phase: extract-depends>============================
===========================================================================
=======================<phase: extract        >============================
===>  License GPLv3 accepted by the user
===> Fetching all distfiles required by opendht-1.10.1_3 for building
===>  Extracting for opendht-1.10.1_3
=> SHA256 Checksum OK for savoirfairelinux-opendht-1.10.1_GH0.tar.gz.
===========================================================================
=======================<phase: patch-depends  >============================
===========================================================================
=======================<phase: patch          >============================
===>  Patching for opendht-1.10.1_3
===>  Applying FreeBSD patches for opendht-1.10.1_3 from /usr/ports/devel/opendht/files
===========================================================================
=======================<phase: build-depends  >============================
===>   opendht-1.10.1_3 depends on file: /usr/local/bin/cmake - not found
===>   Installing existing package /packages/All/cmake-3.19.6.txz
[122powerpc64-quarterly-job-07] Installing cmake-3.19.6...
[122powerpc64-quarterly-job-07] `-- Installing curl-7.76.0...
[122powerpc64-quarterly-job-07] |   `-- Installing ca_root_nss-3.63...
[122powerpc64-quarterly-job-07] |   `-- Extracting ca_root_nss-3.63: ........ done
[122powerpc64-quarterly-job-07] |   `-- Installing libnghttp2-1.43.0...
[122powerpc64-quarterly-job-07] |   | `-- Installing gcc10-10.2.0_1...
[122powerpc64-quarterly-job-07] |   |   `-- Installing binutils-2.33.1_4,1...
[122powerpc64-quarterly-job-07] |   |   | `-- Installing gettext-runtime-0.21...
[122powerpc64-quarterly-job-07] |   |   |   `-- Installing indexinfo-0.3.1...
[122powerpc64-quarterly-job-07] |   |   |   `-- Extracting indexinfo-0.3.1: .... done
[122powerpc64-quarterly-job-07] |   |   | `-- Extracting gettext-runtime-0.21: .......... done
[122powerpc64-quarterly-job-07] |   |   `-- Extracting binutils-2.33.1_4,1: .......... done
<snip>
===>   Returning to build of opendht-1.10.1_3
===>   opendht-1.10.1_3 depends on shared library: libreadline.so.8 - found (/usr/local/lib/libreadline.so.8)
===========================================================================
=======================<phase: configure      >============================
===>  Configuring for opendht-1.10.1_3
===>  Performing out-of-source build
/bin/mkdir -p /wrkdirs/usr/ports/devel/opendht/work/.build
-- The C compiler identification is GNU 10.2.0
-- The CXX compiler identification is GNU 10.2.0
-- Detecting C compiler ABI info
-- Detecting C compiler ABI info - done
-- Check for working C compiler: /usr/local/bin/gcc10 - skipped
-- Detecting C compile features
-- Detecting C compile features - done
-- Detecting CXX compiler ABI info
-- Detecting CXX compiler ABI info - done
-- Check for working CXX compiler: /usr/local/bin/g++10 - skipped
-- Detecting CXX compile features
-- Detecting CXX compile features - done
-- Could NOT find Doxygen (missing: DOXYGEN_EXECUTABLE) 
-- Looking for pthread.h
-- Looking for pthread.h - found
-- Found Threads: TRUE  
-- Found PkgConfig: pkgconf (found version "1.7.4") 
-- Found GnuTLS: /usr/local/lib/libgnutls.so (found suitable version "3.6.15", minimum required is "3.3") 
-- Checking for one of the modules 'nettle'
-- Found Msgpack: /usr/local/lib/libmsgpackc.so (found suitable version "3.3.0", minimum required is "1.2") 
-- Found Readline: /usr/local/lib/libreadline.so (Required is at least version "6") 
-- Checking for one of the modules 'libargon2'
Argon2 found 
-- Checking for one of the modules 'jsoncpp'
-- Configuring done
-- Generating done
CMake Warning:
  Manually-specified variables were not used by the project:

    CMAKE_COLOR_MAKEFILE
    CMAKE_CXX_FLAGS_DEBUG
    CMAKE_C_FLAGS_DEBUG
    CMAKE_C_FLAGS_RELEASE
    CMAKE_MODULE_LINKER_FLAGS
    CMAKE_VERBOSE_MAKEFILE
    OPENDHT_PUSH_NOTIFICATIONS


-- Build files have been written to: /wrkdirs/usr/ports/devel/opendht/work/.build
===========================================================================
=======================<phase: build          >============================
===>  Building for opendht-1.10.1_3
[1/27] /usr/local/bin/g++10 -DOPENDHT_BUILD -DOPENDHT_JSONCPP -DOPENDHT_LOG=true -DPACKAGE_VERSION=\"1.10.1\" -Dopendht_EXPORTS -I/wrkdirs/usr/ports/devel/opendht/work/opendht-1.10.1/. -I/wrkdirs/usr/ports/devel/opendht/work/opendht-1.10.1/include -I/wrkdirs/usr/ports/devel/opendht/work/opendht-1.10.1/include/opendht -Iinclude -O2 -pipe  -fstack-protector-strong -Wl,-rpath=/usr/local/lib/gcc10  -Wl,-rpath=/usr/local/lib/gcc10 -Wno-return-type -Wall -Wextra -Wnon-virtual-dtor -pedantic-errors -fvisibility=hidden -DMSGPACK_DISABLE_LEGACY_NIL -DMSGPACK_DISABLE_LEGACY_CONVERT -O2 -pipe  -fstack-protector-strong -Wl,-rpath=/usr/local/lib/gcc10  -Wl,-rpath=/usr/local/lib/gcc10 -fPIC -std=gnu++11 -MD -MT CMakeFiles/opendht.dir/src/base64.cpp.o -MF CMakeFiles/opendht.dir/src/base64.cpp.o.d -o CMakeFiles/opendht.dir/src/base64.cpp.o -c /wrkdirs/usr/ports/devel/opendht/work/opendht-1.10.1/src/base64.cpp
[2/27] /usr/local/bin/g++10 -DOPENDHT_BUILD -DOPENDHT_JSONCPP -DOPENDHT_LOG=true -DPACKAGE_VERSION=\"1.10.1\" -Dopendht_EXPORTS -I/wrkdirs/usr/ports/devel/opendht/work/opendht-1.10.1/. -I/wrkdirs/usr/ports/devel/opendht/work/opendht-1.10.1/include -I/wrkdirs/usr/ports/devel/opendht/work/opendht-1.10.1/include/opendht -Iinclude -O2 -pipe  -fstack-protector-strong -Wl,-rpath=/usr/local/lib/gcc10  -Wl,-rpath=/usr/local/lib/gcc10 -Wno-return-type -Wall -Wextra -Wnon-virtual-dtor -pedantic-errors -fvisibility=hidden -DMSGPACK_DISABLE_LEGACY_NIL -DMSGPACK_DISABLE_LEGACY_CONVERT -O2 -pipe  -fstack-protector-strong -Wl,-rpath=/usr/local/lib/gcc10  -Wl,-rpath=/usr/local/lib/gcc10 -fPIC -std=gnu++11 -MD -MT CMakeFiles/opendht.dir/src/infohash.cpp.o -MF CMakeFiles/opendht.dir/src/infohash.cpp.o.d -o CMakeFiles/opendht.dir/src/infohash.cpp.o -c /wrkdirs/usr/ports/devel/opendht/work/opendht-1.10.1/src/infohash.cpp
[3/27] /usr/local/bin/g++10 -DOPENDHT_BUILD -DOPENDHT_JSONCPP -DOPENDHT_LOG=true -DPACKAGE_VERSION=\"1.10.1\" -Dopendht_EXPORTS -I/wrkdirs/usr/ports/devel/opendht/work/opendht-1.10.1/. -I/wrkdirs/usr/ports/devel/opendht/work/opendht-1.10.1/include -I/wrkdirs/usr/ports/devel/opendht/work/opendht-1.10.1/include/opendht -Iinclude -O2 -pipe  -fstack-protector-strong -Wl,-rpath=/usr/local/lib/gcc10  -Wl,-rpath=/usr/local/lib/gcc10 -Wno-return-type -Wall -Wextra -Wnon-virtual-dtor -pedantic-errors -fvisibility=hidden -DMSGPACK_DISABLE_LEGACY_NIL -DMSGPACK_DISABLE_LEGACY_CONVERT -O2 -pipe  -fstack-protector-strong -Wl,-rpath=/usr/local/lib/gcc10  -Wl,-rpath=/usr/local/lib/gcc10 -fPIC -std=gnu++11 -MD -MT CMakeFiles/opendht.dir/src/utils.cpp.o -MF CMakeFiles/opendht.dir/src/utils.cpp.o.d -o CMakeFiles/opendht.dir/src/utils.cpp.o -c /wrkdirs/usr/ports/devel/opendht/work/opendht-1.10.1/src/utils.cpp
[4/27] /usr/local/bin/g++10 -DOPENDHT_BUILD -DOPENDHT_JSONCPP -DOPENDHT_LOG=true -DPACKAGE_VERSION=\"1.10.1\" -Dopendht_EXPORTS -I/wrkdirs/usr/ports/devel/opendht/work/opendht-1.10.1/. -I/wrkdirs/usr/ports/devel/opendht/work/opendht-1.10.1/include -I/wrkdirs/usr/ports/devel/opendht/work/opendht-1.10.1/include/opendht -Iinclude -O2 -pipe  -fstack-protector-strong -Wl,-rpath=/usr/local/lib/gcc10  -Wl,-rpath=/usr/local/lib/gcc10 -Wno-return-type -Wall -Wextra -Wnon-virtual-dtor -pedantic-errors -fvisibility=hidden -DMSGPACK_DISABLE_LEGACY_NIL -DMSGPACK_DISABLE_LEGACY_CONVERT -O2 -pipe  -fstack-protector-strong -Wl,-rpath=/usr/local/lib/gcc10  -Wl,-rpath=/usr/local/lib/gcc10 -fPIC -std=gnu++11 -MD -MT CMakeFiles/opendht.dir/src/crypto.cpp.o -MF CMakeFiles/opendht.dir/src/crypto.cpp.o.d -o CMakeFiles/opendht.dir/src/crypto.cpp.o -c /wrkdirs/usr/ports/devel/opendht/work/opendht-1.10.1/src/crypto.cpp
/wrkdirs/usr/ports/devel/opendht/work/opendht-1.10.1/src/crypto.cpp: In function 'dht::Blob dht::crypto::aesEncrypt(const Blob&, const Blob&)':
/wrkdirs/usr/ports/devel/opendht/work/opendht-1.10.1/src/crypto.cpp:106:49: warning: 'void nettle_gcm_aes_set_key(gcm_aes_ctx*, size_t, const uint8_t*)' is deprecated [-Wdeprecated-declarations]
  106 |     gcm_aes_set_key(&aes, key.size(), key.data());
      |                                                 ^
In file included from /wrkdirs/usr/ports/devel/opendht/work/opendht-1.10.1/src/crypto.cpp:26:
/usr/local/include/nettle/gcm.h:268:1: note: declared here
  268 | gcm_aes_set_key(struct gcm_aes_ctx *ctx,
      | ^~~~~~~~~~~~~~~
/wrkdirs/usr/ports/devel/opendht/work/opendht-1.10.1/src/crypto.cpp:107:49: warning: 'void nettle_gcm_aes_set_iv(gcm_aes_ctx*, size_t, const uint8_t*)' is deprecated [-Wdeprecated-declarations]
  107 |     gcm_aes_set_iv(&aes, GCM_IV_SIZE, ret.data());
      |                                                 ^
In file included from /wrkdirs/usr/ports/devel/opendht/work/opendht-1.10.1/src/crypto.cpp:26:
/usr/local/include/nettle/gcm.h:272:1: note: declared here
  272 | gcm_aes_set_iv(struct gcm_aes_ctx *ctx,
      | ^~~~~~~~~~~~~~
/wrkdirs/usr/ports/devel/opendht/work/opendht-1.10.1/src/crypto.cpp:108:50: warning: 'void nettle_gcm_aes_update(gcm_aes_ctx*, size_t, const uint8_t*)' is deprecated [-Wdeprecated-declarations]
  108 |     gcm_aes_update(&aes, data.size(), data.data());
      |                                                  ^
In file included from /wrkdirs/usr/ports/devel/opendht/work/opendht-1.10.1/src/crypto.cpp:26:
/usr/local/include/nettle/gcm.h:276:1: note: declared here
  276 | gcm_aes_update(struct gcm_aes_ctx *ctx,
      | ^~~~~~~~~~~~~~
/wrkdirs/usr/ports/devel/opendht/work/opendht-1.10.1/src/crypto.cpp:110:77: warning: 'void nettle_gcm_aes_encrypt(gcm_aes_ctx*, size_t, uint8_t*, const uint8_t*)' is deprecated [-Wdeprecated-declarations]
  110 |     gcm_aes_encrypt(&aes, data.size(), ret.data() + GCM_IV_SIZE, data.data());
      |                                                                             ^
In file included from /wrkdirs/usr/ports/devel/opendht/work/opendht-1.10.1/src/crypto.cpp:26:
/usr/local/include/nettle/gcm.h:280:1: note: declared here
  280 | gcm_aes_encrypt(struct gcm_aes_ctx *ctx,
      | ^~~~~~~~~~~~~~~
/wrkdirs/usr/ports/devel/opendht/work/opendht-1.10.1/src/crypto.cpp:111:81: warning: 'void nettle_gcm_aes_digest(gcm_aes_ctx*, size_t, uint8_t*)' is deprecated [-Wdeprecated-declarations]
  111 |     gcm_aes_digest(&aes, GCM_DIGEST_SIZE, ret.data() + GCM_IV_SIZE + data.size());
      |                                                                                 ^
In file included from /wrkdirs/usr/ports/devel/opendht/work/opendht-1.10.1/src/crypto.cpp:26:
/usr/local/include/nettle/gcm.h:290:1: note: declared here
  290 | gcm_aes_digest(struct gcm_aes_ctx *ctx, size_t length, uint8_t *digest)
      | ^~~~~~~~~~~~~~
/wrkdirs/usr/ports/devel/opendht/work/opendht-1.10.1/src/crypto.cpp: In function 'dht::Blob dht::crypto::aesDecrypt(const Blob&, const Blob&)':
/wrkdirs/usr/ports/devel/opendht/work/opendht-1.10.1/src/crypto.cpp:135:49: warning: 'void nettle_gcm_aes_set_key(gcm_aes_ctx*, size_t, const uint8_t*)' is deprecated [-Wdeprecated-declarations]
  135 |     gcm_aes_set_key(&aes, key.size(), key.data());
      |                                                 ^
In file included from /wrkdirs/usr/ports/devel/opendht/work/opendht-1.10.1/src/crypto.cpp:26:
/usr/local/include/nettle/gcm.h:268:1: note: declared here
  268 | gcm_aes_set_key(struct gcm_aes_ctx *ctx,
      | ^~~~~~~~~~~~~~~
/wrkdirs/usr/ports/devel/opendht/work/opendht-1.10.1/src/crypto.cpp:136:50: warning: 'void nettle_gcm_aes_set_iv(gcm_aes_ctx*, size_t, const uint8_t*)' is deprecated [-Wdeprecated-declarations]
  136 |     gcm_aes_set_iv(&aes, GCM_IV_SIZE, data.data());
      |                                                  ^
In file included from /wrkdirs/usr/ports/devel/opendht/work/opendht-1.10.1/src/crypto.cpp:26:
/usr/local/include/nettle/gcm.h:272:1: note: declared here
  272 | gcm_aes_set_iv(struct gcm_aes_ctx *ctx,
      | ^~~~~~~~~~~~~~
/wrkdirs/usr/ports/devel/opendht/work/opendht-1.10.1/src/crypto.cpp:141:73: warning: 'void nettle_gcm_aes_decrypt(gcm_aes_ctx*, size_t, uint8_t*, const uint8_t*)' is deprecated [-Wdeprecated-declarations]
  141 |     gcm_aes_decrypt(&aes, data_sz, ret.data(), data.data() + GCM_IV_SIZE);
      |                                                                         ^
In file included from /wrkdirs/usr/ports/devel/opendht/work/opendht-1.10.1/src/crypto.cpp:26:
/usr/local/include/nettle/gcm.h:285:1: note: declared here
  285 | gcm_aes_decrypt(struct gcm_aes_ctx *ctx,
      | ^~~~~~~~~~~~~~~
/wrkdirs/usr/ports/devel/opendht/work/opendht-1.10.1/src/crypto.cpp:147:51: warning: 'void nettle_gcm_aes_set_key(gcm_aes_ctx*, size_t, const uint8_t*)' is deprecated [-Wdeprecated-declarations]
  147 |     gcm_aes_set_key(&aes_d, key.size(), key.data());
      |                                                   ^
In file included from /wrkdirs/usr/ports/devel/opendht/work/opendht-1.10.1/src/crypto.cpp:26:
/usr/local/include/nettle/gcm.h:268:1: note: declared here
  268 | gcm_aes_set_key(struct gcm_aes_ctx *ctx,
      | ^~~~~~~~~~~~~~~
/wrkdirs/usr/ports/devel/opendht/work/opendht-1.10.1/src/crypto.cpp:148:52: warning: 'void nettle_gcm_aes_set_iv(gcm_aes_ctx*, size_t, const uint8_t*)' is deprecated [-Wdeprecated-declarations]
  148 |     gcm_aes_set_iv(&aes_d, GCM_IV_SIZE, data.data());
      |                                                    ^
In file included from /wrkdirs/usr/ports/devel/opendht/work/opendht-1.10.1/src/crypto.cpp:26:
/usr/local/include/nettle/gcm.h:272:1: note: declared here
  272 | gcm_aes_set_iv(struct gcm_aes_ctx *ctx,
      | ^~~~~~~~~~~~~~
/wrkdirs/usr/ports/devel/opendht/work/opendht-1.10.1/src/crypto.cpp:149:50: warning: 'void nettle_gcm_aes_update(gcm_aes_ctx*, size_t, const uint8_t*)' is deprecated [-Wdeprecated-declarations]
  149 |     gcm_aes_update(&aes_d, ret.size(), ret.data());
      |                                                  ^
In file included from /wrkdirs/usr/ports/devel/opendht/work/opendht-1.10.1/src/crypto.cpp:26:
/usr/local/include/nettle/gcm.h:276:1: note: declared here
  276 | gcm_aes_update(struct gcm_aes_ctx *ctx,
      | ^~~~~~~~~~~~~~
/wrkdirs/usr/ports/devel/opendht/work/opendht-1.10.1/src/crypto.cpp:150:67: warning: 'void nettle_gcm_aes_encrypt(gcm_aes_ctx*, size_t, uint8_t*, const uint8_t*)' is deprecated [-Wdeprecated-declarations]
  150 |     gcm_aes_encrypt(&aes_d, ret.size(), ret_tmp.data(), ret.data());
      |                                                                   ^
In file included from /wrkdirs/usr/ports/devel/opendht/work/opendht-1.10.1/src/crypto.cpp:26:
/usr/local/include/nettle/gcm.h:280:1: note: declared here
  280 | gcm_aes_encrypt(struct gcm_aes_ctx *ctx,
      | ^~~~~~~~~~~~~~~
/wrkdirs/usr/ports/devel/opendht/work/opendht-1.10.1/src/crypto.cpp:151:58: warning: 'void nettle_gcm_aes_digest(gcm_aes_ctx*, size_t, uint8_t*)' is deprecated [-Wdeprecated-declarations]
  151 |     gcm_aes_digest(&aes_d, GCM_DIGEST_SIZE, digest.data());
      |                                                          ^
In file included from /wrkdirs/usr/ports/devel/opendht/work/opendht-1.10.1/src/crypto.cpp:26:
/usr/local/include/nettle/gcm.h:290:1: note: declared here
  290 | gcm_aes_digest(struct gcm_aes_ctx *ctx, size_t length, uint8_t *digest)
      | ^~~~~~~~~~~~~~
[5/27] /usr/local/bin/g++10 -DOPENDHT_BUILD -DOPENDHT_JSONCPP -DOPENDHT_LOG=true -DPACKAGE_VERSION=\"1.10.1\" -Dopendht_EXPORTS -I/wrkdirs/usr/ports/devel/opendht/work/opendht-1.10.1/. -I/wrkdirs/usr/ports/devel/opendht/work/opendht-1.10.1/include -I/wrkdirs/usr/ports/devel/opendht/work/opendht-1.10.1/include/opendht -Iinclude -O2 -pipe  -fstack-protector-strong -Wl,-rpath=/usr/local/lib/gcc10  -Wl,-rpath=/usr/local/lib/gcc10 -Wno-return-type -Wall -Wextra -Wnon-virtual-dtor -pedantic-errors -fvisibility=hidden -DMSGPACK_DISABLE_LEGACY_NIL -DMSGPACK_DISABLE_LEGACY_CONVERT -O2 -pipe  -fstack-protector-strong -Wl,-rpath=/usr/local/lib/gcc10  -Wl,-rpath=/usr/local/lib/gcc10 -fPIC -std=gnu++11 -MD -MT CMakeFiles/opendht.dir/src/node.cpp.o -MF CMakeFiles/opendht.dir/src/node.cpp.o.d -o CMakeFiles/opendht.dir/src/node.cpp.o -c /wrkdirs/usr/ports/devel/opendht/work/opendht-1.10.1/src/node.cpp
[6/27] /usr/local/bin/g++10 -DOPENDHT_BUILD -DOPENDHT_JSONCPP -DOPENDHT_LOG=true -DPACKAGE_VERSION=\"1.10.1\" -Dopendht_EXPORTS -I/wrkdirs/usr/ports/devel/opendht/work/opendht-1.10.1/. -I/wrkdirs/usr/ports/devel/opendht/work/opendht-1.10.1/include -I/wrkdirs/usr/ports/devel/opendht/work/opendht-1.10.1/include/opendht -Iinclude -O2 -pipe  -fstack-protector-strong -Wl,-rpath=/usr/local/lib/gcc10  -Wl,-rpath=/usr/local/lib/gcc10 -Wno-return-type -Wall -Wextra -Wnon-virtual-dtor -pedantic-errors -fvisibility=hidden -DMSGPACK_DISABLE_LEGACY_NIL -DMSGPACK_DISABLE_LEGACY_CONVERT -O2 -pipe  -fstack-protector-strong -Wl,-rpath=/usr/local/lib/gcc10  -Wl,-rpath=/usr/local/lib/gcc10 -fPIC -std=gnu++11 -MD -MT CMakeFiles/opendht.dir/src/default_types.cpp.o -MF CMakeFiles/opendht.dir/src/default_types.cpp.o.d -o CMakeFiles/opendht.dir/src/default_types.cpp.o -c /wrkdirs/usr/ports/devel/opendht/work/opendht-1.10.1/src/default_types.cpp
[7/27] /usr/local/bin/g++10 -DOPENDHT_BUILD -DOPENDHT_JSONCPP -DOPENDHT_LOG=true -DPACKAGE_VERSION=\"1.10.1\" -Dopendht_EXPORTS -I/wrkdirs/usr/ports/devel/opendht/work/opendht-1.10.1/. -I/wrkdirs/usr/ports/devel/opendht/work/opendht-1.10.1/include -I/wrkdirs/usr/ports/devel/opendht/work/opendht-1.10.1/include/opendht -Iinclude -O2 -pipe  -fstack-protector-strong -Wl,-rpath=/usr/local/lib/gcc10  -Wl,-rpath=/usr/local/lib/gcc10 -Wno-return-type -Wall -Wextra -Wnon-virtual-dtor -pedantic-errors -fvisibility=hidden -DMSGPACK_DISABLE_LEGACY_NIL -DMSGPACK_DISABLE_LEGACY_CONVERT -O2 -pipe  -fstack-protector-strong -Wl,-rpath=/usr/local/lib/gcc10  -Wl,-rpath=/usr/local/lib/gcc10 -fPIC -std=gnu++11 -MD -MT CMakeFiles/opendht.dir/src/value.cpp.o -MF CMakeFiles/opendht.dir/src/value.cpp.o.d -o CMakeFiles/opendht.dir/src/value.cpp.o -c /wrkdirs/usr/ports/devel/opendht/work/opendht-1.10.1/src/value.cpp
[8/27] /usr/local/bin/g++10 -DOPENDHT_BUILD -DOPENDHT_JSONCPP -DOPENDHT_LOG=true -DPACKAGE_VERSION=\"1.10.1\" -Dopendht_EXPORTS -I/wrkdirs/usr/ports/devel/opendht/work/opendht-1.10.1/. -I/wrkdirs/usr/ports/devel/opendht/work/opendht-1.10.1/include -I/wrkdirs/usr/ports/devel/opendht/work/opendht-1.10.1/include/opendht -Iinclude -O2 -pipe  -fstack-protector-strong -Wl,-rpath=/usr/local/lib/gcc10  -Wl,-rpath=/usr/local/lib/gcc10 -Wno-return-type -Wall -Wextra -Wnon-virtual-dtor -pedantic-errors -fvisibility=hidden -DMSGPACK_DISABLE_LEGACY_NIL -DMSGPACK_DISABLE_LEGACY_CONVERT -O2 -pipe  -fstack-protector-strong -Wl,-rpath=/usr/local/lib/gcc10  -Wl,-rpath=/usr/local/lib/gcc10 -fPIC -std=gnu++11 -MD -MT CMakeFiles/opendht.dir/src/op_cache.cpp.o -MF CMakeFiles/opendht.dir/src/op_cache.cpp.o.d -o CMakeFiles/opendht.dir/src/op_cache.cpp.o -c /wrkdirs/usr/ports/devel/opendht/work/opendht-1.10.1/src/op_cache.cpp
[9/27] /usr/local/bin/g++10 -DOPENDHT_BUILD -DOPENDHT_JSONCPP -DOPENDHT_LOG=true -DPACKAGE_VERSION=\"1.10.1\" -Dopendht_EXPORTS -I/wrkdirs/usr/ports/devel/opendht/work/opendht-1.10.1/. -I/wrkdirs/usr/ports/devel/opendht/work/opendht-1.10.1/include -I/wrkdirs/usr/ports/devel/opendht/work/opendht-1.10.1/include/opendht -Iinclude -O2 -pipe  -fstack-protector-strong -Wl,-rpath=/usr/local/lib/gcc10  -Wl,-rpath=/usr/local/lib/gcc10 -Wno-return-type -Wall -Wextra -Wnon-virtual-dtor -pedantic-errors -fvisibility=hidden -DMSGPACK_DISABLE_LEGACY_NIL -DMSGPACK_DISABLE_LEGACY_CONVERT -O2 -pipe  -fstack-protector-strong -Wl,-rpath=/usr/local/lib/gcc10  -Wl,-rpath=/usr/local/lib/gcc10 -fPIC -std=gnu++11 -MD -MT CMakeFiles/opendht.dir/src/callbacks.cpp.o -MF CMakeFiles/opendht.dir/src/callbacks.cpp.o.d -o CMakeFiles/opendht.dir/src/callbacks.cpp.o -c /wrkdirs/usr/ports/devel/opendht/work/opendht-1.10.1/src/callbacks.cpp
[10/27] /usr/local/bin/g++10 -DOPENDHT_BUILD -DOPENDHT_JSONCPP -DOPENDHT_LOG=true -DPACKAGE_VERSION=\"1.10.1\" -Dopendht_EXPORTS -I/wrkdirs/usr/ports/devel/opendht/work/opendht-1.10.1/. -I/wrkdirs/usr/ports/devel/opendht/work/opendht-1.10.1/include -I/wrkdirs/usr/ports/devel/opendht/work/opendht-1.10.1/include/opendht -Iinclude -O2 -pipe  -fstack-protector-strong -Wl,-rpath=/usr/local/lib/gcc10  -Wl,-rpath=/usr/local/lib/gcc10 -Wno-return-type -Wall -Wextra -Wnon-virtual-dtor -pedantic-errors -fvisibility=hidden -DMSGPACK_DISABLE_LEGACY_NIL -DMSGPACK_DISABLE_LEGACY_CONVERT -O2 -pipe  -fstack-protector-strong -Wl,-rpath=/usr/local/lib/gcc10  -Wl,-rpath=/usr/local/lib/gcc10 -fPIC -std=gnu++11 -MD -MT CMakeFiles/opendht.dir/src/routing_table.cpp.o -MF CMakeFiles/opendht.dir/src/routing_table.cpp.o.d -o CMakeFiles/opendht.dir/src/routing_table.cpp.o -c /wrkdirs/usr/ports/devel/opendht/work/opendht-1.10.1/src/routing_table.cpp
[11/27] /usr/local/bin/g++10 -DOPENDHT_BUILD -DOPENDHT_JSONCPP -DOPENDHT_LOG=true -DPACKAGE_VERSION=\"1.10.1\" -Dopendht_EXPORTS -I/wrkdirs/usr/ports/devel/opendht/work/opendht-1.10.1/. -I/wrkdirs/usr/ports/devel/opendht/work/opendht-1.10.1/include -I/wrkdirs/usr/ports/devel/opendht/work/opendht-1.10.1/include/opendht -Iinclude -O2 -pipe  -fstack-protector-strong -Wl,-rpath=/usr/local/lib/gcc10  -Wl,-rpath=/usr/local/lib/gcc10 -Wno-return-type -Wall -Wextra -Wnon-virtual-dtor -pedantic-errors -fvisibility=hidden -DMSGPACK_DISABLE_LEGACY_NIL -DMSGPACK_DISABLE_LEGACY_CONVERT -O2 -pipe  -fstack-protector-strong -Wl,-rpath=/usr/local/lib/gcc10  -Wl,-rpath=/usr/local/lib/gcc10 -fPIC -std=gnu++11 -MD -MT CMakeFiles/opendht.dir/src/node_cache.cpp.o -MF CMakeFiles/opendht.dir/src/node_cache.cpp.o.d -o CMakeFiles/opendht.dir/src/node_cache.cpp.o -c /wrkdirs/usr/ports/devel/opendht/work/opendht-1.10.1/src/node_cache.cpp
[12/27] /usr/local/bin/g++10 -DOPENDHT_BUILD -DOPENDHT_JSONCPP -DOPENDHT_LOG=true -DPACKAGE_VERSION=\"1.10.1\" -Dopendht_EXPORTS -I/wrkdirs/usr/ports/devel/opendht/work/opendht-1.10.1/. -I/wrkdirs/usr/ports/devel/opendht/work/opendht-1.10.1/include -I/wrkdirs/usr/ports/devel/opendht/work/opendht-1.10.1/include/opendht -Iinclude -O2 -pipe  -fstack-protector-strong -Wl,-rpath=/usr/local/lib/gcc10  -Wl,-rpath=/usr/local/lib/gcc10 -Wno-return-type -Wall -Wextra -Wnon-virtual-dtor -pedantic-errors -fvisibility=hidden -DMSGPACK_DISABLE_LEGACY_NIL -DMSGPACK_DISABLE_LEGACY_CONVERT -O2 -pipe  -fstack-protector-strong -Wl,-rpath=/usr/local/lib/gcc10  -Wl,-rpath=/usr/local/lib/gcc10 -fPIC -std=gnu++11 -MD -MT CMakeFiles/opendht.dir/src/dht.cpp.o -MF CMakeFiles/opendht.dir/src/dht.cpp.o.d -o CMakeFiles/opendht.dir/src/dht.cpp.o -c /wrkdirs/usr/ports/devel/opendht/work/opendht-1.10.1/src/dht.cpp
[13/27] /usr/local/bin/g++10 -DOPENDHT_BUILD -DOPENDHT_JSONCPP -DOPENDHT_LOG=true -DPACKAGE_VERSION=\"1.10.1\" -Dopendht_EXPORTS -I/wrkdirs/usr/ports/devel/opendht/work/opendht-1.10.1/. -I/wrkdirs/usr/ports/devel/opendht/work/opendht-1.10.1/include -I/wrkdirs/usr/ports/devel/opendht/work/opendht-1.10.1/include/opendht -Iinclude -O2 -pipe  -fstack-protector-strong -Wl,-rpath=/usr/local/lib/gcc10  -Wl,-rpath=/usr/local/lib/gcc10 -Wno-return-type -Wall -Wextra -Wnon-virtual-dtor -pedantic-errors -fvisibility=hidden -DMSGPACK_DISABLE_LEGACY_NIL -DMSGPACK_DISABLE_LEGACY_CONVERT -O2 -pipe  -fstack-protector-strong -Wl,-rpath=/usr/local/lib/gcc10  -Wl,-rpath=/usr/local/lib/gcc10 -fPIC -std=gnu++11 -MD -MT CMakeFiles/opendht.dir/src/securedht.cpp.o -MF CMakeFiles/opendht.dir/src/securedht.cpp.o.d -o CMakeFiles/opendht.dir/src/securedht.cpp.o -c /wrkdirs/usr/ports/devel/opendht/work/opendht-1.10.1/src/securedht.cpp
[14/27] /usr/local/bin/g++10 -DOPENDHT_BUILD -DOPENDHT_JSONCPP -DOPENDHT_LOG=true -DPACKAGE_VERSION=\"1.10.1\" -Dopendht_EXPORTS -I/wrkdirs/usr/ports/devel/opendht/work/opendht-1.10.1/. -I/wrkdirs/usr/ports/devel/opendht/work/opendht-1.10.1/include -I/wrkdirs/usr/ports/devel/opendht/work/opendht-1.10.1/include/opendht -Iinclude -O2 -pipe  -fstack-protector-strong -Wl,-rpath=/usr/local/lib/gcc10  -Wl,-rpath=/usr/local/lib/gcc10 -Wno-return-type -Wall -Wextra -Wnon-virtual-dtor -pedantic-errors -fvisibility=hidden -DMSGPACK_DISABLE_LEGACY_NIL -DMSGPACK_DISABLE_LEGACY_CONVERT -O2 -pipe  -fstack-protector-strong -Wl,-rpath=/usr/local/lib/gcc10  -Wl,-rpath=/usr/local/lib/gcc10 -fPIC -std=gnu++11 -MD -MT CMakeFiles/opendht.dir/src/network_engine.cpp.o -MF CMakeFiles/opendht.dir/src/network_engine.cpp.o.d -o CMakeFiles/opendht.dir/src/network_engine.cpp.o -c /wrkdirs/usr/ports/devel/opendht/work/opendht-1.10.1/src/network_engine.cpp
[15/27] /usr/local/bin/g++10 -DOPENDHT_BUILD -DOPENDHT_JSONCPP -DOPENDHT_LOG=true -DPACKAGE_VERSION=\"1.10.1\" -Dopendht_EXPORTS -I/wrkdirs/usr/ports/devel/opendht/work/opendht-1.10.1/. -I/wrkdirs/usr/ports/devel/opendht/work/opendht-1.10.1/include -I/wrkdirs/usr/ports/devel/opendht/work/opendht-1.10.1/include/opendht -Iinclude -O2 -pipe  -fstack-protector-strong -Wl,-rpath=/usr/local/lib/gcc10  -Wl,-rpath=/usr/local/lib/gcc10 -Wno-return-type -Wall -Wextra -Wnon-virtual-dtor -pedantic-errors -fvisibility=hidden -DMSGPACK_DISABLE_LEGACY_NIL -DMSGPACK_DISABLE_LEGACY_CONVERT -O2 -pipe  -fstack-protector-strong -Wl,-rpath=/usr/local/lib/gcc10  -Wl,-rpath=/usr/local/lib/gcc10 -fPIC -std=gnu++11 -MD -MT CMakeFiles/opendht.dir/src/log.cpp.o -MF CMakeFiles/opendht.dir/src/log.cpp.o.d -o CMakeFiles/opendht.dir/src/log.cpp.o -c /wrkdirs/usr/ports/devel/opendht/work/opendht-1.10.1/src/log.cpp
[16/27] /usr/local/bin/g++10 -DOPENDHT_BUILD -DOPENDHT_JSONCPP -DOPENDHT_LOG=true -DPACKAGE_VERSION=\"1.10.1\" -Dopendht_EXPORTS -I/wrkdirs/usr/ports/devel/opendht/work/opendht-1.10.1/. -I/wrkdirs/usr/ports/devel/opendht/work/opendht-1.10.1/include -I/wrkdirs/usr/ports/devel/opendht/work/opendht-1.10.1/include/opendht -Iinclude -O2 -pipe  -fstack-protector-strong -Wl,-rpath=/usr/local/lib/gcc10  -Wl,-rpath=/usr/local/lib/gcc10 -Wno-return-type -Wall -Wextra -Wnon-virtual-dtor -pedantic-errors -fvisibility=hidden -DMSGPACK_DISABLE_LEGACY_NIL -DMSGPACK_DISABLE_LEGACY_CONVERT -O2 -pipe  -fstack-protector-strong -Wl,-rpath=/usr/local/lib/gcc10  -Wl,-rpath=/usr/local/lib/gcc10 -fPIC -std=gnu++11 -MD -MT CMakeFiles/opendht.dir/src/dhtrunner.cpp.o -MF CMakeFiles/opendht.dir/src/dhtrunner.cpp.o.d -o CMakeFiles/opendht.dir/src/dhtrunner.cpp.o -c /wrkdirs/usr/ports/devel/opendht/work/opendht-1.10.1/src/dhtrunner.cpp
/wrkdirs/usr/ports/devel/opendht/work/opendht-1.10.1/src/dhtrunner.cpp: In member function 'void dht::DhtRunner::setProxyServer(const string&, const string&)':
/wrkdirs/usr/ports/devel/opendht/work/opendht-1.10.1/src/dhtrunner.cpp:953:72: warning: unused parameter 'pushNodeId' [-Wunused-parameter]
  953 | DhtRunner::setProxyServer(const std::string& proxy, const std::string& pushNodeId)
      |                                                     ~~~~~~~~~~~~~~~~~~~^~~~~~~~~~
[17/27] /usr/local/bin/g++10 -DOPENDHT_BUILD -DOPENDHT_JSONCPP -DOPENDHT_LOG=true -DPACKAGE_VERSION=\"1.10.1\" -Dopendht_EXPORTS -I/wrkdirs/usr/ports/devel/opendht/work/opendht-1.10.1/. -I/wrkdirs/usr/ports/devel/opendht/work/opendht-1.10.1/include -I/wrkdirs/usr/ports/devel/opendht/work/opendht-1.10.1/include/opendht -Iinclude -O2 -pipe  -fstack-protector-strong -Wl,-rpath=/usr/local/lib/gcc10  -Wl,-rpath=/usr/local/lib/gcc10 -Wno-return-type -Wall -Wextra -Wnon-virtual-dtor -pedantic-errors -fvisibility=hidden -DMSGPACK_DISABLE_LEGACY_NIL -DMSGPACK_DISABLE_LEGACY_CONVERT -O2 -pipe  -fstack-protector-strong -Wl,-rpath=/usr/local/lib/gcc10  -Wl,-rpath=/usr/local/lib/gcc10 -fPIC -std=gnu++11 -MD -MT CMakeFiles/opendht.dir/src/network_utils.cpp.o -MF CMakeFiles/opendht.dir/src/network_utils.cpp.o.d -o CMakeFiles/opendht.dir/src/network_utils.cpp.o -c /wrkdirs/usr/ports/devel/opendht/work/opendht-1.10.1/src/network_utils.cpp
FAILED: CMakeFiles/opendht.dir/src/network_utils.cpp.o 
/usr/local/bin/g++10 -DOPENDHT_BUILD -DOPENDHT_JSONCPP -DOPENDHT_LOG=true -DPACKAGE_VERSION=\"1.10.1\" -Dopendht_EXPORTS -I/wrkdirs/usr/ports/devel/opendht/work/opendht-1.10.1/. -I/wrkdirs/usr/ports/devel/opendht/work/opendht-1.10.1/include -I/wrkdirs/usr/ports/devel/opendht/work/opendht-1.10.1/include/opendht -Iinclude -O2 -pipe  -fstack-protector-strong -Wl,-rpath=/usr/local/lib/gcc10  -Wl,-rpath=/usr/local/lib/gcc10 -Wno-return-type -Wall -Wextra -Wnon-virtual-dtor -pedantic-errors -fvisibility=hidden -DMSGPACK_DISABLE_LEGACY_NIL -DMSGPACK_DISABLE_LEGACY_CONVERT -O2 -pipe  -fstack-protector-strong -Wl,-rpath=/usr/local/lib/gcc10  -Wl,-rpath=/usr/local/lib/gcc10 -fPIC -std=gnu++11 -MD -MT CMakeFiles/opendht.dir/src/network_utils.cpp.o -MF CMakeFiles/opendht.dir/src/network_utils.cpp.o.d -o CMakeFiles/opendht.dir/src/network_utils.cpp.o -c /wrkdirs/usr/ports/devel/opendht/work/opendht-1.10.1/src/network_utils.cpp
In file included from /wrkdirs/usr/ports/devel/opendht/work/opendht-1.10.1/include/opendht/network_utils.h:22,
                 from /wrkdirs/usr/ports/devel/opendht/work/opendht-1.10.1/src/network_utils.cpp:19:
/wrkdirs/usr/ports/devel/opendht/work/opendht-1.10.1/include/opendht/sockaddr.h: In constructor 'dht::SockAddr::SockAddr(const sockaddr*, socklen_t)':
/wrkdirs/usr/ports/devel/opendht/work/opendht-1.10.1/include/opendht/sockaddr.h:71:24: error: 'runtime_error' is not a member of 'std'
   71 |             throw std::runtime_error("Socket address length is too large");
      |                        ^~~~~~~~~~~~~
/wrkdirs/usr/ports/devel/opendht/work/opendht-1.10.1/include/opendht/sockaddr.h: In constructor 'dht::SockAddr::SockAddr(const sockaddr*)':
/wrkdirs/usr/ports/devel/opendht/work/opendht-1.10.1/include/opendht/sockaddr.h:82:28: error: 'runtime_error' is not a member of 'std'
   82 |                 throw std::runtime_error("Unknown address family");
      |                            ^~~~~~~~~~~~~
/wrkdirs/usr/ports/devel/opendht/work/opendht-1.10.1/src/network_utils.cpp: In member function 'virtual int dht::net::UdpSocket::sendTo(const dht::SockAddr&, const uint8_t*, size_t, bool)':
/wrkdirs/usr/ports/devel/opendht/work/opendht-1.10.1/src/network_utils.cpp:130:80: warning: unused parameter 'replied' [-Wunused-parameter]
  130 | UdpSocket::sendTo(const SockAddr& dest, const uint8_t* data, size_t size, bool replied) {
      |                                                                           ~~~~~^~~~~~~
[18/27] /usr/local/bin/g++10 -DOPENDHT_BUILD -DOPENDHT_JSONCPP -DOPENDHT_LOG=true -DPACKAGE_VERSION=\"1.10.1\" -Dopendht_EXPORTS -I/wrkdirs/usr/ports/devel/opendht/work/opendht-1.10.1/. -I/wrkdirs/usr/ports/devel/opendht/work/opendht-1.10.1/include -I/wrkdirs/usr/ports/devel/opendht/work/opendht-1.10.1/include/opendht -Iinclude -O2 -pipe  -fstack-protector-strong -Wl,-rpath=/usr/local/lib/gcc10  -Wl,-rpath=/usr/local/lib/gcc10 -Wno-return-type -Wall -Wextra -Wnon-virtual-dtor -pedantic-errors -fvisibility=hidden -DMSGPACK_DISABLE_LEGACY_NIL -DMSGPACK_DISABLE_LEGACY_CONVERT -O2 -pipe  -fstack-protector-strong -Wl,-rpath=/usr/local/lib/gcc10  -Wl,-rpath=/usr/local/lib/gcc10 -fPIC -std=gnu++11 -MD -MT CMakeFiles/opendht.dir/src/peer_discovery.cpp.o -MF CMakeFiles/opendht.dir/src/peer_discovery.cpp.o.d -o CMakeFiles/opendht.dir/src/peer_discovery.cpp.o -c /wrkdirs/usr/ports/devel/opendht/work/opendht-1.10.1/src/peer_discovery.cpp
FAILED: CMakeFiles/opendht.dir/src/peer_discovery.cpp.o 
/usr/local/bin/g++10 -DOPENDHT_BUILD -DOPENDHT_JSONCPP -DOPENDHT_LOG=true -DPACKAGE_VERSION=\"1.10.1\" -Dopendht_EXPORTS -I/wrkdirs/usr/ports/devel/opendht/work/opendht-1.10.1/. -I/wrkdirs/usr/ports/devel/opendht/work/opendht-1.10.1/include -I/wrkdirs/usr/ports/devel/opendht/work/opendht-1.10.1/include/opendht -Iinclude -O2 -pipe  -fstack-protector-strong -Wl,-rpath=/usr/local/lib/gcc10  -Wl,-rpath=/usr/local/lib/gcc10 -Wno-return-type -Wall -Wextra -Wnon-virtual-dtor -pedantic-errors -fvisibility=hidden -DMSGPACK_DISABLE_LEGACY_NIL -DMSGPACK_DISABLE_LEGACY_CONVERT -O2 -pipe  -fstack-protector-strong -Wl,-rpath=/usr/local/lib/gcc10  -Wl,-rpath=/usr/local/lib/gcc10 -fPIC -std=gnu++11 -MD -MT CMakeFiles/opendht.dir/src/peer_discovery.cpp.o -MF CMakeFiles/opendht.dir/src/peer_discovery.cpp.o.d -o CMakeFiles/opendht.dir/src/peer_discovery.cpp.o -c /wrkdirs/usr/ports/devel/opendht/work/opendht-1.10.1/src/peer_discovery.cpp
In file included from /wrkdirs/usr/ports/devel/opendht/work/opendht-1.10.1/include/opendht/peer_discovery.h:22,
                 from /wrkdirs/usr/ports/devel/opendht/work/opendht-1.10.1/src/peer_discovery.cpp:19:
/wrkdirs/usr/ports/devel/opendht/work/opendht-1.10.1/include/opendht/sockaddr.h: In constructor 'dht::SockAddr::SockAddr(const sockaddr*, socklen_t)':
/wrkdirs/usr/ports/devel/opendht/work/opendht-1.10.1/include/opendht/sockaddr.h:71:24: error: 'runtime_error' is not a member of 'std'
   71 |             throw std::runtime_error("Socket address length is too large");
      |                        ^~~~~~~~~~~~~
/wrkdirs/usr/ports/devel/opendht/work/opendht-1.10.1/include/opendht/sockaddr.h: In constructor 'dht::SockAddr::SockAddr(const sockaddr*)':
/wrkdirs/usr/ports/devel/opendht/work/opendht-1.10.1/include/opendht/sockaddr.h:82:28: error: 'runtime_error' is not a member of 'std'
   82 |                 throw std::runtime_error("Unknown address family");
      |                            ^~~~~~~~~~~~~
ninja: build stopped: subcommand failed.
===> Compilation failed unexpectedly.
Try to set MAKE_JOBS_UNSAFE=yes and rebuild before reporting the failure to
the maintainer.
*** Error code 1

Stop.
make: stopped in /usr/ports/devel/opendht
Received on Thu Jun 24 2021 - 02:59:39 UTC

Original text of this message