[package - 130arm64-quarterly][audio/surge-synthesizer-lv2] Failed for surge-synthesizer-lv2-1.8.1 in build

From: <pkg-fallout_at_FreeBSD.org>
Date: Wed, 23 Jun 2021 14:52:12 GMT
You are receiving this mail as a port that you maintain
is failing to build on the FreeBSD package build server.
Please investigate the failure and submit a PR to fix
build.

Maintainer:     yuri_at_FreeBSD.org
Log URL:        http://ampere1.nyi.freebsd.org/data/130arm64-quarterly/dbe1c4c35016/logs/surge-synthesizer-lv2-1.8.1.log
Build URL:      http://ampere1.nyi.freebsd.org/build.html?mastername=130arm64-quarterly&build=dbe1c4c35016
Log:

=>> Building audio/surge-synthesizer-lv2
build started at Wed Jun 23 14:51:26 UTC 2021
port directory: /usr/ports/audio/surge-synthesizer-lv2
package name: surge-synthesizer-lv2-1.8.1
building for: FreeBSD 130arm64-quarterly-job-06 13.0-RELEASE-p2 FreeBSD 13.0-RELEASE-p2 arm64
maintained by: yuri_at_FreeBSD.org
Makefile ident: 
Poudriere version: 3.2.8-8-gaf08dbda
Host OSVERSION: 1400008
Jail OSVERSION: 1300139
Job Id: 06

---Begin Environment---
SHELL=/bin/csh
OSVERSION=1300139
UNAME_v=FreeBSD 13.0-RELEASE-p2
UNAME_r=13.0-RELEASE-p2
BLOCKSIZE=K
MAIL=/var/mail/root
MM_CHARSET=UTF-8
LANG=C.UTF-8
STATUS=1
HOME=/root
PATH=/sbin:/bin:/usr/sbin:/usr/bin:/usr/local/sbin:/usr/local/bin:/root/bin
LOCALBASE=/usr/local
USER=root
LIBEXECPREFIX=/usr/local/libexec/poudriere
POUDRIERE_VERSION=3.2.8-8-gaf08dbda
MASTERMNT=/usr/local/poudriere/data/.m/130arm64-quarterly/ref
POUDRIERE_BUILD_TYPE=bulk
PACKAGE_BUILDING=yes
SAVED_TERM=
PWD=/usr/local/poudriere/data/.m/130arm64-quarterly/ref/.p/pool
P_PORTS_FEATURES=FLAVORS SELECTED_OPTIONS
MASTERNAME=130arm64-quarterly
SCRIPTPREFIX=/usr/local/share/poudriere
OLDPWD=/usr/local/poudriere/data/.m/130arm64-quarterly/ref/.p
SCRIPTPATH=/usr/local/share/poudriere/bulk.sh
POUDRIEREPATH=/usr/local/bin/poudriere
---End Environment---

---Begin Poudriere Port Flags/Env---
PORT_FLAGS=
PKGENV=
FLAVOR=
DEPENDS_ARGS=
MAKE_ARGS=
---End Poudriere Port Flags/Env---

---Begin OPTIONS List---
---End OPTIONS List---

--MAINTAINER--
yuri_at_FreeBSD.org
--End MAINTAINER--

--CONFIGURE_ARGS--

--End CONFIGURE_ARGS--

--CONFIGURE_ENV--
PKG_CONFIG=pkgconf PYTHON="/usr/local/bin/python3.7" XDG_DATA_HOME=/wrkdirs/usr/ports/audio/surge-synthesizer-lv2/work  XDG_CONFIG_HOME=/wrkdirs/usr/ports/audio/surge-synthesizer-lv2/work  HOME=/wrkdirs/usr/ports/audio/surge-synthesizer-lv2/work TMPDIR="/tmp" PATH=/wrkdirs/usr/ports/audio/surge-synthesizer-lv2/work/.bin:/sbin:/bin:/usr/sbin:/usr/bin:/usr/local/sbin:/usr/local/bin:/root/bin SHELL=/bin/sh CONFIG_SHELL=/bin/sh CMAKE_PREFIX_PATH="/usr/local" LANG=en_US.UTF-8 LC_ALL=en_US.UTF-8
--End CONFIGURE_ENV--

--MAKE_ENV--
XDG_DATA_HOME=/wrkdirs/usr/ports/audio/surge-synthesizer-lv2/work  XDG_CONFIG_HOME=/wrkdirs/usr/ports/audio/surge-synthesizer-lv2/work  HOME=/wrkdirs/usr/ports/audio/surge-synthesizer-lv2/work TMPDIR="/tmp" PATH=/wrkdirs/usr/ports/audio/surge-synthesizer-lv2/work/.bin:/sbin:/bin:/usr/sbin:/usr/bin:/usr/local/sbin:/usr/local/bin:/root/bin NO_PIE=yes MK_DEBUG_FILES=no MK_KERNEL_SYMBOLS=no SHELL=/bin/sh NO_LINT=YES DESTDIR=/wrkdirs/usr/ports/audio/surge-synthesizer-lv2/work/stage LANG=en_US.UTF-8 LC_ALL=en_US.UTF-8 PREFIX=/usr/local  LOCALBASE=/usr/local  CC="cc" CFLAGS="-O2 -pipe  -fstack-protector-strong -isystem /usr/local/include -fno-strict-aliasing "  CPP="cpp" CPPFLAGS="-isystem /usr/local/include"  LDFLAGS=" -lmidifile -lexecinfo -fstack-protector-strong -L/usr/local/lib " LIBS=""  CXX="c++" CXXFLAGS="-O2 -pipe -fstack-protector-strong -isystem /usr/local/include -fno-strict-aliasing  -I/usr/local/include/midifile -isystem /usr/local/include "  MANPREFIX="/usr/local" BSD_INSTALL
 _PROGRAM="install  -s -m 555"  BSD_INSTALL_LIB="install  -s -m 0644"  BSD_INSTALL_SCRIPT="install  -m 555"  BSD_INSTALL_DATA="install  -m 0644"  BSD_INSTALL_MAN="install  -m 444"
--End MAKE_ENV--

--PLIST_SUB--
CMAKE_BUILD_TYPE="release" GTK2_VERSION="2.10.0"  GTK3_VERSION="3.0.0" PYTHON_INCLUDEDIR=include/python3.7m  PYTHON_LIBDIR=lib/python3.7  PYTHON_PLATFORM=freebsd13  PYTHON_SITELIBDIR=lib/python3.7/site-packages  PYTHON_SUFFIX=37  PYTHON_EXT_SUFFIX=  PYTHON_VER=3.7  PYTHON_VERSION=python3.7 PYTHON2="_at_comment " PYTHON3="" OSREL=13.0 PREFIX=%D LOCALBASE=/usr/local  RESETPREFIX=/usr/local LIB32DIR=lib DOCSDIR="share/doc/surge-synthesizer"  EXAMPLESDIR="share/examples/surge-synthesizer"  DATADIR="share/surge-synthesizer"  WWWDIR="www/surge-synthesizer"  ETCDIR="etc/surge-synthesizer"
--End PLIST_SUB--

--SUB_LIST--
PREFIX=/usr/local LOCALBASE=/usr/local  DATADIR=/usr/local/share/surge-synthesizer DOCSDIR=/usr/local/share/doc/surge-synthesizer EXAMPLESDIR=/usr/local/share/examples/surge-synthesizer  WWWDIR=/usr/local/www/surge-synthesizer ETCDIR=/usr/local/etc/surge-synthesizer
--End SUB_LIST--

---Begin make.conf---
USE_PACKAGE_DEPENDS=yes
BATCH=yes
WRKDIRPREFIX=/wrkdirs
PORTSDIR=/usr/ports
PACKAGES=/packages
DISTDIR=/distfiles
PACKAGE_BUILDING=yes
PACKAGE_BUILDING_FLAVORS=yes
#### /usr/local/etc/poudriere.d/make.conf ####
# XXX: We really need this but cannot use it while 'make checksum' does not
# try the next mirror on checksum failure.  It currently retries the same
# failed mirror and then fails rather then trying another.  It *does*
# try the next if the size is mismatched though.
#MASTER_SITE_FREEBSD=yes
# Build ALLOW_MAKE_JOBS_PACKAGES with 2 jobs
MAKE_JOBS_NUMBER=2
#### /usr/ports/Mk/Scripts/ports_env.sh ####
_CCVERSION_921dbbb2=FreeBSD clang version 11.0.1 (git_at_github.com:llvm/llvm-project.git llvmorg-11.0.1-0-g43ff75f2c3fe) Target: aarch64-unknown-freebsd13.0 Thread model: posix InstalledDir: /usr/bin
_ALTCCVERSION_921dbbb2=none
_CXXINTERNAL_acaad9ca=FreeBSD clang version 11.0.1 (git_at_github.com:llvm/llvm-project.git llvmorg-11.0.1-0-g43ff75f2c3fe) Target: aarch64-unknown-freebsd13.0 Thread model: posix InstalledDir: /usr/bin "/usr/bin/ld" "--eh-frame-hdr" "-dynamic-linker" "/libexec/ld-elf.so.1" "--enable-new-dtags" "-o" "a.out" "/usr/lib/crt1.o" "/usr/lib/crti.o" "/usr/lib/crtbegin.o" "-L/usr/lib" "/dev/null" "-lc++" "-lm" "-lgcc" "--as-needed" "-lgcc_s" "--no-as-needed" "-lc" "-lgcc" "--as-needed" "-lgcc_s" "--no-as-needed" "/usr/lib/crtend.o" "/usr/lib/crtn.o"
CC_OUTPUT_921dbbb2_58173849=yes
CC_OUTPUT_921dbbb2_9bdba57c=yes
CC_OUTPUT_921dbbb2_6a4fe7f5=yes
CC_OUTPUT_921dbbb2_6bcac02b=yes
CC_OUTPUT_921dbbb2_67d20829=yes
CC_OUTPUT_921dbbb2_bfa62e83=yes
CC_OUTPUT_921dbbb2_f0b4d593=yes
CC_OUTPUT_921dbbb2_308abb44=yes
CC_OUTPUT_921dbbb2_f00456e5=yes
CC_OUTPUT_921dbbb2_65ad290d=yes
CC_OUTPUT_921dbbb2_f2776b26=yes
CC_OUTPUT_921dbbb2_b2657cc3=yes
CC_OUTPUT_921dbbb2_380987f7=yes
CC_OUTPUT_921dbbb2_160933ec=yes
CC_OUTPUT_921dbbb2_fb62803b=yes
_OBJC_CCVERSION_921dbbb2=FreeBSD clang version 11.0.1 (git_at_github.com:llvm/llvm-project.git llvmorg-11.0.1-0-g43ff75f2c3fe) Target: aarch64-unknown-freebsd13.0 Thread model: posix InstalledDir: /usr/bin
_OBJC_ALTCCVERSION_921dbbb2=none
ARCH=aarch64
OPSYS=FreeBSD
_OSRELEASE=13.0-RELEASE-p2
OSREL=13.0
OSVERSION=1300139
PYTHONBASE=/usr/local
CONFIGURE_MAX_CMD_LEN=524288
HAVE_PORTS_ENV=1
#### Misc Poudriere ####
GID=0
UID=0
---End make.conf---
--Resource limits--
cpu time               (seconds, -t)  unlimited
file size           (512-blocks, -f)  unlimited
data seg size           (kbytes, -d)  1048576
stack size              (kbytes, -s)  1048576
core file size      (512-blocks, -c)  unlimited
max memory size         (kbytes, -m)  unlimited
locked memory           (kbytes, -l)  unlimited
max user processes              (-u)  89999
open files                      (-n)  1024
virtual mem size        (kbytes, -v)  unlimited
swap limit              (kbytes, -w)  unlimited
socket buffer size       (bytes, -b)  unlimited
pseudo-terminals                (-p)  unlimited
kqueues                         (-k)  unlimited
umtx shared locks               (-o)  unlimited
--End resource limits--
=======================<phase: check-sanity   >============================
===>  License GPLv3 accepted by the user
===========================================================================
=======================<phase: pkg-depends    >============================
===>   surge-synthesizer-lv2-1.8.1 depends on file: /usr/local/sbin/pkg - not found
===>   Installing existing package /packages/All/pkg-1.16.3.txz
[130arm64-quarterly-job-06] Installing pkg-1.16.3...
[130arm64-quarterly-job-06] Extracting pkg-1.16.3: .......... done
===>   surge-synthesizer-lv2-1.8.1 depends on file: /usr/local/sbin/pkg - found
===>   Returning to build of surge-synthesizer-lv2-1.8.1
===========================================================================
=======================<phase: fetch-depends  >============================
===========================================================================
=======================<phase: fetch          >============================
===>  License GPLv3 accepted by the user
===> Fetching all distfiles required by surge-synthesizer-lv2-1.8.1 for building
===========================================================================
=======================<phase: checksum       >============================
===>  License GPLv3 accepted by the user
===> Fetching all distfiles required by surge-synthesizer-lv2-1.8.1 for building
=> SHA256 Checksum OK for surge-synthesizer-surge-release_1.8.1_GH0.tar.gz.
=> SHA256 Checksum OK for surge-synthesizer-vst3sdk-10287bc37bbb34324b8097369e2ec4eb73a51d65_GH0.tar.gz.
=> SHA256 Checksum OK for surge-synthesizer-vstgui-8abd688c76edfb7215413080960649a532a6755c_GH0.tar.gz.
=> SHA256 Checksum OK for surge-synthesizer-tuning-library-d9660eff4b59cafb9dcd712864b6c8af536089bc_GH0.tar.gz.
=> SHA256 Checksum OK for steinbergmedia-vst3_base-37dbdb6ff7af29e518877f57f14050594164a0d6_GH0.tar.gz.
=> SHA256 Checksum OK for steinbergmedia-vst3_cmake-f7ae22417019aa355de6f7ec46ecf890d3c2a76f_GH0.tar.gz.
=> SHA256 Checksum OK for steinbergmedia-vst3_pluginterfaces-6c6bb30d18c3d5a553e55aa74afc5d146571be0a_GH0.tar.gz.
=> SHA256 Checksum OK for steinbergmedia-vst3_public_sdk-ced72c00d5c1365a4cca16cdbfb871be2496848b_GH0.tar.gz.
===========================================================================
=======================<phase: extract-depends>============================
===========================================================================
=======================<phase: extract        >============================
===>  License GPLv3 accepted by the user
===> Fetching all distfiles required by surge-synthesizer-lv2-1.8.1 for building
===>  Extracting for surge-synthesizer-lv2-1.8.1
=> SHA256 Checksum OK for surge-synthesizer-surge-release_1.8.1_GH0.tar.gz.
=> SHA256 Checksum OK for surge-synthesizer-vst3sdk-10287bc37bbb34324b8097369e2ec4eb73a51d65_GH0.tar.gz.
=> SHA256 Checksum OK for surge-synthesizer-vstgui-8abd688c76edfb7215413080960649a532a6755c_GH0.tar.gz.
=> SHA256 Checksum OK for surge-synthesizer-tuning-library-d9660eff4b59cafb9dcd712864b6c8af536089bc_GH0.tar.gz.
=> SHA256 Checksum OK for steinbergmedia-vst3_base-37dbdb6ff7af29e518877f57f14050594164a0d6_GH0.tar.gz.
=> SHA256 Checksum OK for steinbergmedia-vst3_cmake-f7ae22417019aa355de6f7ec46ecf890d3c2a76f_GH0.tar.gz.
=> SHA256 Checksum OK for steinbergmedia-vst3_pluginterfaces-6c6bb30d18c3d5a553e55aa74afc5d146571be0a_GH0.tar.gz.
=> SHA256 Checksum OK for steinbergmedia-vst3_public_sdk-ced72c00d5c1365a4cca16cdbfb871be2496848b_GH0.tar.gz.
===========================================================================
=======================<phase: patch-depends  >============================
===========================================================================
=======================<phase: patch          >============================
===>  Patching for surge-synthesizer-lv2-1.8.1
===>  Applying FreeBSD patches for surge-synthesizer-lv2-1.8.1 from /usr/ports/audio/surge-synthesizer-lv2/files
===========================================================================
=======================<phase: build-depends  >============================
===>   surge-synthesizer-lv2-1.8.1 depends on package: lv2>0 - not found
===>   Installing existing package /packages/All/lv2-1.18.2.txz
[130arm64-quarterly-job-06] Installing lv2-1.18.2...
[130arm64-quarterly-job-06] `-- Installing atk-2.36.0...
[130arm64-quarterly-job-06] |   `-- Installing gettext-runtime-0.21...
<snip>

-- Build files have been written to: /wrkdirs/usr/ports/audio/surge-synthesizer-lv2/work/.build
===========================================================================
=======================<phase: build          >============================
===>  Building for surge-synthesizer-lv2-1.8.1
[1/330] cd /wrkdirs/usr/ports/audio/surge-synthesizer-lv2/work/surge-release_1.8.1 && /usr/local/bin/cmake -D PROJECT_VERSION_MAJOR=1 -D PROJECT_VERSION_MINOR=8 -D SURGESRC=/wrkdirs/usr/ports/audio/surge-synthesizer-lv2/work/surge-release_1.8.1 -D SURGEBLD=/wrkdirs/usr/ports/audio/surge-synthesizer-lv2/work/.build -D AZURE_PIPELINE= -D WIN32= -P /wrkdirs/usr/ports/audio/surge-synthesizer-lv2/work/surge-release_1.8.1/cmake/versiontools.cmake
CMake Warning at cmake/versiontools.cmake:38 (message):
  Could not determine Git branch, using placeholder.


CMake Warning at cmake/versiontools.cmake:42 (message):
  Could not determine Git commit hash, using placeholder.


-- Setting up surge version
--   git hash is git-no-commit and branch is git-no-branch
--   buildhost is 130arm64-quarterly-job-06
--   buildarch is arm64
-- Developer Local Build
-- Using SURGE_VERSION=1.8.git-no-branch.git-no-commit
-- Configuring /wrkdirs/usr/ports/audio/surge-synthesizer-lv2/work/.build/geninclude/version.cpp
[2/330] /usr/bin/c++ -DAudioEffectX=AirWinBaseClass -DVstPlugCategory=long -D_USE_MATH_DEFINES -I/wrkdirs/usr/ports/audio/surge-synthesizer-lv2/work/surge-release_1.8.1/libs/airwindows/include -O2 -pipe -fstack-protector-strong -isystem /usr/local/include -fno-strict-aliasing  -I/usr/local/include/midifile -isystem /usr/local/include -O2 -pipe -fstack-protector-strong -isystem /usr/local/include -fno-strict-aliasing  -I/usr/local/include/midifile -isystem /usr/local/include -fPIC -Wno-multichar -fvisibility=hidden -fvisibility-inlines-hidden -Werror -Wno-deprecated-declarations -Werror=inconsistent-missing-override -Werror=logical-op-parentheses -Werror=dynamic-class-memaccess -Werror=undefined-bool-conversion -Werror=bitwise-op-parentheses -Werror=pointer-bool-conversion -std=c++17 -MD -MT libs/airwindows/CMakeFiles/airwindows.dir/src/ADClip7.cpp.o -MF libs/airwindows/CMakeFiles/airwindows.dir/src/ADClip7.cpp.o.d -o libs/airwindows/CMakeFiles/airwindows.dir/src/ADClip7.cpp.o -c /wrk
 dirs/usr/ports/audio/surge-synthesizer-lv2/work/surge-release_1.8.1/libs/airwindows/src/ADClip7.cpp
[3/330] /usr/bin/c++ -DBUILD_IS_RELEASE=1 -DLIBMIDIFILE=1 -DLINUX=1 -DTARGET_HEADLESS=1 -DTIXML_USE_STL -I/wrkdirs/usr/ports/audio/surge-synthesizer-lv2/work/surge-release_1.8.1/libs -I/wrkdirs/usr/ports/audio/surge-synthesizer-lv2/work/surge-release_1.8.1/libs/strnatcmp -I/wrkdirs/usr/ports/audio/surge-synthesizer-lv2/work/surge-release_1.8.1/libs/tuning-library/include -I/wrkdirs/usr/ports/audio/surge-synthesizer-lv2/work/surge-release_1.8.1/src/common -I/wrkdirs/usr/ports/audio/surge-synthesizer-lv2/work/surge-release_1.8.1/src/common/dsp -I/wrkdirs/usr/ports/audio/surge-synthesizer-lv2/work/surge-release_1.8.1/src/common/thread -I/wrkdirs/usr/ports/audio/surge-synthesizer-lv2/work/surge-release_1.8.1/src/common/vt_dsp -I/wrkdirs/usr/ports/audio/surge-synthesizer-lv2/work/surge-release_1.8.1/src/linux -I/usr/local/include/cairo -I/usr/local/include/glib-2.0 -I/usr/local/lib/glib-2.0/include -I/usr/local/include/pixman-1 -I/usr/local/include/freetype2 -I/usr/local/include/libdrm -I
 /usr/local/include/libpng16 -Ilintemp -I/wrkdirs/usr/ports/audio/surge-synthesizer-lv2/work/surge-release_1.8.1/src/headless -I/wrkdirs/usr/ports/audio/surge-synthesizer-lv2/work/surge-release_1.8.1/libs/airwindows/include -Ilibs/filesystem/include -I/wrkdirs/usr/ports/audio/surge-synthesizer-lv2/work/surge-release_1.8.1/libs/tinyxml/include -I/wrkdirs/usr/ports/audio/surge-synthesizer-lv2/work/surge-release_1.8.1/libs/catch2/include -O2 -pipe -fstack-protector-strong -isystem /usr/local/include -fno-strict-aliasing  -I/usr/local/include/midifile -isystem /usr/local/include -O2 -pipe -fstack-protector-strong -isystem /usr/local/include -fno-strict-aliasing  -I/usr/local/include/midifile -isystem /usr/local/include -fPIE -Wno-multichar -fvisibility=hidden -fvisibility-inlines-hidden -Werror -Wno-deprecated-declarations -Werror=inconsistent-missing-override -Werror=logical-op-parentheses -Werror=dynamic-class-memaccess -Werror=undefined-bool-conversion -Werror=bitwise-op-parentheses -
 Werror=pointer-bool-conversion -pthread -std!
 =c++17 -MD -MT CMakeFiles/surge-headless.dir/src/common/SurgeSynthesizer.cpp.o -MF CMakeFiles/surge-headless.dir/src/common/SurgeSynthesizer.cpp.o.d -o CMakeFiles/surge-headless.dir/src/common/SurgeSynthesizer.cpp.o -c /wrkdirs/usr/ports/audio/surge-synthesizer-lv2/work/surge-release_1.8.1/src/common/SurgeSynthesizer.cpp
FAILED: CMakeFiles/surge-headless.dir/src/common/SurgeSynthesizer.cpp.o 
/usr/bin/c++ -DBUILD_IS_RELEASE=1 -DLIBMIDIFILE=1 -DLINUX=1 -DTARGET_HEADLESS=1 -DTIXML_USE_STL -I/wrkdirs/usr/ports/audio/surge-synthesizer-lv2/work/surge-release_1.8.1/libs -I/wrkdirs/usr/ports/audio/surge-synthesizer-lv2/work/surge-release_1.8.1/libs/strnatcmp -I/wrkdirs/usr/ports/audio/surge-synthesizer-lv2/work/surge-release_1.8.1/libs/tuning-library/include -I/wrkdirs/usr/ports/audio/surge-synthesizer-lv2/work/surge-release_1.8.1/src/common -I/wrkdirs/usr/ports/audio/surge-synthesizer-lv2/work/surge-release_1.8.1/src/common/dsp -I/wrkdirs/usr/ports/audio/surge-synthesizer-lv2/work/surge-release_1.8.1/src/common/thread -I/wrkdirs/usr/ports/audio/surge-synthesizer-lv2/work/surge-release_1.8.1/src/common/vt_dsp -I/wrkdirs/usr/ports/audio/surge-synthesizer-lv2/work/surge-release_1.8.1/src/linux -I/usr/local/include/cairo -I/usr/local/include/glib-2.0 -I/usr/local/lib/glib-2.0/include -I/usr/local/include/pixman-1 -I/usr/local/include/freetype2 -I/usr/local/include/libdrm -I/usr/loc
 al/include/libpng16 -Ilintemp -I/wrkdirs/usr/ports/audio/surge-synthesizer-lv2/work/surge-release_1.8.1/src/headless -I/wrkdirs/usr/ports/audio/surge-synthesizer-lv2/work/surge-release_1.8.1/libs/airwindows/include -Ilibs/filesystem/include -I/wrkdirs/usr/ports/audio/surge-synthesizer-lv2/work/surge-release_1.8.1/libs/tinyxml/include -I/wrkdirs/usr/ports/audio/surge-synthesizer-lv2/work/surge-release_1.8.1/libs/catch2/include -O2 -pipe -fstack-protector-strong -isystem /usr/local/include -fno-strict-aliasing  -I/usr/local/include/midifile -isystem /usr/local/include -O2 -pipe -fstack-protector-strong -isystem /usr/local/include -fno-strict-aliasing  -I/usr/local/include/midifile -isystem /usr/local/include -fPIE -Wno-multichar -fvisibility=hidden -fvisibility-inlines-hidden -Werror -Wno-deprecated-declarations -Werror=inconsistent-missing-override -Werror=logical-op-parentheses -Werror=dynamic-class-memaccess -Werror=undefined-bool-conversion -Werror=bitwise-op-parentheses -Werror=p
 ointer-bool-conversion -pthread -std=c++17 -!
 MD -MT CMakeFiles/surge-headless.dir/src/common/SurgeSynthesizer.cpp.o -MF CMakeFiles/surge-headless.dir/src/common/SurgeSynthesizer.cpp.o.d -o CMakeFiles/surge-headless.dir/src/common/SurgeSynthesizer.cpp.o -c /wrkdirs/usr/ports/audio/surge-synthesizer-lv2/work/surge-release_1.8.1/src/common/SurgeSynthesizer.cpp
In file included from /wrkdirs/usr/ports/audio/surge-synthesizer-lv2/work/surge-release_1.8.1/src/common/SurgeSynthesizer.cpp:16:
In file included from /wrkdirs/usr/ports/audio/surge-synthesizer-lv2/work/surge-release_1.8.1/src/common/SurgeSynthesizer.h:17:
In file included from /wrkdirs/usr/ports/audio/surge-synthesizer-lv2/work/surge-release_1.8.1/src/common/SurgeStorage.h:17:
In file included from /wrkdirs/usr/ports/audio/surge-synthesizer-lv2/work/surge-release_1.8.1/src/common/globals.h:37:
In file included from /usr/lib/clang/11.0.1/include/xmmintrin.h:13:
/usr/lib/clang/11.0.1/include/mmintrin.h:33:5: error: use of undeclared identifier '__builtin_ia32_emms'; did you mean '__builtin_isless'?
    __builtin_ia32_emms();
    ^
/usr/include/c++/v1/math.h:649:12: note: '__builtin_isless' declared here
    return isless(__lcpp_x, __lcpp_y);
           ^
/usr/include/math.h:120:23: note: expanded from macro 'isless'
#define isless(x, y)            __builtin_isless((x), (y))
                                ^
In file included from /wrkdirs/usr/ports/audio/surge-synthesizer-lv2/work/surge-release_1.8.1/src/common/SurgeSynthesizer.cpp:16:
In file included from /wrkdirs/usr/ports/audio/surge-synthesizer-lv2/work/surge-release_1.8.1/src/common/SurgeSynthesizer.h:17:
In file included from /wrkdirs/usr/ports/audio/surge-synthesizer-lv2/work/surge-release_1.8.1/src/common/SurgeStorage.h:17:
In file included from /wrkdirs/usr/ports/audio/surge-synthesizer-lv2/work/surge-release_1.8.1/src/common/globals.h:37:
In file included from /usr/lib/clang/11.0.1/include/xmmintrin.h:13:
/usr/lib/clang/11.0.1/include/mmintrin.h:33:25: error: too few arguments to function call, expected 2, have 0
    __builtin_ia32_emms();
                        ^
/usr/lib/clang/11.0.1/include/mmintrin.h:50:19: error: use of undeclared identifier '__builtin_ia32_vec_init_v2si'
    return (__m64)__builtin_ia32_vec_init_v2si(__i, 0);
                  ^
/usr/lib/clang/11.0.1/include/mmintrin.h:67:12: error: use of undeclared identifier '__builtin_ia32_vec_ext_v2si'
    return __builtin_ia32_vec_ext_v2si((__v2si)__m, 0);
           ^
/usr/lib/clang/11.0.1/include/mmintrin.h:129:19: error: use of undeclared identifier '__builtin_ia32_packsswb'
    return (__m64)__builtin_ia32_packsswb((__v4hi)__m1, (__v4hi)__m2);
                  ^
/usr/lib/clang/11.0.1/include/mmintrin.h:159:19: error: use of undeclared identifier '__builtin_ia32_packssdw'
    return (__m64)__builtin_ia32_packssdw((__v2si)__m1, (__v2si)__m2);
                  ^
/usr/lib/clang/11.0.1/include/mmintrin.h:189:19: error: use of undeclared identifier '__builtin_ia32_packuswb'
    return (__m64)__builtin_ia32_packuswb((__v4hi)__m1, (__v4hi)__m2);
                  ^
/usr/lib/clang/11.0.1/include/mmintrin.h:216:19: error: use of undeclared identifier '__builtin_ia32_punpckhbw'
    return (__m64)__builtin_ia32_punpckhbw((__v8qi)__m1, (__v8qi)__m2);
                  ^
/usr/lib/clang/11.0.1/include/mmintrin.h:239:19: error: use of undeclared identifier '__builtin_ia32_punpckhwd'
    return (__m64)__builtin_ia32_punpckhwd((__v4hi)__m1, (__v4hi)__m2);
                  ^
/usr/lib/clang/11.0.1/include/mmintrin.h:260:19: error: use of undeclared identifier '__builtin_ia32_punpckhdq'
    return (__m64)__builtin_ia32_punpckhdq((__v2si)__m1, (__v2si)__m2);
                  ^
/usr/lib/clang/11.0.1/include/mmintrin.h:287:19: error: use of undeclared identifier '__builtin_ia32_punpcklbw'
    return (__m64)__builtin_ia32_punpcklbw((__v8qi)__m1, (__v8qi)__m2);
                  ^
/usr/lib/clang/11.0.1/include/mmintrin.h:310:19: error: use of undeclared identifier '__builtin_ia32_punpcklwd'
    return (__m64)__builtin_ia32_punpcklwd((__v4hi)__m1, (__v4hi)__m2);
                  ^
/usr/lib/clang/11.0.1/include/mmintrin.h:331:19: error: use of undeclared identifier '__builtin_ia32_punpckldq'
    return (__m64)__builtin_ia32_punpckldq((__v2si)__m1, (__v2si)__m2);
                  ^
/usr/lib/clang/11.0.1/include/mmintrin.h:352:19: error: use of undeclared identifier '__builtin_ia32_paddb'; did you mean '__builtin_arm_addg'?
    return (__m64)__builtin_ia32_paddb((__v8qi)__m1, (__v8qi)__m2);
                  ^
/usr/lib/clang/11.0.1/include/mmintrin.h:352:19: note: '__builtin_arm_addg' declared here
/usr/lib/clang/11.0.1/include/mmintrin.h:352:19: error: first argument of MTE builtin function must be a pointer ('__v8qi' (vector of 8 'char' values) invalid)
    return (__m64)__builtin_ia32_paddb((__v8qi)__m1, (__v8qi)__m2);
                  ^                    ~~~~~~~~~~~~
/usr/lib/clang/11.0.1/include/mmintrin.h:373:19: error: use of undeclared identifier '__builtin_ia32_paddw'; did you mean '__builtin_arm_addg'?
    return (__m64)__builtin_ia32_paddw((__v4hi)__m1, (__v4hi)__m2);
                  ^
/usr/lib/clang/11.0.1/include/mmintrin.h:352:19: note: '__builtin_arm_addg' declared here
    return (__m64)__builtin_ia32_paddb((__v8qi)__m1, (__v8qi)__m2);
                  ^
/usr/lib/clang/11.0.1/include/mmintrin.h:373:19: error: first argument of MTE builtin function must be a pointer ('__v4hi' (vector of 4 'short' values) invalid)
    return (__m64)__builtin_ia32_paddw((__v4hi)__m1, (__v4hi)__m2);
                  ^                    ~~~~~~~~~~~~
/usr/lib/clang/11.0.1/include/mmintrin.h:394:19: error: use of undeclared identifier '__builtin_ia32_paddd'; did you mean '__builtin_arm_addg'?
    return (__m64)__builtin_ia32_paddd((__v2si)__m1, (__v2si)__m2);
                  ^
/usr/lib/clang/11.0.1/include/mmintrin.h:352:19: note: '__builtin_arm_addg' declared here
    return (__m64)__builtin_ia32_paddb((__v8qi)__m1, (__v8qi)__m2);
                  ^
/usr/lib/clang/11.0.1/include/mmintrin.h:394:19: error: first argument of MTE builtin function must be a pointer ('__v2si' (vector of 2 'int' values) invalid)
    return (__m64)__builtin_ia32_paddd((__v2si)__m1, (__v2si)__m2);
                  ^                    ~~~~~~~~~~~~
fatal error: too many errors emitted, stopping now [-ferror-limit=]
20 errors generated.
[4/330] /usr/bin/c++ -DBUILD_IS_RELEASE=1 -DLIBMIDIFILE=1 -DLINUX=1 -DTARGET_HEADLESS=1 -DTIXML_USE_STL -I/wrkdirs/usr/ports/audio/surge-synthesizer-lv2/work/surge-release_1.8.1/libs -I/wrkdirs/usr/ports/audio/surge-synthesizer-lv2/work/surge-release_1.8.1/libs/strnatcmp -I/wrkdirs/usr/ports/audio/surge-synthesizer-lv2/work/surge-release_1.8.1/libs/tuning-library/include -I/wrkdirs/usr/ports/audio/surge-synthesizer-lv2/work/surge-release_1.8.1/src/common -I/wrkdirs/usr/ports/audio/surge-synthesizer-lv2/work/surge-release_1.8.1/src/common/dsp -I/wrkdirs/usr/ports/audio/surge-synthesizer-lv2/work/surge-release_1.8.1/src/common/thread -I/wrkdirs/usr/ports/audio/surge-synthesizer-lv2/work/surge-release_1.8.1/src/common/vt_dsp -I/wrkdirs/usr/ports/audio/surge-synthesizer-lv2/work/surge-release_1.8.1/src/linux -I/usr/local/include/cairo -I/usr/local/include/glib-2.0 -I/usr/local/lib/glib-2.0/include -I/usr/local/include/pixman-1 -I/usr/local/include/freetype2 -I/usr/local/include/libdrm -I
 /usr/local/include/libpng16 -Ilintemp -I/wrkdirs/usr/ports/audio/surge-synthesizer-lv2/work/surge-release_1.8.1/src/headless -I/wrkdirs/usr/ports/audio/surge-synthesizer-lv2/work/surge-release_1.8.1/libs/airwindows/include -Ilibs/filesystem/include -I/wrkdirs/usr/ports/audio/surge-synthesizer-lv2/work/surge-release_1.8.1/libs/tinyxml/include -I/wrkdirs/usr/ports/audio/surge-synthesizer-lv2/work/surge-release_1.8.1/libs/catch2/include -O2 -pipe -fstack-protector-strong -isystem /usr/local/include -fno-strict-aliasing  -I/usr/local/include/midifile -isystem /usr/local/include -O2 -pipe -fstack-protector-strong -isystem /usr/local/include -fno-strict-aliasing  -I/usr/local/include/midifile -isystem /usr/local/include -fPIE -Wno-multichar -fvisibility=hidden -fvisibility-inlines-hidden -Werror -Wno-deprecated-declarations -Werror=inconsistent-missing-override -Werror=logical-op-parentheses -Werror=dynamic-class-memaccess -Werror=undefined-bool-conversion -Werror=bitwise-op-parentheses -
 Werror=pointer-bool-conversion -pthread -std!
 =c++17 -MD -MT CMakeFiles/surge-headless.dir/src/common/SurgeSynthesizerIDManagement.cpp.o -MF CMakeFiles/surge-headless.dir/src/common/SurgeSynthesizerIDManagement.cpp.o.d -o CMakeFiles/surge-headless.dir/src/common/SurgeSynthesizerIDManagement.cpp.o -c /wrkdirs/usr/ports/audio/surge-synthesizer-lv2/work/surge-release_1.8.1/src/common/SurgeSynthesizerIDManagement.cpp
FAILED: CMakeFiles/surge-headless.dir/src/common/SurgeSynthesizerIDManagement.cpp.o 
/usr/bin/c++ -DBUILD_IS_RELEASE=1 -DLIBMIDIFILE=1 -DLINUX=1 -DTARGET_HEADLESS=1 -DTIXML_USE_STL -I/wrkdirs/usr/ports/audio/surge-synthesizer-lv2/work/surge-release_1.8.1/libs -I/wrkdirs/usr/ports/audio/surge-synthesizer-lv2/work/surge-release_1.8.1/libs/strnatcmp -I/wrkdirs/usr/ports/audio/surge-synthesizer-lv2/work/surge-release_1.8.1/libs/tuning-library/include -I/wrkdirs/usr/ports/audio/surge-synthesizer-lv2/work/surge-release_1.8.1/src/common -I/wrkdirs/usr/ports/audio/surge-synthesizer-lv2/work/surge-release_1.8.1/src/common/dsp -I/wrkdirs/usr/ports/audio/surge-synthesizer-lv2/work/surge-release_1.8.1/src/common/thread -I/wrkdirs/usr/ports/audio/surge-synthesizer-lv2/work/surge-release_1.8.1/src/common/vt_dsp -I/wrkdirs/usr/ports/audio/surge-synthesizer-lv2/work/surge-release_1.8.1/src/linux -I/usr/local/include/cairo -I/usr/local/include/glib-2.0 -I/usr/local/lib/glib-2.0/include -I/usr/local/include/pixman-1 -I/usr/local/include/freetype2 -I/usr/local/include/libdrm -I/usr/loc
 al/include/libpng16 -Ilintemp -I/wrkdirs/usr/ports/audio/surge-synthesizer-lv2/work/surge-release_1.8.1/src/headless -I/wrkdirs/usr/ports/audio/surge-synthesizer-lv2/work/surge-release_1.8.1/libs/airwindows/include -Ilibs/filesystem/include -I/wrkdirs/usr/ports/audio/surge-synthesizer-lv2/work/surge-release_1.8.1/libs/tinyxml/include -I/wrkdirs/usr/ports/audio/surge-synthesizer-lv2/work/surge-release_1.8.1/libs/catch2/include -O2 -pipe -fstack-protector-strong -isystem /usr/local/include -fno-strict-aliasing  -I/usr/local/include/midifile -isystem /usr/local/include -O2 -pipe -fstack-protector-strong -isystem /usr/local/include -fno-strict-aliasing  -I/usr/local/include/midifile -isystem /usr/local/include -fPIE -Wno-multichar -fvisibility=hidden -fvisibility-inlines-hidden -Werror -Wno-deprecated-declarations -Werror=inconsistent-missing-override -Werror=logical-op-parentheses -Werror=dynamic-class-memaccess -Werror=undefined-bool-conversion -Werror=bitwise-op-parentheses -Werror=p
 ointer-bool-conversion -pthread -std=c++17 -!
 MD -MT CMakeFiles/surge-headless.dir/src/common/SurgeSynthesizerIDManagement.cpp.o -MF CMakeFiles/surge-headless.dir/src/common/SurgeSynthesizerIDManagement.cpp.o.d -o CMakeFiles/surge-headless.dir/src/common/SurgeSynthesizerIDManagement.cpp.o -c /wrkdirs/usr/ports/audio/surge-synthesizer-lv2/work/surge-release_1.8.1/src/common/SurgeSynthesizerIDManagement.cpp
In file included from /wrkdirs/usr/ports/audio/surge-synthesizer-lv2/work/surge-release_1.8.1/src/common/SurgeSynthesizerIDManagement.cpp:95:
In file included from /wrkdirs/usr/ports/audio/surge-synthesizer-lv2/work/surge-release_1.8.1/src/common/SurgeSynthesizer.h:17:
In file included from /wrkdirs/usr/ports/audio/surge-synthesizer-lv2/work/surge-release_1.8.1/src/common/SurgeStorage.h:17:
In file included from /wrkdirs/usr/ports/audio/surge-synthesizer-lv2/work/surge-release_1.8.1/src/common/globals.h:37:
In file included from /usr/lib/clang/11.0.1/include/xmmintrin.h:13:
/usr/lib/clang/11.0.1/include/mmintrin.h:33:5: error: use of undeclared identifier '__builtin_ia32_emms'; did you mean '__builtin_isless'?
    __builtin_ia32_emms();
    ^
/usr/include/c++/v1/math.h:649:12: note: '__builtin_isless' declared here
    return isless(__lcpp_x, __lcpp_y);
           ^
/usr/include/math.h:120:23: note: expanded from macro 'isless'
#define isless(x, y)            __builtin_isless((x), (y))
                                ^
In file included from /wrkdirs/usr/ports/audio/surge-synthesizer-lv2/work/surge-release_1.8.1/src/common/SurgeSynthesizerIDManagement.cpp:95:
In file included from /wrkdirs/usr/ports/audio/surge-synthesizer-lv2/work/surge-release_1.8.1/src/common/SurgeSynthesizer.h:17:
In file included from /wrkdirs/usr/ports/audio/surge-synthesizer-lv2/work/surge-release_1.8.1/src/common/SurgeStorage.h:17:
In file included from /wrkdirs/usr/ports/audio/surge-synthesizer-lv2/work/surge-release_1.8.1/src/common/globals.h:37:
In file included from /usr/lib/clang/11.0.1/include/xmmintrin.h:13:
/usr/lib/clang/11.0.1/include/mmintrin.h:33:25: error: too few arguments to function call, expected 2, have 0
    __builtin_ia32_emms();
                        ^
/usr/lib/clang/11.0.1/include/mmintrin.h:50:19: error: use of undeclared identifier '__builtin_ia32_vec_init_v2si'
    return (__m64)__builtin_ia32_vec_init_v2si(__i, 0);
                  ^
/usr/lib/clang/11.0.1/include/mmintrin.h:67:12: error: use of undeclared identifier '__builtin_ia32_vec_ext_v2si'
    return __builtin_ia32_vec_ext_v2si((__v2si)__m, 0);
           ^
/usr/lib/clang/11.0.1/include/mmintrin.h:129:19: error: use of undeclared identifier '__builtin_ia32_packsswb'
    return (__m64)__builtin_ia32_packsswb((__v4hi)__m1, (__v4hi)__m2);
                  ^
/usr/lib/clang/11.0.1/include/mmintrin.h:159:19: error: use of undeclared identifier '__builtin_ia32_packssdw'
    return (__m64)__builtin_ia32_packssdw((__v2si)__m1, (__v2si)__m2);
                  ^
/usr/lib/clang/11.0.1/include/mmintrin.h:189:19: error: use of undeclared identifier '__builtin_ia32_packuswb'
    return (__m64)__builtin_ia32_packuswb((__v4hi)__m1, (__v4hi)__m2);
                  ^
/usr/lib/clang/11.0.1/include/mmintrin.h:216:19: error: use of undeclared identifier '__builtin_ia32_punpckhbw'
    return (__m64)__builtin_ia32_punpckhbw((__v8qi)__m1, (__v8qi)__m2);
                  ^
/usr/lib/clang/11.0.1/include/mmintrin.h:239:19: error: use of undeclared identifier '__builtin_ia32_punpckhwd'
    return (__m64)__builtin_ia32_punpckhwd((__v4hi)__m1, (__v4hi)__m2);
                  ^
/usr/lib/clang/11.0.1/include/mmintrin.h:260:19: error: use of undeclared identifier '__builtin_ia32_punpckhdq'
    return (__m64)__builtin_ia32_punpckhdq((__v2si)__m1, (__v2si)__m2);
                  ^
/usr/lib/clang/11.0.1/include/mmintrin.h:287:19: error: use of undeclared identifier '__builtin_ia32_punpcklbw'
    return (__m64)__builtin_ia32_punpcklbw((__v8qi)__m1, (__v8qi)__m2);
                  ^
/usr/lib/clang/11.0.1/include/mmintrin.h:310:19: error: use of undeclared identifier '__builtin_ia32_punpcklwd'
    return (__m64)__builtin_ia32_punpcklwd((__v4hi)__m1, (__v4hi)__m2);
                  ^
/usr/lib/clang/11.0.1/include/mmintrin.h:331:19: error: use of undeclared identifier '__builtin_ia32_punpckldq'
    return (__m64)__builtin_ia32_punpckldq((__v2si)__m1, (__v2si)__m2);
                  ^
/usr/lib/clang/11.0.1/include/mmintrin.h:352:19: error: use of undeclared identifier '__builtin_ia32_paddb'; did you mean '__builtin_arm_addg'?
    return (__m64)__builtin_ia32_paddb((__v8qi)__m1, (__v8qi)__m2);
                  ^
/usr/lib/clang/11.0.1/include/mmintrin.h:352:19: note: '__builtin_arm_addg' declared here
/usr/lib/clang/11.0.1/include/mmintrin.h:352:19: error: first argument of MTE builtin function must be a pointer ('__v8qi' (vector of 8 'char' values) invalid)
    return (__m64)__builtin_ia32_paddb((__v8qi)__m1, (__v8qi)__m2);
                  ^                    ~~~~~~~~~~~~
/usr/lib/clang/11.0.1/include/mmintrin.h:373:19: error: use of undeclared identifier '__builtin_ia32_paddw'; did you mean '__builtin_arm_addg'?
    return (__m64)__builtin_ia32_paddw((__v4hi)__m1, (__v4hi)__m2);
                  ^
/usr/lib/clang/11.0.1/include/mmintrin.h:352:19: note: '__builtin_arm_addg' declared here
    return (__m64)__builtin_ia32_paddb((__v8qi)__m1, (__v8qi)__m2);
                  ^
/usr/lib/clang/11.0.1/include/mmintrin.h:373:19: error: first argument of MTE builtin function must be a pointer ('__v4hi' (vector of 4 'short' values) invalid)
    return (__m64)__builtin_ia32_paddw((__v4hi)__m1, (__v4hi)__m2);
                  ^                    ~~~~~~~~~~~~
/usr/lib/clang/11.0.1/include/mmintrin.h:394:19: error: use of undeclared identifier '__builtin_ia32_paddd'; did you mean '__builtin_arm_addg'?
    return (__m64)__builtin_ia32_paddd((__v2si)__m1, (__v2si)__m2);
                  ^
/usr/lib/clang/11.0.1/include/mmintrin.h:352:19: note: '__builtin_arm_addg' declared here
    return (__m64)__builtin_ia32_paddb((__v8qi)__m1, (__v8qi)__m2);
                  ^
/usr/lib/clang/11.0.1/include/mmintrin.h:394:19: error: first argument of MTE builtin function must be a pointer ('__v2si' (vector of 2 'int' values) invalid)
    return (__m64)__builtin_ia32_paddd((__v2si)__m1, (__v2si)__m2);
                  ^                    ~~~~~~~~~~~~
fatal error: too many errors emitted, stopping now [-ferror-limit=]
20 errors generated.
ninja: build stopped: subcommand failed.
===> Compilation failed unexpectedly.
Try to set MAKE_JOBS_UNSAFE=yes and rebuild before reporting the failure to
the maintainer.
*** Error code 1

Stop.
make: stopped in /usr/ports/audio/surge-synthesizer-lv2
Received on Wed Jun 23 2021 - 14:52:12 UTC

Original text of this message