[package - 122powerpc64-quarterly][sysutils/rsyncrypto] Failed for rsyncrypto-1.14 in build

From: <pkg-fallout_at_FreeBSD.org>
Date: Tue, 22 Jun 2021 04:15:22 GMT
You are receiving this mail as a port that you maintain
is failing to build on the FreeBSD package build server.
Please investigate the failure and submit a PR to fix
build.

Maintainer:     linpct_at_gmail.com
Log URL:        http://foul1.nyi.freebsd.org/data/122powerpc64-quarterly/dbe1c4c35016/logs/rsyncrypto-1.14.log
Build URL:      http://foul1.nyi.freebsd.org/build.html?mastername=122powerpc64-quarterly&build=dbe1c4c35016
Log:

=>> Building sysutils/rsyncrypto
build started at Tue Jun 22 04:14:30 UTC 2021
port directory: /usr/ports/sysutils/rsyncrypto
package name: rsyncrypto-1.14
building for: FreeBSD 122powerpc64-quarterly-job-05 12.2-RELEASE FreeBSD 12.2-RELEASE powerpc
maintained by: linpct_at_gmail.com
Makefile ident: 
Poudriere version: 3.2.8-8-gaf08dbda
Host OSVERSION: 1400008
Jail OSVERSION: 1202000
Job Id: 05

---Begin Environment---
SHELL=/bin/csh
OSVERSION=1202000
UNAME_v=FreeBSD 12.2-RELEASE
UNAME_r=12.2-RELEASE
BLOCKSIZE=K
MAIL=/var/mail/root
STATUS=1
HOME=/root
PATH=/sbin:/bin:/usr/sbin:/usr/bin:/usr/local/sbin:/usr/local/bin:/root/bin
LOCALBASE=/usr/local
USER=root
LIBEXECPREFIX=/usr/local/libexec/poudriere
POUDRIERE_VERSION=3.2.8-8-gaf08dbda
MASTERMNT=/usr/local/poudriere/data/.m/122powerpc64-quarterly/ref
POUDRIERE_BUILD_TYPE=bulk
PACKAGE_BUILDING=yes
SAVED_TERM=
PWD=/usr/local/poudriere/data/.m/122powerpc64-quarterly/ref/.p/pool
P_PORTS_FEATURES=FLAVORS SELECTED_OPTIONS
MASTERNAME=122powerpc64-quarterly
SCRIPTPREFIX=/usr/local/share/poudriere
OLDPWD=/usr/local/poudriere/data/.m/122powerpc64-quarterly/ref/.p
SCRIPTPATH=/usr/local/share/poudriere/bulk.sh
POUDRIEREPATH=/usr/local/bin/poudriere
---End Environment---

---Begin Poudriere Port Flags/Env---
PORT_FLAGS=
PKGENV=
FLAVOR=
DEPENDS_ARGS=
MAKE_ARGS=
---End Poudriere Port Flags/Env---

---Begin OPTIONS List---
===> The following configuration options are available for rsyncrypto-1.14:
     DOCS=on: Build and/or install documentation
===> Use 'make config' to modify these settings
---End OPTIONS List---

--MAINTAINER--
linpct_at_gmail.com
--End MAINTAINER--

--CONFIGURE_ARGS--
--prefix=/usr/local ${_LATE_CONFIGURE_ARGS}
--End CONFIGURE_ARGS--

--CONFIGURE_ENV--
MAKE=gmake XDG_DATA_HOME=/wrkdirs/usr/ports/sysutils/rsyncrypto/work  XDG_CONFIG_HOME=/wrkdirs/usr/ports/sysutils/rsyncrypto/work  HOME=/wrkdirs/usr/ports/sysutils/rsyncrypto/work TMPDIR="/tmp" PATH=/wrkdirs/usr/ports/sysutils/rsyncrypto/work/.bin:/sbin:/bin:/usr/sbin:/usr/bin:/usr/local/sbin:/usr/local/bin:/root/bin SHELL=/bin/sh CONFIG_SHELL=/bin/sh ADDR2LINE="/usr/local/bin/addr2line" AR="/usr/local/bin/ar" AS="/usr/local/bin/as" CPPFILT="/usr/local/bin/c++filt" GPROF="/usr/local/bin/gprof" LD="/usr/local/bin/ld" NM="/usr/local/bin/nm" OBJCOPY="/usr/local/bin/objcopy" OBJDUMP="/usr/local/bin/objdump" RANLIB="/usr/local/bin/ranlib" READELF="/usr/local/bin/readelf" SIZE="/usr/local/bin/size" STRINGS="/usr/local/bin/strings" CMAKE_PREFIX_PATH="/usr/local" CONFIG_SITE=/usr/ports/Templates/config.site lt_cv_sys_max_cmd_len=524288
--End CONFIGURE_ENV--

--MAKE_ENV--
OPENSSLBASE=/usr OPENSSLDIR=/etc/ssl OPENSSLINC=/usr/include OPENSSLLIB=/usr/lib XDG_DATA_HOME=/wrkdirs/usr/ports/sysutils/rsyncrypto/work  XDG_CONFIG_HOME=/wrkdirs/usr/ports/sysutils/rsyncrypto/work  HOME=/wrkdirs/usr/ports/sysutils/rsyncrypto/work TMPDIR="/tmp" PATH=/wrkdirs/usr/ports/sysutils/rsyncrypto/work/.bin:/sbin:/bin:/usr/sbin:/usr/bin:/usr/local/sbin:/usr/local/bin:/root/bin NO_PIE=yes MK_DEBUG_FILES=no MK_KERNEL_SYMBOLS=no SHELL=/bin/sh NO_LINT=YES ADDR2LINE="/usr/local/bin/addr2line" AR="/usr/local/bin/ar" AS="/usr/local/bin/as" CPPFILT="/usr/local/bin/c++filt" GPROF="/usr/local/bin/gprof" LD="/usr/local/bin/ld" NM="/usr/local/bin/nm" OBJCOPY="/usr/local/bin/objcopy" OBJDUMP="/usr/local/bin/objdump" RANLIB="/usr/local/bin/ranlib" READELF="/usr/local/bin/readelf" SIZE="/usr/local/bin/size" STRINGS="/usr/local/bin/strings" PREFIX=/usr/local  LOCALBASE=/usr/local  CC="gcc10" CFLAGS="-O2 -pipe  -fstack-protector-strong -Wl,-rpath=/usr/local/lib/gcc10 -isystem /usr/local/incl
 ude -fno-strict-aliasing "  CPP="cpp10" CPPFLAGS="-isystem /usr/local/include"  LDFLAGS="  -fstack-protector-strong -Wl,-rpath=/usr/local/lib/gcc10 -L/usr/local/lib/gcc10 " LIBS="-L/usr/local/lib"  CXX="g++10" CXXFLAGS="-O2 -pipe  -fstack-protector-strong -Wl,-rpath=/usr/local/lib/gcc10  -Wl,-rpath=/usr/local/lib/gcc10 -isystem /usr/local/include "  MANPREFIX="/usr/local" BSD_INSTALL_PROGRAM="install  -s -m 555"  BSD_INSTALL_LIB="install  -s -m 0644"  BSD_INSTALL_SCRIPT="install  -m 555"  BSD_INSTALL_DATA="install  -m 0644"  BSD_INSTALL_MAN="install  -m 444"
--End MAKE_ENV--

--PLIST_SUB--
PORTDOCS="" OSREL=12.2 PREFIX=%D LOCALBASE=/usr/local  RESETPREFIX=/usr/local LIB32DIR=lib DOCSDIR="share/doc/rsyncrypto"  EXAMPLESDIR="share/examples/rsyncrypto"  DATADIR="share/rsyncrypto"  WWWDIR="www/rsyncrypto"  ETCDIR="etc/rsyncrypto"
--End PLIST_SUB--

--SUB_LIST--
PREFIX=/usr/local LOCALBASE=/usr/local  DATADIR=/usr/local/share/rsyncrypto DOCSDIR=/usr/local/share/doc/rsyncrypto EXAMPLESDIR=/usr/local/share/examples/rsyncrypto  WWWDIR=/usr/local/www/rsyncrypto ETCDIR=/usr/local/etc/rsyncrypto
--End SUB_LIST--

---Begin make.conf---
USE_PACKAGE_DEPENDS=yes
BATCH=yes
WRKDIRPREFIX=/wrkdirs
PORTSDIR=/usr/ports
PACKAGES=/packages
DISTDIR=/distfiles
PACKAGE_BUILDING=yes
PACKAGE_BUILDING_FLAVORS=yes
#### /usr/local/etc/poudriere.d/make.conf ####
# XXX: We really need this but cannot use it while 'make checksum' does not
# try the next mirror on checksum failure.  It currently retries the same
# failed mirror and then fails rather then trying another.  It *does*
# try the next if the size is mismatched though.
#MASTER_SITE_FREEBSD=yes
# Build ALLOW_MAKE_JOBS_PACKAGES with 2 jobs
MAKE_JOBS_NUMBER=2
#### /usr/ports/Mk/Scripts/ports_env.sh ####
_CCVERSION_921dbbb2=cc (GCC) 4.2.1 20070831 patched [FreeBSD] Copyright (C) 2007 Free Software Foundation, Inc. This is free software; see the source for copying conditions. There is NO warranty; not even for MERCHANTABILITY or FITNESS FOR A PARTICULAR PURPOSE.
_ALTCCVERSION_921dbbb2=none
_CXXINTERNAL_acaad9ca=Using built-in specs. Target: powerpc64-undermydesk-freebsd Configured with: FreeBSD/powerpc64 system compiler Thread model: posix gcc version 4.2.1 20070831 patched [FreeBSD] "/usr/bin/ld" "--eh-frame-hdr" "-Qy" "-melf64ppc_fbsd" "--enable-new-dtags" "-dynamic-linker" "/libexec/ld-elf.so.1" "/usr/lib/crt1.o" "/usr/lib/crti.o" "/usr/lib/crtbegin.o" "-L/usr/lib" "-L/usr/lib" "/dev/null" "-lstdc++" "-lm" "-lgcc_s" "-lgcc" "-lc" "-lgcc_s" "-lgcc" "/usr/lib/crtsavres.o" "/usr/lib/crtend.o" "/usr/lib/crtn.o"
CC_OUTPUT_921dbbb2_58173849=yes
CC_OUTPUT_921dbbb2_9bdba57c=yes
CC_OUTPUT_921dbbb2_6a4fe7f5=cc1: error: unrecognized command line option "-std=c11"
CC_OUTPUT_921dbbb2_6bcac02b=yes
CC_OUTPUT_921dbbb2_67d20829=yes
CC_OUTPUT_921dbbb2_bfa62e83=cc1: error: unrecognized command line option "-std=gnu11"
CC_OUTPUT_921dbbb2_f0b4d593=yes
CC_OUTPUT_921dbbb2_308abb44=cc1plus: error: unrecognized command line option "-std=c++0x"
CC_OUTPUT_921dbbb2_f00456e5=cc1plus: error: unrecognized command line option "-std=c++11"
CC_OUTPUT_921dbbb2_65ad290d=cc1plus: error: unrecognized command line option "-std=c++14"
CC_OUTPUT_921dbbb2_f2776b26=cc1plus: error: unrecognized command line option "-std=c++17"
CC_OUTPUT_921dbbb2_b2657cc3=yes
CC_OUTPUT_921dbbb2_380987f7=cc1plus: error: unrecognized command line option "-std=gnu++11"
CC_OUTPUT_921dbbb2_160933ec=cc1plus: error: unrecognized command line option "-std=gnu++14"
CC_OUTPUT_921dbbb2_fb62803b=cc1plus: error: unrecognized command line option "-std=gnu++17"
_OBJC_CCVERSION_921dbbb2=cc (GCC) 4.2.1 20070831 patched [FreeBSD] Copyright (C) 2007 Free Software Foundation, Inc. This is free software; see the source for copying conditions. There is NO warranty; not even for MERCHANTABILITY or FITNESS FOR A PARTICULAR PURPOSE.
_OBJC_ALTCCVERSION_921dbbb2=none
ARCH=powerpc64
PPC_ABI=ELFv1
OPSYS=FreeBSD
_OSRELEASE=12.2-RELEASE
OSREL=12.2
OSVERSION=1202000
PYTHONBASE=/usr/local
CONFIGURE_MAX_CMD_LEN=524288
HAVE_PORTS_ENV=1
#### Misc Poudriere ####
GID=0
UID=0
---End make.conf---
--Resource limits--
cpu time               (seconds, -t)  unlimited
file size           (512-blocks, -f)  unlimited
data seg size           (kbytes, -d)  33554432
stack size              (kbytes, -s)  524288
core file size      (512-blocks, -c)  unlimited
max memory size         (kbytes, -m)  unlimited
locked memory           (kbytes, -l)  unlimited
max user processes              (-u)  89999
open files                      (-n)  1024
virtual mem size        (kbytes, -v)  unlimited
swap limit              (kbytes, -w)  unlimited
socket buffer size       (bytes, -b)  unlimited
pseudo-terminals                (-p)  unlimited
kqueues                         (-k)  unlimited
umtx shared locks               (-o)  unlimited
--End resource limits--
=======================<phase: check-sanity   >============================
===>  License GPLv2+ accepted by the user
===========================================================================
=======================<phase: pkg-depends    >============================
===>   rsyncrypto-1.14 depends on file: /usr/local/sbin/pkg - not found
===>   Installing existing package /packages/All/pkg-1.16.3.txz
[122powerpc64-quarterly-job-05] Installing pkg-1.16.3...
[122powerpc64-quarterly-job-05] Extracting pkg-1.16.3: .......... done
===>   rsyncrypto-1.14 depends on file: /usr/local/sbin/pkg - found
===>   Returning to build of rsyncrypto-1.14
===========================================================================
=======================<phase: fetch-depends  >============================
===========================================================================
=======================<phase: fetch          >============================
===>  License GPLv2+ accepted by the user
===> Fetching all distfiles required by rsyncrypto-1.14 for building
===========================================================================
=======================<phase: checksum       >============================
===>  License GPLv2+ accepted by the user
===> Fetching all distfiles required by rsyncrypto-1.14 for building
=> SHA256 Checksum OK for rsyncrypto-1.14.tar.bz2.
===========================================================================
=======================<phase: extract-depends>============================
===========================================================================
=======================<phase: extract        >============================
===>  License GPLv2+ accepted by the user
===> Fetching all distfiles required by rsyncrypto-1.14 for building
===>  Extracting for rsyncrypto-1.14
=> SHA256 Checksum OK for rsyncrypto-1.14.tar.bz2.
===========================================================================
=======================<phase: patch-depends  >============================
===========================================================================
=======================<phase: patch          >============================
===>  Patching for rsyncrypto-1.14
===>  Applying FreeBSD patches for rsyncrypto-1.14 from /usr/ports/sysutils/rsyncrypto/files
===========================================================================
=======================<phase: build-depends  >============================
===>   rsyncrypto-1.14 depends on package: gmake>=4.3 - not found
===>   Installing existing package /packages/All/gmake-4.3_2.txz
[122powerpc64-quarterly-job-05] Installing gmake-4.3_2...
[122powerpc64-quarterly-job-05] `-- Installing gettext-runtime-0.21...
[122powerpc64-quarterly-job-05] |   `-- Installing indexinfo-0.3.1...
[122powerpc64-quarterly-job-05] |   `-- Extracting indexinfo-0.3.1: .... done
[122powerpc64-quarterly-job-05] `-- Extracting gettext-runtime-0.21: .......... done
[122powerpc64-quarterly-job-05] Extracting gmake-4.3_2: .......... done
===>   rsyncrypto-1.14 depends on package: gmake>=4.3 - found
===>   Returning to build of rsyncrypto-1.14
===>   rsyncrypto-1.14 depends on executable: gcc10 - not found
===>   Installing existing package /packages/All/gcc10-10.2.0_1.txz
[122powerpc64-quarterly-job-05] Installing gcc10-10.2.0_1...
[122powerpc64-quarterly-job-05] `-- Installing binutils-2.33.1_4,1...
[122powerpc64-quarterly-job-05] `-- Extracting binutils-2.33.1_4,1: .......... done
[122powerpc64-quarterly-job-05] `-- Installing gcc9-9.3.0_3...
[122powerpc64-quarterly-job-05] |   `-- Installing gmp-6.2.1...
[122powerpc64-quarterly-job-05] |   `-- Extracting gmp-6.2.1: .......... done
[122powerpc64-quarterly-job-05] |   `-- Installing mpc-1.2.0...
[122powerpc64-quarterly-job-05] |   | `-- Installing mpfr-4.1.0...
[122powerpc64-quarterly-job-05] |   | `-- Extracting mpfr-4.1.0: .......... done
[122powerpc64-quarterly-job-05] |   `-- Extracting mpc-1.2.0: ......... done
[122powerpc64-quarterly-job-05] `-- Extracting gcc9-9.3.0_3: .......... done
[122powerpc64-quarterly-job-05] Extracting gcc10-10.2.0_1: .......... done
=====
Message from gcc9-9.3.0_3:

--
To ensure binaries built with this toolchain find appropriate versions
of the necessary run-time libraries, you may want to link using

  -Wl,-rpath=/usr/local/lib/gcc9

For ports leveraging USE_GCC, USES=compiler, or USES=fortran this happens
transparently.
=====
Message from gcc10-10.2.0_1:

--
To ensure binaries built with this toolchain find appropriate versions
of the necessary run-time libraries, you may want to link using

  -Wl,-rpath=/usr/local/lib/gcc10

For ports leveraging USE_GCC, USES=compiler, or USES=fortran this happens
transparently.
===>   rsyncrypto-1.14 depends on executable: gcc10 - found
===>   Returning to build of rsyncrypto-1.14
===>   rsyncrypto-1.14 depends on file: /usr/local/bin/as - found
===========================================================================
=======================<phase: lib-depends    >============================
===>   rsyncrypto-1.14 depends on shared library: libargtable2.so - not found
===>   Installing existing package /packages/All/argtable-2.13_2.txz
[122powerpc64-quarterly-job-05] Installing argtable-2.13_2...
[122powerpc64-quarterly-job-05] Extracting argtable-2.13_2: .......... done
=====
Message from argtable-2.13_2:

--
===>   NOTICE:

The argtable port currently does not have a maintainer. As a result, it is
more likely to have unresolved issues, not be up-to-date, or even be removed in
the future. To volunteer to maintain this port, please create an issue at:

https://bugs.freebsd.org/bugzilla

More information about port maintainership is available at:

https://www.freebsd.org/doc/en/articles/contributing/ports-contributing.html#maintain-port
===>   rsyncrypto-1.14 depends on shared library: libargtable2.so - found (/usr/local/lib/libargtable2.so)
===>   Returning to build of rsyncrypto-1.14
===========================================================================
=======================<phase: configure      >============================
===>  Configuring for rsyncrypto-1.14
configure: loading site script /usr/ports/Templates/config.site
checking for a BSD-compatible install... /usr/bin/install -c
checking whether build environment is sane... yes
checking for a thread-safe mkdir -p... (cached) /bin/mkdir -p
checking for gawk... (cached) /usr/bin/awk
checking whether gmake sets $(MAKE)... yes
checking whether gmake supports nested variables... yes
checking whether the C++ compiler works... yes
checking for C++ compiler default output file name... a.out
checking for suffix of executables... 
checking whether we are cross compiling... no
checking for suffix of object files... o
checking whether we are using the GNU C++ compiler... yes
checking whether g++10 accepts -g... yes
checking for style of include used by gmake... GNU
checking dependency style of g++10... gcc3
checking for gawk... (cached) /usr/bin/awk
checking for AES_encrypt in -lcrypto... yes
checking for arg_parse in -largtable2... yes
checking whether platform supports lstat... yes
checking for special C compiler options needed for large files... no
checking for _FILE_OFFSET_BITS value needed for large files... no
checking for dirent.h that defines DIR... yes
checking for library containing opendir... none required
checking how to run the C++ preprocessor... g++10 -E
checking for grep that handles long lines and -e... (cached) /usr/bin/grep
checking for egrep... (cached) /usr/bin/egrep
checking for ANSI C header files... (cached) yes
checking for sys/wait.h that is POSIX.1 compatible... (cached) yes
checking for sys/types.h... (cached) yes
checking for sys/stat.h... (cached) yes
checking for stdlib.h... (cached) yes
checking for string.h... (cached) yes
checking for memory.h... (cached) yes
checking for strings.h... (cached) yes
checking for inttypes.h... (cached) yes
checking for stdint.h... (cached) yes
checking for unistd.h... (cached) yes
checking for fcntl.h... (cached) yes
checking for netinet/in.h... (cached) yes
checking for stdlib.h... (cached) yes
checking for string.h... (cached) yes
checking for strings.h... (cached) yes
checking for sys/time.h... (cached) yes
checking for unistd.h... (cached) yes
checking for utime.h... (cached) yes
checking for sys/mman.h... (cached) yes
checking argtable2.h usability... yes
checking argtable2.h presence... yes
checking for argtable2.h... yes
checking map usability... yes
checking map presence... yes
checking for map... yes
checking for mode_t... (cached) yes
checking for off_t... (cached) yes
checking for size_t... (cached) yes
checking for ssize_t... (cached) yes
checking for struct stat.st_rdev... yes
checking whether time.h and sys/time.h may both be included... yes
checking for uint16_t... (cached) yes
checking for uint32_t... (cached) yes
checking for uint8_t... (cached) yes
checking for O_NOATIME support in open... no
checking whether struct stat has nanosecond resolution... st_mtim is a struct timespec
checking whether closedir returns void... no
checking for error_at_line... no
checking for pid_t... (cached) yes
checking for vfork.h... (cached) no
checking for fork... (cached) yes
checking for vfork... (cached) yes
checking for working fork... yes
checking for working vfork... (cached) yes
checking whether lstat correctly handles trailing slash... (cached) yes
checking whether lstat accepts an empty string... no
checking whether lstat correctly handles trailing slash... (cached) yes
checking whether stat accepts an empty string... no
checking for bzero... (cached) yes
checking for dup2... (cached) yes
checking for memset... (cached) yes
checking for mkdir... yes
checking for munmap... (cached) yes
checking for rmdir... yes
checking for strchr... (cached) yes
checking for strerror... (cached) yes
checking for strtoul... (cached) yes
checking for gzip with "rsyncable" support... no!
configure: WARNING: !!!!!!!!!!!!!!!!!!!!!!!!!!!!!!!!!!!!!!!!!!!!!!!!!!!!!!!!!!!!!!!!!!!!!!!!!!!!!!!!!!!!!
configure: WARNING: ! gzip must support the "--rsyncable" flag for proper rsyncrypto operation.         !
configure: WARNING: ! This does not affect compilation, but a proper gzip must be available at runtime. !
configure: WARNING: !!!!!!!!!!!!!!!!!!!!!!!!!!!!!!!!!!!!!!!!!!!!!!!!!!!!!!!!!!!!!!!!!!!!!!!!!!!!!!!!!!!!!
checking whether compiler supports gcc style precompiled headers... yes
checking that generated files are newer than configure... done
configure: creating ./config.status
config.status: creating Makefile
config.status: creating config.h
config.status: executing depfiles commands
===========================================================================
=======================<phase: build          >============================
===>  Building for rsyncrypto-1.14
gmake[1]: Entering directory '/wrkdirs/usr/ports/sysutils/rsyncrypto/work/rsyncrypto-1.14'
g++10 -DHAVE_CONFIG_H -I.   -isystem /usr/local/include  -O2 -pipe  -fstack-protector-strong -Wl,-rpath=/usr/local/lib/gcc10  -Wl,-rpath=/usr/local/lib/gcc10 -isystem /usr/local/include  -MT precomp.h.gch -MD -MP -MF .deps/.h.Tpo -c -o precomp.h.gch.comp precomp.h
mv -f .deps/.h.Tpo .deps/.h.Po
mv -f precomp.h.gch.comp precomp.h.gch
gmake  all-am
gmake[2]: Entering directory '/wrkdirs/usr/ports/sysutils/rsyncrypto/work/rsyncrypto-1.14'
g++10 -DHAVE_CONFIG_H -I.   -isystem /usr/local/include  -O2 -pipe  -fstack-protector-strong -Wl,-rpath=/usr/local/lib/gcc10  -Wl,-rpath=/usr/local/lib/gcc10 -isystem /usr/local/include  -MT main.o -MD -MP -MF .deps/main.Tpo -c -o main.o main.cpp
g++10 -DHAVE_CONFIG_H -I.   -isystem /usr/local/include  -O2 -pipe  -fstack-protector-strong -Wl,-rpath=/usr/local/lib/gcc10  -Wl,-rpath=/usr/local/lib/gcc10 -isystem /usr/local/include  -MT crypto.o -MD -MP -MF .deps/crypto.Tpo -c -o crypto.o crypto.cpp

:628: internal compiler error: Segmentation fault

:628: internal compiler error: Segmentation fault
Please submit a full bug report,
with preprocessed source if appropriate.
See <https://gcc.gnu.org/bugs/> for instructions.
Please submit a full bug report,
with preprocessed source if appropriate.
See <https://gcc.gnu.org/bugs/> for instructions.
gmake[2]: *** [Makefile:455: crypto.o] Error 1
gmake[2]: *** Waiting for unfinished jobs....
gmake[2]: *** [Makefile:455: main.o] Error 1
gmake[2]: Leaving directory '/wrkdirs/usr/ports/sysutils/rsyncrypto/work/rsyncrypto-1.14'
gmake[1]: *** [Makefile:326: all] Error 2
gmake[1]: Leaving directory '/wrkdirs/usr/ports/sysutils/rsyncrypto/work/rsyncrypto-1.14'
===> Compilation failed unexpectedly.
Try to set MAKE_JOBS_UNSAFE=yes and rebuild before reporting the failure to
the maintainer.
*** Error code 1

Stop.
make: stopped in /usr/ports/sysutils/rsyncrypto
Received on Tue Jun 22 2021 - 04:15:22 UTC

Original text of this message