[package - 122powerpc64-quarterly][lang/halide] Failed for halide-2019.08.27.2654 in configure

From: <pkg-fallout_at_FreeBSD.org>
Date: Tue, 22 Jun 2021 03:34:47 GMT
You are receiving this mail as a port that you maintain
is failing to build on the FreeBSD package build server.
Please investigate the failure and submit a PR to fix
build.

Maintainer:     yuri_at_FreeBSD.org
Log URL:        http://foul1.nyi.freebsd.org/data/122powerpc64-quarterly/dbe1c4c35016/logs/halide-2019.08.27.2654.log
Build URL:      http://foul1.nyi.freebsd.org/build.html?mastername=122powerpc64-quarterly&build=dbe1c4c35016
Log:

=>> Building lang/halide
build started at Tue Jun 22 03:33:22 UTC 2021
port directory: /usr/ports/lang/halide
package name: halide-2019.08.27.2654
building for: FreeBSD 122powerpc64-quarterly-job-07 12.2-RELEASE FreeBSD 12.2-RELEASE powerpc
maintained by: yuri_at_FreeBSD.org
Makefile ident: 
Poudriere version: 3.2.8-8-gaf08dbda
Host OSVERSION: 1400008
Jail OSVERSION: 1202000
Job Id: 07

---Begin Environment---
SHELL=/bin/csh
OSVERSION=1202000
UNAME_v=FreeBSD 12.2-RELEASE
UNAME_r=12.2-RELEASE
BLOCKSIZE=K
MAIL=/var/mail/root
STATUS=1
HOME=/root
PATH=/sbin:/bin:/usr/sbin:/usr/bin:/usr/local/sbin:/usr/local/bin:/root/bin
LOCALBASE=/usr/local
USER=root
LIBEXECPREFIX=/usr/local/libexec/poudriere
POUDRIERE_VERSION=3.2.8-8-gaf08dbda
MASTERMNT=/usr/local/poudriere/data/.m/122powerpc64-quarterly/ref
POUDRIERE_BUILD_TYPE=bulk
PACKAGE_BUILDING=yes
SAVED_TERM=
PWD=/usr/local/poudriere/data/.m/122powerpc64-quarterly/ref/.p/pool
P_PORTS_FEATURES=FLAVORS SELECTED_OPTIONS
MASTERNAME=122powerpc64-quarterly
SCRIPTPREFIX=/usr/local/share/poudriere
OLDPWD=/usr/local/poudriere/data/.m/122powerpc64-quarterly/ref/.p
SCRIPTPATH=/usr/local/share/poudriere/bulk.sh
POUDRIEREPATH=/usr/local/bin/poudriere
---End Environment---

---Begin Poudriere Port Flags/Env---
PORT_FLAGS=
PKGENV=
FLAVOR=
DEPENDS_ARGS=
MAKE_ARGS=
---End Poudriere Port Flags/Env---

---Begin OPTIONS List---
===> The following configuration options are available for halide-2019.08.27.2654:
     NATIVE=off: Build with native optimizations (-march=native)
===> Use 'make config' to modify these settings
---End OPTIONS List---

--MAINTAINER--
yuri_at_FreeBSD.org
--End MAINTAINER--

--CONFIGURE_ARGS--

--End CONFIGURE_ARGS--

--CONFIGURE_ENV--
XDG_DATA_HOME=/wrkdirs/usr/ports/lang/halide/work  XDG_CONFIG_HOME=/wrkdirs/usr/ports/lang/halide/work  HOME=/wrkdirs/usr/ports/lang/halide/work TMPDIR="/tmp" PATH=/wrkdirs/usr/ports/lang/halide/work/.bin:/sbin:/bin:/usr/sbin:/usr/bin:/usr/local/sbin:/usr/local/bin:/root/bin SHELL=/bin/sh CONFIG_SHELL=/bin/sh
--End CONFIGURE_ENV--

--MAKE_ENV--
XDG_DATA_HOME=/wrkdirs/usr/ports/lang/halide/work  XDG_CONFIG_HOME=/wrkdirs/usr/ports/lang/halide/work  HOME=/wrkdirs/usr/ports/lang/halide/work TMPDIR="/tmp" PATH=/wrkdirs/usr/ports/lang/halide/work/.bin:/sbin:/bin:/usr/sbin:/usr/bin:/usr/local/sbin:/usr/local/bin:/root/bin NO_PIE=yes MK_DEBUG_FILES=no MK_KERNEL_SYMBOLS=no SHELL=/bin/sh NO_LINT=YES DESTDIR=/wrkdirs/usr/ports/lang/halide/work/stage PREFIX=/usr/local  LOCALBASE=/usr/local  CC="clang90" CFLAGS="-O2 -pipe  -fstack-protector-strong -fno-strict-aliasing "  CPP="clang-cpp90" CPPFLAGS=""  LDFLAGS=" -fstack-protector-strong " LIBS=""  CXX="clang++90" CXXFLAGS="-O2 -pipe -fstack-protector-strong -fno-strict-aliasing  "  MANPREFIX="/usr/local" BSD_INSTALL_PROGRAM="install  -s -m 555"  BSD_INSTALL_LIB="install  -s -m 0644"  BSD_INSTALL_SCRIPT="install  -m 555"  BSD_INSTALL_DATA="install  -m 0644"  BSD_INSTALL_MAN="install  -m 444"
--End MAKE_ENV--

--PLIST_SUB--
CMAKE_BUILD_TYPE="release" OSREL=12.2 PREFIX=%D LOCALBASE=/usr/local  RESETPREFIX=/usr/local LIB32DIR=lib DOCSDIR="share/doc/halide"  EXAMPLESDIR="share/examples/halide"  DATADIR="share/halide"  WWWDIR="www/halide"  ETCDIR="etc/halide"
--End PLIST_SUB--

--SUB_LIST--
PREFIX=/usr/local LOCALBASE=/usr/local  DATADIR=/usr/local/share/halide DOCSDIR=/usr/local/share/doc/halide EXAMPLESDIR=/usr/local/share/examples/halide  WWWDIR=/usr/local/www/halide ETCDIR=/usr/local/etc/halide
--End SUB_LIST--

---Begin make.conf---
USE_PACKAGE_DEPENDS=yes
BATCH=yes
WRKDIRPREFIX=/wrkdirs
PORTSDIR=/usr/ports
PACKAGES=/packages
DISTDIR=/distfiles
PACKAGE_BUILDING=yes
PACKAGE_BUILDING_FLAVORS=yes
#### /usr/local/etc/poudriere.d/make.conf ####
# XXX: We really need this but cannot use it while 'make checksum' does not
# try the next mirror on checksum failure.  It currently retries the same
# failed mirror and then fails rather then trying another.  It *does*
# try the next if the size is mismatched though.
#MASTER_SITE_FREEBSD=yes
# Build ALLOW_MAKE_JOBS_PACKAGES with 2 jobs
MAKE_JOBS_NUMBER=2
#### /usr/ports/Mk/Scripts/ports_env.sh ####
_CCVERSION_921dbbb2=cc (GCC) 4.2.1 20070831 patched [FreeBSD] Copyright (C) 2007 Free Software Foundation, Inc. This is free software; see the source for copying conditions. There is NO warranty; not even for MERCHANTABILITY or FITNESS FOR A PARTICULAR PURPOSE.
_ALTCCVERSION_921dbbb2=none
_CXXINTERNAL_acaad9ca=Using built-in specs. Target: powerpc64-undermydesk-freebsd Configured with: FreeBSD/powerpc64 system compiler Thread model: posix gcc version 4.2.1 20070831 patched [FreeBSD] "/usr/bin/ld" "--eh-frame-hdr" "-Qy" "-melf64ppc_fbsd" "--enable-new-dtags" "-dynamic-linker" "/libexec/ld-elf.so.1" "/usr/lib/crt1.o" "/usr/lib/crti.o" "/usr/lib/crtbegin.o" "-L/usr/lib" "-L/usr/lib" "/dev/null" "-lstdc++" "-lm" "-lgcc_s" "-lgcc" "-lc" "-lgcc_s" "-lgcc" "/usr/lib/crtsavres.o" "/usr/lib/crtend.o" "/usr/lib/crtn.o"
CC_OUTPUT_921dbbb2_58173849=yes
CC_OUTPUT_921dbbb2_9bdba57c=yes
CC_OUTPUT_921dbbb2_6a4fe7f5=cc1: error: unrecognized command line option "-std=c11"
CC_OUTPUT_921dbbb2_6bcac02b=yes
CC_OUTPUT_921dbbb2_67d20829=yes
CC_OUTPUT_921dbbb2_bfa62e83=cc1: error: unrecognized command line option "-std=gnu11"
CC_OUTPUT_921dbbb2_f0b4d593=yes
CC_OUTPUT_921dbbb2_308abb44=cc1plus: error: unrecognized command line option "-std=c++0x"
CC_OUTPUT_921dbbb2_f00456e5=cc1plus: error: unrecognized command line option "-std=c++11"
CC_OUTPUT_921dbbb2_65ad290d=cc1plus: error: unrecognized command line option "-std=c++14"
CC_OUTPUT_921dbbb2_f2776b26=cc1plus: error: unrecognized command line option "-std=c++17"
CC_OUTPUT_921dbbb2_b2657cc3=yes
CC_OUTPUT_921dbbb2_380987f7=cc1plus: error: unrecognized command line option "-std=gnu++11"
CC_OUTPUT_921dbbb2_160933ec=cc1plus: error: unrecognized command line option "-std=gnu++14"
CC_OUTPUT_921dbbb2_fb62803b=cc1plus: error: unrecognized command line option "-std=gnu++17"
_OBJC_CCVERSION_921dbbb2=cc (GCC) 4.2.1 20070831 patched [FreeBSD] Copyright (C) 2007 Free Software Foundation, Inc. This is free software; see the source for copying conditions. There is NO warranty; not even for MERCHANTABILITY or FITNESS FOR A PARTICULAR PURPOSE.
_OBJC_ALTCCVERSION_921dbbb2=none
ARCH=powerpc64
PPC_ABI=ELFv1
OPSYS=FreeBSD
_OSRELEASE=12.2-RELEASE
OSREL=12.2
OSVERSION=1202000
PYTHONBASE=/usr/local
CONFIGURE_MAX_CMD_LEN=524288
HAVE_PORTS_ENV=1
#### Misc Poudriere ####
GID=0
UID=0
---End make.conf---
--Resource limits--
cpu time               (seconds, -t)  unlimited
file size           (512-blocks, -f)  unlimited
data seg size           (kbytes, -d)  33554432
stack size              (kbytes, -s)  524288
core file size      (512-blocks, -c)  unlimited
max memory size         (kbytes, -m)  unlimited
locked memory           (kbytes, -l)  unlimited
max user processes              (-u)  89999
open files                      (-n)  1024
virtual mem size        (kbytes, -v)  unlimited
swap limit              (kbytes, -w)  unlimited
socket buffer size       (bytes, -b)  unlimited
pseudo-terminals                (-p)  unlimited
kqueues                         (-k)  unlimited
umtx shared locks               (-o)  unlimited
--End resource limits--
=======================<phase: check-sanity   >============================
===>  License MIT accepted by the user
===========================================================================
=======================<phase: pkg-depends    >============================
===>   halide-2019.08.27.2654 depends on file: /usr/local/sbin/pkg - not found
===>   Installing existing package /packages/All/pkg-1.16.3.txz
[122powerpc64-quarterly-job-07] Installing pkg-1.16.3...
[122powerpc64-quarterly-job-07] Extracting pkg-1.16.3: .......... done
===>   halide-2019.08.27.2654 depends on file: /usr/local/sbin/pkg - found
===>   Returning to build of halide-2019.08.27.2654
===========================================================================
=======================<phase: fetch-depends  >============================
===========================================================================
=======================<phase: fetch          >============================
===>  License MIT accepted by the user
===> Fetching all distfiles required by halide-2019.08.27.2654 for building
===========================================================================
=======================<phase: checksum       >============================
===>  License MIT accepted by the user
===> Fetching all distfiles required by halide-2019.08.27.2654 for building
=> SHA256 Checksum OK for halide-Halide-release_2019_08_27-2654-g664dc4993_GH0.tar.gz.
=> SHA256 Checksum OK for 890a5199ae8ade759de076217670ae980bf44823.patch.
===========================================================================
=======================<phase: extract-depends>============================
===========================================================================
=======================<phase: extract        >============================
===>  License MIT accepted by the user
===> Fetching all distfiles required by halide-2019.08.27.2654 for building
===>  Extracting for halide-2019.08.27.2654
=> SHA256 Checksum OK for halide-Halide-release_2019_08_27-2654-g664dc4993_GH0.tar.gz.
=> SHA256 Checksum OK for 890a5199ae8ade759de076217670ae980bf44823.patch.
===========================================================================
=======================<phase: patch-depends  >============================
===========================================================================
=======================<phase: patch          >============================
===>  Patching for halide-2019.08.27.2654
===>  Applying distribution patches for halide-2019.08.27.2654
===>  Applying FreeBSD patches for halide-2019.08.27.2654 from /usr/ports/lang/halide/files
===========================================================================
=======================<phase: build-depends  >============================
===>   halide-2019.08.27.2654 depends on package: llvm90>0 - not found
===>   Installing existing package /packages/All/llvm90-9.0.1_3.txz
[122powerpc64-quarterly-job-07] Installing llvm90-9.0.1_3...
[122powerpc64-quarterly-job-07] `-- Installing gcc10-10.2.0_1...
[122powerpc64-quarterly-job-07] |   `-- Installing binutils-2.33.1_4,1...
[122powerpc64-quarterly-job-07] |   | `-- Installing gettext-runtime-0.21...
[122powerpc64-quarterly-job-07] |   |   `-- Installing indexinfo-0.3.1...
[122powerpc64-quarterly-job-07] |   |   `-- Extracting indexinfo-0.3.1: .... done
[122powerpc64-quarterly-job-07] |   | `-- Extracting gettext-runtime-0.21: .......... done
[122powerpc64-quarterly-job-07] |   `-- Extracting binutils-2.33.1_4,1: .......... done
[122powerpc64-quarterly-job-07] |   `-- Installing gcc9-9.3.0_3...
[122powerpc64-quarterly-job-07] |   | `-- Installing gmp-6.2.1...
[122powerpc64-quarterly-job-07] |   | `-- Extracting gmp-6.2.1: .......... done
[122powerpc64-quarterly-job-07] |   | `-- Installing mpc-1.2.0...
[122powerpc64-quarterly-job-07] |   |   `-- Installing mpfr-4.1.0...
[122powerpc64-quarterly-job-07] |   |   `-- Extracting mpfr-4.1.0: .......... done
[122powerpc64-quarterly-job-07] |   | `-- Extracting mpc-1.2.0: ......... done
[122powerpc64-quarterly-job-07] |   `-- Extracting gcc9-9.3.0_3: .......... done
[122powerpc64-quarterly-job-07] `-- Extracting gcc10-10.2.0_1: .......... done
[122powerpc64-quarterly-job-07] `-- Installing libedit-3.1.20210216,1...
[122powerpc64-quarterly-job-07] `-- Extracting libedit-3.1.20210216,1: .......... done
[122powerpc64-quarterly-job-07] `-- Installing libxml2-2.9.10_4...
[122powerpc64-quarterly-job-07] `-- Extracting libxml2-2.9.10_4: .......... done
[122powerpc64-quarterly-job-07] `-- Installing perl5-5.32.1_1...
[122powerpc64-quarterly-job-07] `-- Extracting perl5-5.32.1_1: .......... done
[122powerpc64-quarterly-job-07] `-- Installing python37-3.7.10...
[122powerpc64-quarterly-job-07] |   `-- Installing libffi-3.3_1...
[122powerpc64-quarterly-job-07] |   `-- Extracting libffi-3.3_1: .......... done
[122powerpc64-quarterly-job-07] |   `-- Installing readline-8.1.0...
[122powerpc64-quarterly-job-07] |   `-- Extracting readline-8.1.0: .......... done
[122powerpc64-quarterly-job-07] `-- Extracting python37-3.7.10: .......... done
[122powerpc64-quarterly-job-07] Extracting llvm90-9.0.1_3: .......... done
=====
Message from gcc9-9.3.0_3:

--
To ensure binaries built with this toolchain find appropriate versions
of the necessary run-time libraries, you may want to link using

  -Wl,-rpath=/usr/local/lib/gcc9

For ports leveraging USE_GCC, USES=compiler, or USES=fortran this happens
transparently.
=====
Message from gcc10-10.2.0_1:

--
To ensure binaries built with this toolchain find appropriate versions
of the necessary run-time libraries, you may want to link using

  -Wl,-rpath=/usr/local/lib/gcc10

For ports leveraging USE_GCC, USES=compiler, or USES=fortran this happens
transparently.
=====
Message from python37-3.7.10:

--
Note that some standard Python modules are provided as separate ports
as they require additional dependencies. They are available as:

py37-gdbm       databases/py-gdbm_at_py37
py37-sqlite3    databases/py-sqlite3_at_py37
py37-tkinter    x11-toolkits/py-tkinter_at_py37
===>   halide-2019.08.27.2654 depends on package: llvm90>0 - found
===>   Returning to build of halide-2019.08.27.2654
===>   halide-2019.08.27.2654 depends on file: /usr/local/bin/cmake - not found
===>   Installing existing package /packages/All/cmake-3.19.6.txz
[122powerpc64-quarterly-job-07] Installing cmake-3.19.6...
[122powerpc64-quarterly-job-07] `-- Installing curl-7.76.0...
[122powerpc64-quarterly-job-07] |   `-- Installing ca_root_nss-3.63...
[122powerpc64-quarterly-job-07] |   `-- Extracting ca_root_nss-3.63: ........ done
[122powerpc64-quarterly-job-07] |   `-- Installing libnghttp2-1.43.0...
[122powerpc64-quarterly-job-07] |   `-- Extracting libnghttp2-1.43.0: .......... done
[122powerpc64-quarterly-job-07] `-- Extracting curl-7.76.0: .......... done
[122powerpc64-quarterly-job-07] `-- Installing expat-2.4.1...
[122powerpc64-quarterly-job-07] `-- Extracting expat-2.4.1: .......... done
[122powerpc64-quarterly-job-07] `-- Installing jsoncpp-1.9.4...
[122powerpc64-quarterly-job-07] `-- Extracting jsoncpp-1.9.4: .......... done
[122powerpc64-quarterly-job-07] `-- Installing libarchive-3.5.1,1...
[122powerpc64-quarterly-job-07] |   `-- Installing liblz4-1.9.3,1...
[122powerpc64-quarterly-job-07] |   `-- Extracting liblz4-1.9.3,1: .......... done
[122powerpc64-quarterly-job-07] `-- Extracting libarchive-3.5.1,1: .......... done
[122powerpc64-quarterly-job-07] `-- Installing libuv-1.41.0...
[122powerpc64-quarterly-job-07] `-- Extracting libuv-1.41.0: .......... done
[122powerpc64-quarterly-job-07] `-- Installing rhash-1.4.1...
[122powerpc64-quarterly-job-07] `-- Extracting rhash-1.4.1: .......... done
[122powerpc64-quarterly-job-07] Extracting cmake-3.19.6: .......... done
=====
Message from ca_root_nss-3.63:

--
FreeBSD does not, and can not warrant that the certification authorities
whose certificates are included in this package have in any way been
audited for trustworthiness or RFC 3647 compliance.

Assessment and verification of trust is the complete responsibility of the
system administrator.


This package installs symlinks to support root certificates discovery by
default for software that uses OpenSSL.

This enables SSL Certificate Verification by client software without manual
intervention.

If you prefer to do this manually, replace the following symlinks with
either an empty file or your site-local certificate bundle.

  * /etc/ssl/cert.pem
  * /usr/local/etc/ssl/cert.pem
  * /usr/local/openssl/cert.pem
===>   halide-2019.08.27.2654 depends on file: /usr/local/bin/cmake - found
===>   Returning to build of halide-2019.08.27.2654
===>   halide-2019.08.27.2654 depends on executable: ninja - not found
===>   Installing existing package /packages/All/ninja-1.10.2,2.txz
[122powerpc64-quarterly-job-07] Installing ninja-1.10.2,2...
[122powerpc64-quarterly-job-07] Extracting ninja-1.10.2,2: ........ done
===>   halide-2019.08.27.2654 depends on executable: ninja - found
===>   Returning to build of halide-2019.08.27.2654
===========================================================================
=======================<phase: lib-depends    >============================
===========================================================================
=======================<phase: configure      >============================
===>  Configuring for halide-2019.08.27.2654
===>  Performing out-of-source build
/bin/mkdir -p /wrkdirs/usr/ports/lang/halide/work/.build
-- The C compiler identification is Clang 9.0.1
-- The CXX compiler identification is Clang 9.0.1
-- Detecting C compiler ABI info
-- Detecting C compiler ABI info - failed
-- Check for working C compiler: /usr/local/bin/clang90
-- Check for working C compiler: /usr/local/bin/clang90 - broken
CMake Error at /usr/local/share/cmake/Modules/CMakeTestCCompiler.cmake:66 (message):
  The C compiler

    "/usr/local/bin/clang90"

  is not able to compile a simple test program.

  It fails with the following output:

    Change Dir: /wrkdirs/usr/ports/lang/halide/work/.build/CMakeFiles/CMakeTmp
    
    Run Build Command(s):/usr/local/bin/ninja cmTC_91f21 && [1/2] Building C object CMakeFiles/cmTC_91f21.dir/testCCompiler.c.o
    [2/2] Linking C executable cmTC_91f21
    FAILED: cmTC_91f21 
    : && /usr/local/bin/clang90 -O2 -pipe  -fstack-protector-strong -fno-strict-aliasing -fstack-protector-strong CMakeFiles/cmTC_91f21.dir/testCCompiler.c.o -o cmTC_91f21   && :
    ld: error: crtstuff.c:(.text+0x16): relocation R_PPC64_TOC16_DS out of range: -32808 is not in [-32768, 32767]
    ld: error: crtstuff.c:(.text+0x2E): relocation R_PPC64_TOC16_DS out of range: -32800 is not in [-32768, 32767]
    ld: error: crtstuff.c:(.text+0xA6): relocation R_PPC64_TOC16_DS out of range: -32792 is not in [-32768, 32767]
    ld: error: crtstuff.c:(.text+0xBE): relocation R_PPC64_TOC16_DS out of range: -32784 is not in [-32768, 32767]
    ld: error: crtstuff.c:(.text+0x12): relocation R_PPC64_TOC16_DS out of range: -32776 is not in [-32768, 32767]
    ld: error: /usr/src/lib/csu/common/ignore_init.c:136:(.text+0x32): relocation R_PPC64_TOC16_DS out of range: -32936 is not in [-32768, 32767]
    ld: error: /usr/src/lib/csu/common/ignore_init.c:139:(.text+0x5A): relocation R_PPC64_TOC16_DS out of range: -32928 is not in [-32768, 32767]
    ld: error: /usr/src/lib/csu/powerpc64/crt1.c:85:(.text+0xAE): relocation R_PPC64_TOC16_DS out of range: -32920 is not in [-32768, 32767]
    ld: error: /usr/src/lib/csu/powerpc64/crt1.c:86:(.text+0xBA): relocation R_PPC64_TOC16_DS out of range: -32912 is not in [-32768, 32767]
    ld: error: /usr/src/lib/csu/powerpc64/crt1.c:96:(.text+0xDA): relocation R_PPC64_TOC16_DS out of range: -32848 is not in [-32768, 32767]
    ld: error: /usr/src/lib/csu/powerpc64/crt1.c:96:(.text+0x106): relocation R_PPC64_TOC16_DS out of range: -32840 is not in [-32768, 32767]
    ld: error: /usr/src/lib/csu/powerpc64/crt1.c:88:(.text+0x12A): relocation R_PPC64_TOC16_DS out of range: -32904 is not in [-32768, 32767]
    ld: error: /usr/src/lib/csu/common/ignore_init.c:114:(.text+0x14A): relocation R_PPC64_TOC16_DS out of range: -32912 is not in [-32768, 32767]
    ld: error: /usr/src/lib/csu/common/ignore_init.c:114:(.text+0x14E): relocation R_PPC64_TOC16_DS out of range: -32896 is not in [-32768, 32767]
    ld: error: /usr/src/lib/csu/common/ignore_init.c:116:(.text+0x16A): relocation R_PPC64_TOC16_DS out of range: -32888 is not in [-32768, 32767]
    ld: error: /usr/src/lib/csu/common/ignore_init.c:116:(.text+0x16E): relocation R_PPC64_TOC16_DS out of range: -32880 is not in [-32768, 32767]
    ld: error: /usr/src/lib/csu/common/ignore_init.c:122:(.text+0x1CE): relocation R_PPC64_TOC16_DS out of range: -32872 is not in [-32768, 32767]
    ld: error: /usr/src/lib/csu/common/ignore_init.c:123:(.text+0x1EE): relocation R_PPC64_TOC16_DS out of range: -32864 is not in [-32768, 32767]
    ld: error: /usr/src/lib/csu/common/ignore_init.c:123:(.text+0x1F2): relocation R_PPC64_TOC16_DS out of range: -32856 is not in [-32768, 32767]
    ld: error: /usr/src/lib/csu/common/ignore_init.c:96:(.text+0x262): relocation R_PPC64_TOC16_DS out of range: -32824 is not in [-32768, 32767]
    ld: error: too many errors emitted, stopping now (use -error-limit=0 to see all errors)
    clang-9: error: linker command failed with exit code 1 (use -v to see invocation)
    ninja: build stopped: subcommand failed.
    
    

  

  CMake will not be able to correctly generate this project.
Call Stack (most recent call first):
  CMakeLists.txt:2 (project)


-- Configuring incomplete, errors occurred!
See also "/wrkdirs/usr/ports/lang/halide/work/.build/CMakeFiles/CMakeOutput.log".
See also "/wrkdirs/usr/ports/lang/halide/work/.build/CMakeFiles/CMakeError.log".
*** Error code 1

Stop.
make: stopped in /usr/ports/lang/halide
Received on Tue Jun 22 2021 - 03:34:47 UTC

Original text of this message