[package - 122powerpc64-quarterly][security/afl++] Failed for afl++-2.63c in build

From: <pkg-fallout_at_FreeBSD.org>
Date: Tue, 22 Jun 2021 03:27:10 GMT
You are receiving this mail as a port that you maintain
is failing to build on the FreeBSD package build server.
Please investigate the failure and submit a PR to fix
build.

Maintainer:     ports_at_FreeBSD.org
Log URL:        http://foul1.nyi.freebsd.org/data/122powerpc64-quarterly/dbe1c4c35016/logs/afl++-2.63c.log
Build URL:      http://foul1.nyi.freebsd.org/build.html?mastername=122powerpc64-quarterly&build=dbe1c4c35016
Log:

=>> Building security/afl++
build started at Tue Jun 22 03:25:37 UTC 2021
port directory: /usr/ports/security/afl++
package name: afl++-2.63c
building for: FreeBSD 122powerpc64-quarterly-job-05 12.2-RELEASE FreeBSD 12.2-RELEASE powerpc
maintained by: ports_at_FreeBSD.org
Makefile ident: 
Poudriere version: 3.2.8-8-gaf08dbda
Host OSVERSION: 1400008
Jail OSVERSION: 1202000
Job Id: 05

---Begin Environment---
SHELL=/bin/csh
OSVERSION=1202000
UNAME_v=FreeBSD 12.2-RELEASE
UNAME_r=12.2-RELEASE
BLOCKSIZE=K
MAIL=/var/mail/root
STATUS=1
HOME=/root
PATH=/sbin:/bin:/usr/sbin:/usr/bin:/usr/local/sbin:/usr/local/bin:/root/bin
LOCALBASE=/usr/local
USER=root
LIBEXECPREFIX=/usr/local/libexec/poudriere
POUDRIERE_VERSION=3.2.8-8-gaf08dbda
MASTERMNT=/usr/local/poudriere/data/.m/122powerpc64-quarterly/ref
POUDRIERE_BUILD_TYPE=bulk
PACKAGE_BUILDING=yes
SAVED_TERM=
PWD=/usr/local/poudriere/data/.m/122powerpc64-quarterly/ref/.p/pool
P_PORTS_FEATURES=FLAVORS SELECTED_OPTIONS
MASTERNAME=122powerpc64-quarterly
SCRIPTPREFIX=/usr/local/share/poudriere
OLDPWD=/usr/local/poudriere/data/.m/122powerpc64-quarterly/ref/.p
SCRIPTPATH=/usr/local/share/poudriere/bulk.sh
POUDRIEREPATH=/usr/local/bin/poudriere
---End Environment---

---Begin Poudriere Port Flags/Env---
PORT_FLAGS=
PKGENV=
FLAVOR=
DEPENDS_ARGS=
MAKE_ARGS=
---End Poudriere Port Flags/Env---

---Begin OPTIONS List---
===> The following configuration options are available for afl++-2.63c:
     DEBUG=off: Build with debugging support
     DOCS=on: Build and/or install documentation
     EXAMPLES=on: Build and/or install examples
     GCC=on: Build GCC plugin and afl-gcc-fast
     LIBDISLOCATOR=on: Abusive allocator for uncovering heap-related bugs
     PYTHON=on: Python mutators support
===> Use 'make config' to modify these settings
---End OPTIONS List---

--MAINTAINER--
ports_at_FreeBSD.org
--End MAINTAINER--

--CONFIGURE_ARGS--

--End CONFIGURE_ARGS--

--CONFIGURE_ENV--
MAKE=gmake PYTHON="/usr/local/bin/python3.7" XDG_DATA_HOME=/wrkdirs/usr/ports/security/afl++/work  XDG_CONFIG_HOME=/wrkdirs/usr/ports/security/afl++/work  HOME=/wrkdirs/usr/ports/security/afl++/work TMPDIR="/tmp" PATH=/wrkdirs/usr/ports/security/afl++/work/.bin:/sbin:/bin:/usr/sbin:/usr/bin:/usr/local/sbin:/usr/local/bin:/root/bin SHELL=/bin/sh CONFIG_SHELL=/bin/sh
--End CONFIGURE_ENV--

--MAKE_ENV--
XDG_DATA_HOME=/wrkdirs/usr/ports/security/afl++/work  XDG_CONFIG_HOME=/wrkdirs/usr/ports/security/afl++/work  HOME=/wrkdirs/usr/ports/security/afl++/work TMPDIR="/tmp" PATH=/wrkdirs/usr/ports/security/afl++/work/.bin:/sbin:/bin:/usr/sbin:/usr/bin:/usr/local/sbin:/usr/local/bin:/root/bin NO_PIE=yes MK_DEBUG_FILES=no MK_KERNEL_SYMBOLS=no SHELL=/bin/sh NO_LINT=YES PREFIX=/usr/local  LOCALBASE=/usr/local  CC="cc" CFLAGS="-O2 -pipe  -fstack-protector-strong -fno-strict-aliasing "  CPP="cpp" CPPFLAGS=""  LDFLAGS=" -fstack-protector-strong " LIBS=""  CXX="c++" CXXFLAGS="-O2 -pipe -fstack-protector-strong -fno-strict-aliasing  "  MANPREFIX="/usr/local" BSD_INSTALL_PROGRAM="install  -s -m 555"  BSD_INSTALL_LIB="install  -s -m 0644"  BSD_INSTALL_SCRIPT="install  -m 555"  BSD_INSTALL_DATA="install  -m 0644"  BSD_INSTALL_MAN="install  -m 444"
--End MAKE_ENV--

--PLIST_SUB--
PORTDOCS="" PORTEXAMPLES="" DEBUG="_at_comment " NO_DEBUG="" DOCS="" NO_DOCS="_at_comment " EXAMPLES="" NO_EXAMPLES="_at_comment " GCC="" NO_GCC="_at_comment " LIBDISLOCATOR="" NO_LIBDISLOCATOR="_at_comment " LLVM="" NO_LLVM="_at_comment " PYTHON="" NO_PYTHON="_at_comment " X86="_at_comment " PYTHON_INCLUDEDIR=include/python3.7m  PYTHON_LIBDIR=lib/python3.7  PYTHON_PLATFORM=freebsd12  PYTHON_SITELIBDIR=lib/python3.7/site-packages  PYTHON_SUFFIX=37  PYTHON_EXT_SUFFIX=  PYTHON_VER=3.7  PYTHON_VERSION=python3.7 PYTHON2="_at_comment " PYTHON3="" OSREL=12.2 PREFIX=%D LOCALBASE=/usr/local  RESETPREFIX=/usr/local LIB32DIR=lib DOCSDIR="share/doc/afl"  EXAMPLESDIR="share/examples/afl"  DATADIR="share/afl"  WWWDIR="www/afl"  ETCDIR="etc/afl"
--End PLIST_SUB--

--SUB_LIST--
DEBUG="_at_comment " NO_DEBUG="" DOCS="" NO_DOCS="_at_comment " EXAMPLES="" NO_EXAMPLES="_at_comment " GCC="" NO_GCC="_at_comment " LIBDISLOCATOR="" NO_LIBDISLOCATOR="_at_comment " LLVM="" NO_LLVM="_at_comment " PYTHON="" NO_PYTHON="_at_comment " PREFIX=/usr/local LOCALBASE=/usr/local  DATADIR=/usr/local/share/afl DOCSDIR=/usr/local/share/doc/afl EXAMPLESDIR=/usr/local/share/examples/afl  WWWDIR=/usr/local/www/afl ETCDIR=/usr/local/etc/afl
--End SUB_LIST--

---Begin make.conf---
USE_PACKAGE_DEPENDS=yes
BATCH=yes
WRKDIRPREFIX=/wrkdirs
PORTSDIR=/usr/ports
PACKAGES=/packages
DISTDIR=/distfiles
PACKAGE_BUILDING=yes
PACKAGE_BUILDING_FLAVORS=yes
#### /usr/local/etc/poudriere.d/make.conf ####
# XXX: We really need this but cannot use it while 'make checksum' does not
# try the next mirror on checksum failure.  It currently retries the same
# failed mirror and then fails rather then trying another.  It *does*
# try the next if the size is mismatched though.
#MASTER_SITE_FREEBSD=yes
# Build ALLOW_MAKE_JOBS_PACKAGES with 2 jobs
MAKE_JOBS_NUMBER=2
#### /usr/ports/Mk/Scripts/ports_env.sh ####
_CCVERSION_921dbbb2=cc (GCC) 4.2.1 20070831 patched [FreeBSD] Copyright (C) 2007 Free Software Foundation, Inc. This is free software; see the source for copying conditions. There is NO warranty; not even for MERCHANTABILITY or FITNESS FOR A PARTICULAR PURPOSE.
_ALTCCVERSION_921dbbb2=none
_CXXINTERNAL_acaad9ca=Using built-in specs. Target: powerpc64-undermydesk-freebsd Configured with: FreeBSD/powerpc64 system compiler Thread model: posix gcc version 4.2.1 20070831 patched [FreeBSD] "/usr/bin/ld" "--eh-frame-hdr" "-Qy" "-melf64ppc_fbsd" "--enable-new-dtags" "-dynamic-linker" "/libexec/ld-elf.so.1" "/usr/lib/crt1.o" "/usr/lib/crti.o" "/usr/lib/crtbegin.o" "-L/usr/lib" "-L/usr/lib" "/dev/null" "-lstdc++" "-lm" "-lgcc_s" "-lgcc" "-lc" "-lgcc_s" "-lgcc" "/usr/lib/crtsavres.o" "/usr/lib/crtend.o" "/usr/lib/crtn.o"
CC_OUTPUT_921dbbb2_58173849=yes
CC_OUTPUT_921dbbb2_9bdba57c=yes
CC_OUTPUT_921dbbb2_6a4fe7f5=cc1: error: unrecognized command line option "-std=c11"
CC_OUTPUT_921dbbb2_6bcac02b=yes
CC_OUTPUT_921dbbb2_67d20829=yes
CC_OUTPUT_921dbbb2_bfa62e83=cc1: error: unrecognized command line option "-std=gnu11"
CC_OUTPUT_921dbbb2_f0b4d593=yes
CC_OUTPUT_921dbbb2_308abb44=cc1plus: error: unrecognized command line option "-std=c++0x"
CC_OUTPUT_921dbbb2_f00456e5=cc1plus: error: unrecognized command line option "-std=c++11"
CC_OUTPUT_921dbbb2_65ad290d=cc1plus: error: unrecognized command line option "-std=c++14"
CC_OUTPUT_921dbbb2_f2776b26=cc1plus: error: unrecognized command line option "-std=c++17"
CC_OUTPUT_921dbbb2_b2657cc3=yes
CC_OUTPUT_921dbbb2_380987f7=cc1plus: error: unrecognized command line option "-std=gnu++11"
CC_OUTPUT_921dbbb2_160933ec=cc1plus: error: unrecognized command line option "-std=gnu++14"
CC_OUTPUT_921dbbb2_fb62803b=cc1plus: error: unrecognized command line option "-std=gnu++17"
_OBJC_CCVERSION_921dbbb2=cc (GCC) 4.2.1 20070831 patched [FreeBSD] Copyright (C) 2007 Free Software Foundation, Inc. This is free software; see the source for copying conditions. There is NO warranty; not even for MERCHANTABILITY or FITNESS FOR A PARTICULAR PURPOSE.
_OBJC_ALTCCVERSION_921dbbb2=none
ARCH=powerpc64
PPC_ABI=ELFv1
OPSYS=FreeBSD
_OSRELEASE=12.2-RELEASE
OSREL=12.2
OSVERSION=1202000
PYTHONBASE=/usr/local
CONFIGURE_MAX_CMD_LEN=524288
HAVE_PORTS_ENV=1
#### Misc Poudriere ####
GID=0
UID=0
---End make.conf---
--Resource limits--
cpu time               (seconds, -t)  unlimited
file size           (512-blocks, -f)  unlimited
data seg size           (kbytes, -d)  33554432
stack size              (kbytes, -s)  524288
core file size      (512-blocks, -c)  unlimited
max memory size         (kbytes, -m)  unlimited
locked memory           (kbytes, -l)  unlimited
max user processes              (-u)  89999
open files                      (-n)  1024
virtual mem size        (kbytes, -v)  unlimited
swap limit              (kbytes, -w)  unlimited
socket buffer size       (bytes, -b)  unlimited
pseudo-terminals                (-p)  unlimited
kqueues                         (-k)  unlimited
umtx shared locks               (-o)  unlimited
--End resource limits--
=======================<phase: check-sanity   >============================
===>   NOTICE:

The afl port currently does not have a maintainer. As a result, it is
more likely to have unresolved issues, not be up-to-date, or even be removed in
the future. To volunteer to maintain this port, please create an issue at:

https://bugs.freebsd.org/bugzilla

More information about port maintainership is available at:

https://www.freebsd.org/doc/en/articles/contributing/ports-contributing.html#maintain-port

===>  License APACHE20 accepted by the user
===========================================================================
=======================<phase: pkg-depends    >============================
===>   afl++-2.63c depends on file: /usr/local/sbin/pkg - not found
===>   Installing existing package /packages/All/pkg-1.16.3.txz
[122powerpc64-quarterly-job-05] Installing pkg-1.16.3...
[122powerpc64-quarterly-job-05] Extracting pkg-1.16.3: .......... done
===>   afl++-2.63c depends on file: /usr/local/sbin/pkg - found
===>   Returning to build of afl++-2.63c
===========================================================================
=======================<phase: fetch-depends  >============================
===========================================================================
=======================<phase: fetch          >============================
===>   NOTICE:

The afl port currently does not have a maintainer. As a result, it is
more likely to have unresolved issues, not be up-to-date, or even be removed in
the future. To volunteer to maintain this port, please create an issue at:

https://bugs.freebsd.org/bugzilla

More information about port maintainership is available at:

https://www.freebsd.org/doc/en/articles/contributing/ports-contributing.html#maintain-port

===>  License APACHE20 accepted by the user
===> Fetching all distfiles required by afl++-2.63c for building
===========================================================================
=======================<phase: checksum       >============================
===>   NOTICE:

The afl port currently does not have a maintainer. As a result, it is
more likely to have unresolved issues, not be up-to-date, or even be removed in
the future. To volunteer to maintain this port, please create an issue at:

https://bugs.freebsd.org/bugzilla

More information about port maintainership is available at:

https://www.freebsd.org/doc/en/articles/contributing/ports-contributing.html#maintain-port

===>  License APACHE20 accepted by the user
===> Fetching all distfiles required by afl++-2.63c for building
=> SHA256 Checksum OK for AFLplusplus-AFLplusplus-2.63c_GH0.tar.gz.
===========================================================================
=======================<phase: extract-depends>============================
===========================================================================
=======================<phase: extract        >============================
===>   NOTICE:

The afl port currently does not have a maintainer. As a result, it is
more likely to have unresolved issues, not be up-to-date, or even be removed in
the future. To volunteer to maintain this port, please create an issue at:

https://bugs.freebsd.org/bugzilla

More information about port maintainership is available at:

https://www.freebsd.org/doc/en/articles/contributing/ports-contributing.html#maintain-port

===>  License APACHE20 accepted by the user
===> Fetching all distfiles required by afl++-2.63c for building
===>  Extracting for afl++-2.63c
=> SHA256 Checksum OK for AFLplusplus-AFLplusplus-2.63c_GH0.tar.gz.
===========================================================================
=======================<phase: patch-depends  >============================
===========================================================================
=======================<phase: patch          >============================
===>  Patching for afl++-2.63c
===>  Applying FreeBSD patches for afl++-2.63c from /usr/ports/security/afl++/files
===========================================================================
=======================<phase: build-depends  >============================
===>   afl++-2.63c depends on executable: ginstall - not found
===>   Installing existing package /packages/All/coreutils-8.32.txz
[122powerpc64-quarterly-job-05] Installing coreutils-8.32...
[122powerpc64-quarterly-job-05] `-- Installing gettext-runtime-0.21...
[122powerpc64-quarterly-job-05] |   `-- Installing indexinfo-0.3.1...
[122powerpc64-quarterly-job-05] |   `-- Extracting indexinfo-0.3.1: .... done
[122powerpc64-quarterly-job-05] `-- Extracting gettext-runtime-0.21: .......... done
[122powerpc64-quarterly-job-05] Extracting coreutils-8.32: .......... done
===>   afl++-2.63c depends on executable: ginstall - found
===>   Returning to build of afl++-2.63c
===>   afl++-2.63c depends on package: gcc10>0 - not found
===>   Installing existing package /packages/All/gcc10-10.2.0_1.txz
[122powerpc64-quarterly-job-05] Installing gcc10-10.2.0_1...
[122powerpc64-quarterly-job-05] `-- Installing binutils-2.33.1_4,1...
[122powerpc64-quarterly-job-05] `-- Extracting binutils-2.33.1_4,1: .......... done
[122powerpc64-quarterly-job-05] `-- Installing gcc9-9.3.0_3...
[122powerpc64-quarterly-job-05] |   `-- Installing gmp-6.2.1...
[122powerpc64-quarterly-job-05] |   `-- Extracting gmp-6.2.1: .......... done
[122powerpc64-quarterly-job-05] |   `-- Installing mpc-1.2.0...
[122powerpc64-quarterly-job-05] |   | `-- Installing mpfr-4.1.0...
[122powerpc64-quarterly-job-05] |   | `-- Extracting mpfr-4.1.0: .......... done
[122powerpc64-quarterly-job-05] |   `-- Extracting mpc-1.2.0: ......... done
[122powerpc64-quarterly-job-05] `-- Extracting gcc9-9.3.0_3: .......... done
[122powerpc64-quarterly-job-05] Extracting gcc10-10.2.0_1: .......... done
=====
Message from gcc9-9.3.0_3:

--
To ensure binaries built with this toolchain find appropriate versions
of the necessary run-time libraries, you may want to link using

  -Wl,-rpath=/usr/local/lib/gcc9

For ports leveraging USE_GCC, USES=compiler, or USES=fortran this happens
transparently.
=====
Message from gcc10-10.2.0_1:

--
To ensure binaries built with this toolchain find appropriate versions
of the necessary run-time libraries, you may want to link using

  -Wl,-rpath=/usr/local/lib/gcc10

For ports leveraging USE_GCC, USES=compiler, or USES=fortran this happens
transparently.
===>   afl++-2.63c depends on package: gcc10>0 - found
===>   Returning to build of afl++-2.63c
===>   afl++-2.63c depends on executable: clang90 - not found
===>   Installing existing package /packages/All/llvm90-9.0.1_3.txz
[122powerpc64-quarterly-job-05] Installing llvm90-9.0.1_3...
[122powerpc64-quarterly-job-05] `-- Installing libedit-3.1.20210216,1...
[122powerpc64-quarterly-job-05] `-- Extracting libedit-3.1.20210216,1: .......... done
[122powerpc64-quarterly-job-05] `-- Installing libxml2-2.9.10_4...
[122powerpc64-quarterly-job-05] `-- Extracting libxml2-2.9.10_4: .......... done
[122powerpc64-quarterly-job-05] `-- Installing perl5-5.32.1_1...
[122powerpc64-quarterly-job-05] `-- Extracting perl5-5.32.1_1: .......... done
[122powerpc64-quarterly-job-05] `-- Installing python37-3.7.10...
[122powerpc64-quarterly-job-05] |   `-- Installing libffi-3.3_1...
[122powerpc64-quarterly-job-05] |   `-- Extracting libffi-3.3_1: .......... done
[122powerpc64-quarterly-job-05] |   `-- Installing readline-8.1.0...
[122powerpc64-quarterly-job-05] |   `-- Extracting readline-8.1.0: .......... done
[122powerpc64-quarterly-job-05] `-- Extracting python37-3.7.10: .......... done
[122powerpc64-quarterly-job-05] Extracting llvm90-9.0.1_3: .......... done
=====
Message from python37-3.7.10:

--
Note that some standard Python modules are provided as separate ports
as they require additional dependencies. They are available as:

py37-gdbm       databases/py-gdbm_at_py37
py37-sqlite3    databases/py-sqlite3_at_py37
py37-tkinter    x11-toolkits/py-tkinter_at_py37
===>   afl++-2.63c depends on executable: clang90 - found
===>   Returning to build of afl++-2.63c
===>   afl++-2.63c depends on package: gmake>=4.3 - not found
===>   Installing existing package /packages/All/gmake-4.3_2.txz
[122powerpc64-quarterly-job-05] Installing gmake-4.3_2...
[122powerpc64-quarterly-job-05] Extracting gmake-4.3_2: .......... done
===>   afl++-2.63c depends on package: gmake>=4.3 - found
===>   Returning to build of afl++-2.63c
===>   afl++-2.63c depends on file: /usr/local/bin/python3.7 - found
===========================================================================
=======================<phase: lib-depends    >============================
===>   afl++-2.63c depends on shared library: libintl.so - found (/usr/local/lib/libintl.so)
===========================================================================
=======================<phase: configure      >============================
===>  Configuring for afl++-2.63c
===========================================================================
=======================<phase: build          >============================
===>  Building for afl++-2.63c
gmake[1]: Entering directory '/wrkdirs/usr/ports/security/afl++/work/AFLplusplus-2.63c'
[!] Note: skipping x86 compilation checks (AFL_NO_X86 set).
[-] shmat seems not to be working, switching to mmap implementation
[-] You seem to need to install the package python3-dev or python2-dev (and perhaps python[23]-apt), but it is optional so we continue
[+] Everything seems to be working, ready to compile.
clang90 -O2 -pipe  -fstack-protector-strong -fno-strict-aliasing  -Wall -g -Wno-pointer-sign -I include/ -Werror -DAFL_PATH=\"/usr/local/lib/afl\" -DBIN_PATH=\"/usr/local/bin\" -DDOC_PATH=\"/usr/local/share/doc/afl\" src/afl-gcc.c -o afl-gcc  -fstack-protector-strong  -lpthread -Wno-deprecated-declarations
ld: error: crtstuff.c:(.text+0x16): relocation R_PPC64_TOC16_DS out of range: -32808 is not in [-32768, 32767]
ld: error: crtstuff.c:(.text+0x12): relocation R_PPC64_TOC16_DS out of range: -32776 is not in [-32768, 32767]
ld: error: /usr/src/lib/csu/common/ignore_init.c:136:(.text+0x32): relocation R_PPC64_TOC16_DS out of range: -32936 is not in [-32768, 32767]
ld: error: crtstuff.c:(.text+0x2E): relocation R_PPC64_TOC16_DS out of range: -32800 is not in [-32768, 32767]
ld: error: /usr/src/lib/csu/common/ignore_init.c:139:(.text+0x5A): relocation R_PPC64_TOC16_DS out of range: -32928 is not in [-32768, 32767]
ld: error: crtstuff.c:(.text+0xA6): relocation R_PPC64_TOC16_DS out of range: -32792 is not in [-32768, 32767]
ld: error: /usr/src/lib/csu/powerpc64/crt1.c:85:(.text+0xAE): relocation R_PPC64_TOC16_DS out of range: -32920 is not in [-32768, 32767]
ld: error: crtstuff.c:(.text+0xBE): relocation R_PPC64_TOC16_DS out of range: -32784 is not in [-32768, 32767]
ld: error: /usr/src/lib/csu/powerpc64/crt1.c:86:(.text+0xBA): relocation R_PPC64_TOC16_DS out of range: -32912 is not in [-32768, 32767]
ld: error: /usr/src/lib/csu/powerpc64/crt1.c:96:(.text+0xDA): relocation R_PPC64_TOC16_DS out of range: -32848 is not in [-32768, 32767]
ld: error: /usr/src/lib/csu/powerpc64/crt1.c:96:(.text+0x106): relocation R_PPC64_TOC16_DS out of range: -32840 is not in [-32768, 32767]
ld: error: /usr/src/lib/csu/powerpc64/crt1.c:88:(.text+0x12A): relocation R_PPC64_TOC16_DS out of range: -32904 is not in [-32768, 32767]
ld: error: /usr/src/lib/csu/common/ignore_init.c:114:(.text+0x14A): relocation R_PPC64_TOC16_DS out of range: -32912 is not in [-32768, 32767]
ld: error: /usr/src/lib/csu/common/ignore_init.c:114:(.text+0x14E): relocation R_PPC64_TOC16_DS out of range: -32896 is not in [-32768, 32767]
ld: error: /usr/src/lib/csu/common/ignore_init.c:116:(.text+0x16A): relocation R_PPC64_TOC16_DS out of range: -32888 is not in [-32768, 32767]
ld: error: /usr/src/lib/csu/common/ignore_init.c:116:(.text+0x16E): relocation R_PPC64_TOC16_DS out of range: -32880 is not in [-32768, 32767]
ld: error: /usr/src/lib/csu/common/ignore_init.c:122:(.text+0x1CE): relocation R_PPC64_TOC16_DS out of range: -32872 is not in [-32768, 32767]
ld: error: /usr/src/lib/csu/common/ignore_init.c:123:(.text+0x1EE): relocation R_PPC64_TOC16_DS out of range: -32864 is not in [-32768, 32767]
ld: error: /usr/src/lib/csu/common/ignore_init.c:123:(.text+0x1F2): relocation R_PPC64_TOC16_DS out of range: -32856 is not in [-32768, 32767]
ld: error: /usr/src/lib/csu/common/ignore_init.c:96:(.text+0x262): relocation R_PPC64_TOC16_DS out of range: -32824 is not in [-32768, 32767]
ld: error: too many errors emitted, stopping now (use -error-limit=0 to see all errors)
clang-9: error: linker command failed with exit code 1 (use -v to see invocation)
gmake[1]: *** [GNUmakefile:278: afl-gcc] Error 1
gmake[1]: Leaving directory '/wrkdirs/usr/ports/security/afl++/work/AFLplusplus-2.63c'
===> Compilation failed unexpectedly.
Try to set MAKE_JOBS_UNSAFE=yes and rebuild before reporting the failure to
the maintainer.
*** Error code 1

Stop.
make: stopped in /usr/ports/security/afl++
Received on Tue Jun 22 2021 - 03:27:10 UTC

Original text of this message