[package - 122arm64-quarterly][math/PDL] Failed for PDL-2.019_4 in build

From: <pkg-fallout_at_FreeBSD.org>
Date: Tue, 22 Jun 2021 01:19:05 GMT
You are receiving this mail as a port that you maintain
is failing to build on the FreeBSD package build server.
Please investigate the failure and submit a PR to fix
build.

Maintainer:     perl_at_FreeBSD.org
Log URL:        http://ampere1.nyi.freebsd.org/data/122arm64-quarterly/dbe1c4c35016/logs/PDL-2.019_4.log
Build URL:      http://ampere1.nyi.freebsd.org/build.html?mastername=122arm64-quarterly&build=dbe1c4c35016
Log:

=>> Building math/PDL
build started at Tue Jun 22 01:13:25 UTC 2021
port directory: /usr/ports/math/PDL
package name: PDL-2.019_4
building for: FreeBSD 122arm64-quarterly-job-07 12.2-RELEASE FreeBSD 12.2-RELEASE arm64
maintained by: perl_at_FreeBSD.org
Makefile ident: 
Poudriere version: 3.2.8-8-gaf08dbda
Host OSVERSION: 1400008
Jail OSVERSION: 1202000
Job Id: 07

---Begin Environment---
SHELL=/bin/csh
OSVERSION=1202000
UNAME_v=FreeBSD 12.2-RELEASE
UNAME_r=12.2-RELEASE
BLOCKSIZE=K
MAIL=/var/mail/root
STATUS=1
HOME=/root
PATH=/sbin:/bin:/usr/sbin:/usr/bin:/usr/local/sbin:/usr/local/bin:/root/bin
LOCALBASE=/usr/local
USER=root
LIBEXECPREFIX=/usr/local/libexec/poudriere
POUDRIERE_VERSION=3.2.8-8-gaf08dbda
MASTERMNT=/usr/local/poudriere/data/.m/122arm64-quarterly/ref
POUDRIERE_BUILD_TYPE=bulk
PACKAGE_BUILDING=yes
SAVED_TERM=
PWD=/usr/local/poudriere/data/.m/122arm64-quarterly/ref/.p/pool
P_PORTS_FEATURES=FLAVORS SELECTED_OPTIONS
MASTERNAME=122arm64-quarterly
SCRIPTPREFIX=/usr/local/share/poudriere
OLDPWD=/usr/local/poudriere/data/.m/122arm64-quarterly/ref/.p
SCRIPTPATH=/usr/local/share/poudriere/bulk.sh
POUDRIEREPATH=/usr/local/bin/poudriere
---End Environment---

---Begin Poudriere Port Flags/Env---
PORT_FLAGS=
PKGENV=
FLAVOR=
DEPENDS_ARGS=
MAKE_ARGS=
---End Poudriere Port Flags/Env---

---Begin OPTIONS List---
===> The following configuration options are available for PDL-2.019_4:
     F77=on: Enable PDL::Minuit and PDL::Slatec
     FFTW=on: Enable PDL::FFTW
     GD=off: Enable PDL::IO::GD
     GSL=off: Enable PDL::GSL interface
     HDF=off: Enable PDL::IO::HDF interface
     OPENGL=off: Enable PDL::Graphics::TriD and OpenGL
     PGPLOT=on: Enable PDL::Graphics::PGPLOT
     PLPLOT=off: Enable PDL::Graphics::PLplot
     PROJ=off: Enable PDL::GIS::Proj interface
     READLINE=off: Use GNU readline
     SINK=off: Include PDL kitchen sink
===> Use 'make config' to modify these settings
---End OPTIONS List---

--MAINTAINER--
perl_at_FreeBSD.org
--End MAINTAINER--

--CONFIGURE_ARGS--
INSTALLDIRS="site" CC="cc" CCFLAGS="-O2 -pipe  -fstack-protector-strong -fno-strict-aliasing " LD="cc" PREFIX="/usr/local"  INSTALLPRIVLIB="/usr/local/lib" INSTALLARCHLIB="/usr/local/lib"
--End CONFIGURE_ARGS--

--CONFIGURE_ENV--
MAKE=gmake ac_cv_path_PERL=/usr/local/bin/perl ac_cv_path_PERL_PATH=/usr/local/bin/perl  PERL_USE_UNSAFE_INC=1 XDG_DATA_HOME=/wrkdirs/usr/ports/math/PDL/work  XDG_CONFIG_HOME=/wrkdirs/usr/ports/math/PDL/work  HOME=/wrkdirs/usr/ports/math/PDL/work TMPDIR="/tmp" PATH=/wrkdirs/usr/ports/math/PDL/work/.bin:/sbin:/bin:/usr/sbin:/usr/bin:/usr/local/sbin:/usr/local/bin:/root/bin SHELL=/bin/sh CONFIG_SHELL=/bin/sh PERL_EXTUTILS_AUTOINSTALL="--skipdeps" PERL_MM_USE_DEFAULT="YES"
--End CONFIGURE_ENV--

--MAKE_ENV--
PERL5LIB=/wrkdirs/usr/ports/math/PDL/work/PDL-2.019/blib/lib PERL_USE_UNSAFE_INC=1 XDG_DATA_HOME=/wrkdirs/usr/ports/math/PDL/work  XDG_CONFIG_HOME=/wrkdirs/usr/ports/math/PDL/work  HOME=/wrkdirs/usr/ports/math/PDL/work TMPDIR="/tmp" PATH=/wrkdirs/usr/ports/math/PDL/work/.bin:/sbin:/bin:/usr/sbin:/usr/bin:/usr/local/sbin:/usr/local/bin:/root/bin NO_PIE=yes MK_DEBUG_FILES=no MK_KERNEL_SYMBOLS=no SHELL=/bin/sh NO_LINT=YES PREFIX=/usr/local  LOCALBASE=/usr/local  CC="cc" CFLAGS="-O2 -pipe  -fstack-protector-strong -fno-strict-aliasing "  CPP="cpp" CPPFLAGS=""  LDFLAGS=" -fstack-protector-strong " LIBS=""  CXX="c++" CXXFLAGS="-O2 -pipe -fstack-protector-strong -fno-strict-aliasing  "  MANPREFIX="/usr/local" BSD_INSTALL_PROGRAM="install  -s -m 555"  BSD_INSTALL_LIB="install  -s -m 0644"  BSD_INSTALL_SCRIPT="install  -m 555"  BSD_INSTALL_DATA="install  -m 0644"  BSD_INSTALL_MAN="install  -m 444"
--End MAKE_ENV--

--PLIST_SUB--
OSREL=12.2 PREFIX=%D LOCALBASE=/usr/local  RESETPREFIX=/usr/local LIB32DIR=lib PERL_VERSION=5.32.1  PERL_VER=5.32  PERL5_MAN1=lib/perl5/site_perl/man/man1  PERL5_MAN3=lib/perl5/site_perl/man/man3  SITE_PERL=lib/perl5/site_perl  SITE_ARCH=lib/perl5/site_perl/mach/5.32 DOCSDIR="share/doc/PDL"  EXAMPLESDIR="share/examples/PDL"  DATADIR="share/PDL"  WWWDIR="www/PDL"  ETCDIR="etc/PDL"
--End PLIST_SUB--

--SUB_LIST--
PREFIX=/usr/local LOCALBASE=/usr/local  DATADIR=/usr/local/share/PDL DOCSDIR=/usr/local/share/doc/PDL EXAMPLESDIR=/usr/local/share/examples/PDL  WWWDIR=/usr/local/www/PDL ETCDIR=/usr/local/etc/PDL
--End SUB_LIST--

---Begin make.conf---
USE_PACKAGE_DEPENDS=yes
BATCH=yes
WRKDIRPREFIX=/wrkdirs
PORTSDIR=/usr/ports
PACKAGES=/packages
DISTDIR=/distfiles
PACKAGE_BUILDING=yes
PACKAGE_BUILDING_FLAVORS=yes
#### /usr/local/etc/poudriere.d/make.conf ####
# XXX: We really need this but cannot use it while 'make checksum' does not
# try the next mirror on checksum failure.  It currently retries the same
# failed mirror and then fails rather then trying another.  It *does*
# try the next if the size is mismatched though.
#MASTER_SITE_FREEBSD=yes
# Build ALLOW_MAKE_JOBS_PACKAGES with 2 jobs
MAKE_JOBS_NUMBER=2
#### /usr/ports/Mk/Scripts/ports_env.sh ####
_CCVERSION_921dbbb2=FreeBSD clang version 10.0.1 (git_at_github.com:llvm/llvm-project.git llvmorg-10.0.1-0-gef32c611aa2) Target: aarch64-unknown-freebsd12.2 Thread model: posix InstalledDir: /usr/bin
_ALTCCVERSION_921dbbb2=none
_CXXINTERNAL_acaad9ca=FreeBSD clang version 10.0.1 (git_at_github.com:llvm/llvm-project.git llvmorg-10.0.1-0-gef32c611aa2) Target: aarch64-unknown-freebsd12.2 Thread model: posix InstalledDir: /usr/bin "/usr/bin/ld" "--eh-frame-hdr" "-dynamic-linker" "/libexec/ld-elf.so.1" "--enable-new-dtags" "-o" "a.out" "/usr/lib/crt1.o" "/usr/lib/crti.o" "/usr/lib/crtbegin.o" "-L/usr/lib" "/dev/null" "-lc++" "-lm" "-lgcc" "--as-needed" "-lgcc_s" "--no-as-needed" "-lc" "-lgcc" "--as-needed" "-lgcc_s" "--no-as-needed" "/usr/lib/crtend.o" "/usr/lib/crtn.o"
CC_OUTPUT_921dbbb2_58173849=yes
CC_OUTPUT_921dbbb2_9bdba57c=yes
CC_OUTPUT_921dbbb2_6a4fe7f5=yes
CC_OUTPUT_921dbbb2_6bcac02b=yes
CC_OUTPUT_921dbbb2_67d20829=yes
CC_OUTPUT_921dbbb2_bfa62e83=yes
CC_OUTPUT_921dbbb2_f0b4d593=yes
CC_OUTPUT_921dbbb2_308abb44=yes
CC_OUTPUT_921dbbb2_f00456e5=yes
CC_OUTPUT_921dbbb2_65ad290d=yes
CC_OUTPUT_921dbbb2_f2776b26=yes
CC_OUTPUT_921dbbb2_b2657cc3=yes
CC_OUTPUT_921dbbb2_380987f7=yes
CC_OUTPUT_921dbbb2_160933ec=yes
CC_OUTPUT_921dbbb2_fb62803b=yes
_OBJC_CCVERSION_921dbbb2=FreeBSD clang version 10.0.1 (git_at_github.com:llvm/llvm-project.git llvmorg-10.0.1-0-gef32c611aa2) Target: aarch64-unknown-freebsd12.2 Thread model: posix InstalledDir: /usr/bin
_OBJC_ALTCCVERSION_921dbbb2=none
ARCH=aarch64
OPSYS=FreeBSD
_OSRELEASE=12.2-RELEASE
OSREL=12.2
OSVERSION=1202000
PYTHONBASE=/usr/local
CONFIGURE_MAX_CMD_LEN=524288
HAVE_PORTS_ENV=1
#### Misc Poudriere ####
GID=0
UID=0
---End make.conf---
--Resource limits--
cpu time               (seconds, -t)  unlimited
file size           (512-blocks, -f)  unlimited
data seg size           (kbytes, -d)  1048576
stack size              (kbytes, -s)  1048576
core file size      (512-blocks, -c)  unlimited
max memory size         (kbytes, -m)  unlimited
locked memory           (kbytes, -l)  unlimited
max user processes              (-u)  89999
open files                      (-n)  1024
virtual mem size        (kbytes, -v)  unlimited
swap limit              (kbytes, -w)  unlimited
socket buffer size       (bytes, -b)  unlimited
pseudo-terminals                (-p)  unlimited
kqueues                         (-k)  unlimited
umtx shared locks               (-o)  unlimited
--End resource limits--
=======================<phase: check-sanity   >============================
===>  License ART10 GPLv1+ accepted by the user
===========================================================================
=======================<phase: pkg-depends    >============================
===>   PDL-2.019_4 depends on file: /usr/local/sbin/pkg - not found
===>   Installing existing package /packages/All/pkg-1.16.3.txz
[122arm64-quarterly-job-07] Installing pkg-1.16.3...
[122arm64-quarterly-job-07] Extracting pkg-1.16.3: .......... done
===>   PDL-2.019_4 depends on file: /usr/local/sbin/pkg - found
===>   Returning to build of PDL-2.019_4
===========================================================================
=======================<phase: fetch-depends  >============================
===========================================================================
=======================<phase: fetch          >============================
===>  License ART10 GPLv1+ accepted by the user
===> Fetching all distfiles required by PDL-2.019_4 for building
===========================================================================
=======================<phase: checksum       >============================
===>  License ART10 GPLv1+ accepted by the user
===> Fetching all distfiles required by PDL-2.019_4 for building
=> SHA256 Checksum OK for PDL-2.019.tar.gz.
===========================================================================
=======================<phase: extract-depends>============================
===========================================================================
=======================<phase: extract        >============================
===>  License ART10 GPLv1+ accepted by the user
===> Fetching all distfiles required by PDL-2.019_4 for building
===>  Extracting for PDL-2.019_4
=> SHA256 Checksum OK for PDL-2.019.tar.gz.
===========================================================================
=======================<phase: patch-depends  >============================
===========================================================================
=======================<phase: patch          >============================
===>  Patching for PDL-2.019_4
===========================================================================
=======================<phase: build-depends  >============================
===>   PDL-2.019_4 depends on package: p5-Devel-CheckLib>=1.01 - not found
===>   Installing existing package /packages/All/p5-Devel-CheckLib-1.14.txz
[122arm64-quarterly-job-07] Installing p5-Devel-CheckLib-1.14...
[122arm64-quarterly-job-07] `-- Installing perl5-5.32.1_1...
[122arm64-quarterly-job-07] `-- Extracting perl5-5.32.1_1: .......... done
[122arm64-quarterly-job-07] Extracting p5-Devel-CheckLib-1.14: ......... done
===>   PDL-2.019_4 depends on package: p5-Devel-CheckLib>=1.01 - found
===>   Returning to build of PDL-2.019_4
===>   PDL-2.019_4 depends on package: p5-Pod-Parser>=0 - not found
<snip>
slatec/tqlrat.f:85:72:

   85 |   100 E2(I-1) = E2(I)
      |                                                                        1
Warning: Fortran 2018 deleted feature: DO termination statement which is not END DO or CONTINUE with label 100 at (1)
slatec/tqlrat.f:117:72:

  117 |   140    D(I) = D(I) - H
      |                                                                        1
Warning: Fortran 2018 deleted feature: DO termination statement which is not END DO or CONTINUE with label 140 at (1)
gfortran10 -c  -o slatec/tred1.o -O2 -pipe  -fstack-protector-strong -fno-strict-aliasing  slatec/tred1.f
slatec/tred1.f:75:72:

   75 |   100 D(I) = A(I,I)
      |                                                                        1
Warning: Fortran 2018 deleted feature: DO termination statement which is not END DO or CONTINUE with label 100 at (1)
slatec/tred1.f:85:72:

   85 |   120    SCALE = SCALE + ABS(A(I,K))
      |                                                                        1
Warning: Fortran 2018 deleted feature: DO termination statement which is not END DO or CONTINUE with label 120 at (1)
slatec/tred1.f:110:72:

  110 |   180       G = G + A(J,K) * A(I,K)
      |                                                                        1
Warning: Fortran 2018 deleted feature: DO termination statement which is not END DO or CONTINUE with label 180 at (1)
slatec/tred1.f:116:72:

  116 |   200       G = G + A(K,J) * A(I,K)
      |                                                                        1
Warning: Fortran 2018 deleted feature: DO termination statement which is not END DO or CONTINUE with label 200 at (1)
slatec/tred1.f:129:72:

  129 |             DO 260 K = 1, J
      |                                                                        1
Warning: Fortran 2018 deleted feature: Shared DO termination label 260 at (1)
slatec/tred1.f:134:72:

  134 |   280    A(I,K) = SCALE * A(I,K)
      |                                                                        1
Warning: Fortran 2018 deleted feature: DO termination statement which is not END DO or CONTINUE with label 280 at (1)
gfortran10 -c  -o slatec/tred2.o -O2 -pipe  -fstack-protector-strong -fno-strict-aliasing  slatec/tred2.f
slatec/tred2.f:74:72:

   74 |          DO 100 J = 1, I
      |                                                                        1
Warning: Fortran 2018 deleted feature: Shared DO termination label 100 at (1)
slatec/tred2.f:88:72:

   88 |   120    SCALE = SCALE + ABS(Z(I,K))
      |                                                                        1
Warning: Fortran 2018 deleted feature: DO termination statement which is not END DO or CONTINUE with label 120 at (1)
slatec/tred2.f:111:72:

  111 |   180       G = G + Z(J,K) * Z(I,K)
      |                                                                        1
Warning: Fortran 2018 deleted feature: DO termination statement which is not END DO or CONTINUE with label 180 at (1)
slatec/tred2.f:117:72:

  117 |   200       G = G + Z(K,J) * Z(I,K)
      |                                                                        1
Warning: Fortran 2018 deleted feature: DO termination statement which is not END DO or CONTINUE with label 200 at (1)
slatec/tred2.f:130:72:

  130 |             DO 260 K = 1, J
      |                                                                        1
Warning: Fortran 2018 deleted feature: Shared DO termination label 260 at (1)
slatec/tred2.f:148:72:

  148 |   340       G = G + Z(I,K) * Z(K,J)
      |                                                                        1
Warning: Fortran 2018 deleted feature: DO termination statement which is not END DO or CONTINUE with label 340 at (1)
slatec/tred2.f:150:72:

  150 |             DO 360 K = 1, L
      |                                                                        1
Warning: Fortran 2018 deleted feature: Shared DO termination label 360 at (1)
gfortran10 -c  -o slatec/xerbla.o -O2 -pipe  -fstack-protector-strong -fno-strict-aliasing  slatec/xerbla.f
gfortran10 -c  -o slatec/xercnt.o -O2 -pipe  -fstack-protector-strong -fno-strict-aliasing  slatec/xercnt.f
gfortran10 -c  -o slatec/xerhlt.o -O2 -pipe  -fstack-protector-strong -fno-strict-aliasing  slatec/xerhlt.f
gfortran10 -c  -o slatec/xermsg.o -O2 -pipe  -fstack-protector-strong -fno-strict-aliasing  slatec/xermsg.f
gfortran10 -c  -o slatec/xerprn.o -O2 -pipe  -fstack-protector-strong -fno-strict-aliasing  slatec/xerprn.f
gfortran10 -c  -o slatec/xersve.o -O2 -pipe  -fstack-protector-strong -fno-strict-aliasing  slatec/xersve.f
gfortran10 -c  -o slatec/xgetua.o -O2 -pipe  -fstack-protector-strong -fno-strict-aliasing  slatec/xgetua.f
rm -f ../../blib/arch/auto/PDL/Slatec/Slatec.so
LD_RUN_PATH="/usr/local/lib/gcc10/gcc/aarch64-portbld-freebsd12.2/10.2.0/../../.." cc  -shared  -L/usr/local/lib/perl5/5.32/mach/CORE -lperl -L/usr/local/lib -fstack-protector-strong  Slatec.o slatec/chfcm.o  slatec/chfdv.o  slatec/chfev.o  slatec/chfie.o  slatec/d1mach.o  slatec/dasum.o  slatec/daxpy.o  slatec/dchfcm.o  slatec/dchfdv.o  slatec/dchfev.o  slatec/dchfie.o  slatec/ddot.o  slatec/dgeco.o  slatec/dgedi.o  slatec/dgefa.o  slatec/dgesl.o  slatec/dp1vlu.o  slatec/dpchbs.o  slatec/dpchce.o  slatec/dpchci.o  slatec/dpchcm.o  slatec/dpchcs.o  slatec/dpchdf.o  slatec/dpchfd.o  slatec/dpchfe.o  slatec/dpchia.o  slatec/dpchic.o  slatec/dpchid.o  slatec/dpchim.o  slatec/dpchkt.o  slatec/dpchsp.o  slatec/dpchst.o  slatec/dpchsw.o  slatec/dpcoef.o  slatec/dpoco.o  slatec/dpodi.o  slatec/dpofa.o  slatec/dpolft.o  slatec/dscal.o  slatec/dswap.o  slatec/ezfft1.o  slatec/ezfftb.o  slatec/ezfftf.o  slatec/ezffti.o  slatec/fdump.o  slatec/i1mach.o  slatec/idamax.o  slatec/isamax.o  slatec/
 j4save.o  slatec/pchbs.o  slatec/pchce.o  slatec/pchci.o  slatec/pchcm.o  slatec/pchcs.o  slatec/pchdf.o  slatec/pchfd.o  slatec/pchfe.o  slatec/pchia.o  slatec/pchic.o  slatec/pchid.o  slatec/pchim.o  slatec/pchkt.o  slatec/pchsp.o  slatec/pchst.o  slatec/pchsw.o  slatec/pcoef.o  slatec/polfit.o  slatec/pvalue.o  slatec/pythag.o  slatec/r1mach.o  slatec/radb2.o  slatec/radb3.o  slatec/radb4.o  slatec/radb5.o  slatec/radbg.o  slatec/radf2.o  slatec/radf3.o  slatec/radf4.o  slatec/radf5.o  slatec/radfg.o  slatec/rfftb.o  slatec/rfftb1.o  slatec/rfftf.o  slatec/rfftf1.o  slatec/rs.o  slatec/sasum.o  slatec/saxpy.o  slatec/sdot.o  slatec/sgeco.o  slatec/sgedi.o  slatec/sgefa.o  slatec/sgesl.o  slatec/snrm2.o  slatec/spoco.o  slatec/spodi.o  slatec/spofa.o  slatec/srot.o  slatec/srotg.o  slatec/sscal.o  slatec/ssvdc.o  slatec/sswap.o  slatec/tql2.o  slatec/tqlrat.o  slatec/tred1.o  slatec/tred2.o  slatec/xerbla.o  slatec/xercnt.o  slatec/xerhlt.o  slatec/xermsg.o  slatec/xerprn.o  slate
 c/xersve.o  slatec/xgetua.o   -o ../../blib/!
 arch/auto/PDL/Slatec/Slatec.so  \
   -L/usr/local/lib/gcc10/gcc/aarch64-portbld-freebsd12.2/10.2.0/../../.. -L/usr/lib -lgfortran -lm   \
  
ld: error: relocation R_AARCH64_ADR_PREL_PG_HI21 cannot be used against symbol __stack_chk_guard; recompile with -fPIC
>>> defined in /lib/libc.so.7
>>> referenced by dgeco.f
>>>               slatec/dgeco.o:(dgeco_)

ld: error: can't create dynamic relocation R_AARCH64_ADD_ABS_LO12_NC against symbol: __stack_chk_guard in readonly segment; recompile object files with -fPIC or pass '-Wl,-z,notext' to allow text relocations in the output
>>> defined in /lib/libc.so.7
>>> referenced by dgeco.f
>>>               slatec/dgeco.o:(dgeco_)

ld: error: relocation R_AARCH64_ADR_PREL_PG_HI21 cannot be used against symbol __stack_chk_guard; recompile with -fPIC
>>> defined in /lib/libc.so.7
>>> referenced by dgeco.f
>>>               slatec/dgeco.o:(dgeco_)

ld: error: can't create dynamic relocation R_AARCH64_LDST64_ABS_LO12_NC against symbol: __stack_chk_guard in readonly segment; recompile object files with -fPIC or pass '-Wl,-z,notext' to allow text relocations in the output
>>> defined in /lib/libc.so.7
>>> referenced by dgeco.f
>>>               slatec/dgeco.o:(dgeco_)

ld: error: relocation R_AARCH64_ADR_PREL_PG_HI21 cannot be used against symbol __stack_chk_guard; recompile with -fPIC
>>> defined in /lib/libc.so.7
>>> referenced by dgedi.f
>>>               slatec/dgedi.o:(dgedi_)

ld: error: can't create dynamic relocation R_AARCH64_ADD_ABS_LO12_NC against symbol: __stack_chk_guard in readonly segment; recompile object files with -fPIC or pass '-Wl,-z,notext' to allow text relocations in the output
>>> defined in /lib/libc.so.7
>>> referenced by dgedi.f
>>>               slatec/dgedi.o:(dgedi_)

ld: error: relocation R_AARCH64_ADR_PREL_PG_HI21 cannot be used against symbol __stack_chk_guard; recompile with -fPIC
>>> defined in /lib/libc.so.7
>>> referenced by dgedi.f
>>>               slatec/dgedi.o:(dgedi_)

ld: error: can't create dynamic relocation R_AARCH64_LDST64_ABS_LO12_NC against symbol: __stack_chk_guard in readonly segment; recompile object files with -fPIC or pass '-Wl,-z,notext' to allow text relocations in the output
>>> defined in /lib/libc.so.7
>>> referenced by dgedi.f
>>>               slatec/dgedi.o:(dgedi_)

ld: error: relocation R_AARCH64_ADR_PREL_PG_HI21 cannot be used against symbol __stack_chk_guard; recompile with -fPIC
>>> defined in /lib/libc.so.7
>>> referenced by dgefa.f
>>>               slatec/dgefa.o:(dgefa_)

ld: error: can't create dynamic relocation R_AARCH64_ADD_ABS_LO12_NC against symbol: __stack_chk_guard in readonly segment; recompile object files with -fPIC or pass '-Wl,-z,notext' to allow text relocations in the output
>>> defined in /lib/libc.so.7
>>> referenced by dgefa.f
>>>               slatec/dgefa.o:(dgefa_)

ld: error: relocation R_AARCH64_ADR_PREL_PG_HI21 cannot be used against symbol __stack_chk_guard; recompile with -fPIC
>>> defined in /lib/libc.so.7
>>> referenced by dgefa.f
>>>               slatec/dgefa.o:(dgefa_)

ld: error: can't create dynamic relocation R_AARCH64_LDST64_ABS_LO12_NC against symbol: __stack_chk_guard in readonly segment; recompile object files with -fPIC or pass '-Wl,-z,notext' to allow text relocations in the output
>>> defined in /lib/libc.so.7
>>> referenced by dgefa.f
>>>               slatec/dgefa.o:(dgefa_)

ld: error: relocation R_AARCH64_ADR_PREL_PG_HI21 cannot be used against symbol __stack_chk_guard; recompile with -fPIC
>>> defined in /lib/libc.so.7
>>> referenced by dgesl.f
>>>               slatec/dgesl.o:(dgesl_)

ld: error: can't create dynamic relocation R_AARCH64_ADD_ABS_LO12_NC against symbol: __stack_chk_guard in readonly segment; recompile object files with -fPIC or pass '-Wl,-z,notext' to allow text relocations in the output
>>> defined in /lib/libc.so.7
>>> referenced by dgesl.f
>>>               slatec/dgesl.o:(dgesl_)

ld: error: relocation R_AARCH64_ADR_PREL_PG_HI21 cannot be used against symbol __stack_chk_guard; recompile with -fPIC
>>> defined in /lib/libc.so.7
>>> referenced by dgesl.f
>>>               slatec/dgesl.o:(dgesl_)

ld: error: can't create dynamic relocation R_AARCH64_LDST64_ABS_LO12_NC against symbol: __stack_chk_guard in readonly segment; recompile object files with -fPIC or pass '-Wl,-z,notext' to allow text relocations in the output
>>> defined in /lib/libc.so.7
>>> referenced by dgesl.f
>>>               slatec/dgesl.o:(dgesl_)

ld: error: relocation R_AARCH64_ADR_PREL_PG_HI21 cannot be used against symbol __stack_chk_guard; recompile with -fPIC
>>> defined in /lib/libc.so.7
>>> referenced by dp1vlu.f
>>>               slatec/dp1vlu.o:(dp1vlu_)

ld: error: can't create dynamic relocation R_AARCH64_ADD_ABS_LO12_NC against symbol: __stack_chk_guard in readonly segment; recompile object files with -fPIC or pass '-Wl,-z,notext' to allow text relocations in the output
>>> defined in /lib/libc.so.7
>>> referenced by dp1vlu.f
>>>               slatec/dp1vlu.o:(dp1vlu_)

ld: error: can't create dynamic relocation R_AARCH64_LDST64_ABS_LO12_NC against symbol: __stack_chk_guard in readonly segment; recompile object files with -fPIC or pass '-Wl,-z,notext' to allow text relocations in the output
>>> defined in /lib/libc.so.7
>>> referenced by dp1vlu.f
>>>               slatec/dp1vlu.o:(dp1vlu_)

ld: error: can't create dynamic relocation R_AARCH64_LDST64_ABS_LO12_NC against symbol: __stack_chk_guard in readonly segment; recompile object files with -fPIC or pass '-Wl,-z,notext' to allow text relocations in the output
>>> defined in /lib/libc.so.7
>>> referenced by dp1vlu.f
>>>               slatec/dp1vlu.o:(dp1vlu_)

ld: error: too many errors emitted, stopping now (use -error-limit=0 to see all errors)
cc: error: linker command failed with exit code 1 (use -v to see invocation)
gmake[3]: *** [Makefile:468: ../../blib/arch/auto/PDL/Slatec/Slatec.so] Error 1
gmake[3]: Leaving directory '/wrkdirs/usr/ports/math/PDL/work/PDL-2.019/Lib/Slatec'
gmake[2]: *** [Makefile:502: subdirs] Error 2
gmake[2]: Leaving directory '/wrkdirs/usr/ports/math/PDL/work/PDL-2.019/Lib'
gmake[1]: *** [Makefile:555: subdirs] Error 2
gmake[1]: Leaving directory '/wrkdirs/usr/ports/math/PDL/work/PDL-2.019'
*** Error code 1

Stop.
make: stopped in /usr/ports/math/PDL
Received on Tue Jun 22 2021 - 01:19:05 UTC

Original text of this message