[package - main-riscv64-default][cad/nvc] Failed for nvc-1.5.1 in build

From: <pkg-fallout_at_FreeBSD.org>
Date: Sat, 31 Jul 2021 14:24:34 GMT
You are receiving this mail as a port that you maintain
is failing to build on the FreeBSD package build server.
Please investigate the failure and submit a PR to fix
build.

Maintainer:     yuri_at_FreeBSD.org
Log URL:        http://beefy7.nyi.freebsd.org/data/main-riscv64-default/pe777a21158a3_s7685f8344d/logs/nvc-1.5.1.log
Build URL:      http://beefy7.nyi.freebsd.org/build.html?mastername=main-riscv64-default&build=pe777a21158a3_s7685f8344d
Log:

=>> Building cad/nvc
build started at Sat Jul 31 14:21:30 UTC 2021
port directory: /usr/ports/cad/nvc
package name: nvc-1.5.1
building for: FreeBSD main-riscv64-default-job-11 14.0-CURRENT FreeBSD 14.0-CURRENT 1400026 riscv
maintained by: yuri_at_FreeBSD.org
Makefile ident: 
Poudriere version: 3.2.8-21-g883afb07
Host OSVERSION: 1400008
Jail OSVERSION: 1400026
Job Id: 11




!!! Jail is newer than host. (Jail: 1400026, Host: 1400008) !!!
!!! This is not supported. !!!
!!! Host kernel must be same or newer than jail. !!!
!!! Expect build failures. !!!



---Begin Environment---
SHELL=/bin/csh
UNAME_p=riscv64
UNAME_m=riscv
ABI_FILE=/usr/lib/crt1.o
OSVERSION=1400026
UNAME_v=FreeBSD 14.0-CURRENT 1400026
UNAME_r=14.0-CURRENT
BLOCKSIZE=K
MAIL=/var/mail/root
MM_CHARSET=UTF-8
LANG=C.UTF-8
STATUS=1
HOME=/root
PATH=/sbin:/bin:/usr/sbin:/usr/bin:/usr/local/sbin:/usr/local/bin:/root/bin
LOCALBASE=/usr/local
QEMU_EMULATING=1
USER=root
LIBEXECPREFIX=/usr/local/libexec/poudriere
POUDRIERE_VERSION=3.2.8-21-g883afb07
MASTERMNT=/usr/local/poudriere/data/.m/main-riscv64-default/ref
POUDRIERE_BUILD_TYPE=bulk
PACKAGE_BUILDING=yes
SAVED_TERM=
PWD=/usr/local/poudriere/data/.m/main-riscv64-default/ref/.p/pool
P_PORTS_FEATURES=FLAVORS SELECTED_OPTIONS
MASTERNAME=main-riscv64-default
SCRIPTPREFIX=/usr/local/share/poudriere
OLDPWD=/usr/local/poudriere/data/.m/main-riscv64-default/ref/.p
SCRIPTPATH=/usr/local/share/poudriere/bulk.sh
POUDRIEREPATH=/usr/local/bin/poudriere
---End Environment---

---Begin Poudriere Port Flags/Env---
PORT_FLAGS=
PKGENV=
FLAVOR=
DEPENDS_ARGS=
MAKE_ARGS=
---End Poudriere Port Flags/Env---

---Begin OPTIONS List---
---End OPTIONS List---

--MAINTAINER--
yuri_at_FreeBSD.org
--End MAINTAINER--

--CONFIGURE_ARGS--
--with-llvm=/usr/local/bin/llvm-config90 --prefix=/usr/local ${_LATE_CONFIGURE_ARGS}
--End CONFIGURE_ARGS--

--CONFIGURE_ENV--
MAKE=gmake PKG_CONFIG=pkgconf XDG_DATA_HOME=/wrkdirs/usr/ports/cad/nvc/work  XDG_CONFIG_HOME=/wrkdirs/usr/ports/cad/nvc/work  HOME=/wrkdirs/usr/ports/cad/nvc/work TMPDIR="/tmp" PATH=/wrkdirs/usr/ports/cad/nvc/work/.bin:/sbin:/bin:/usr/sbin:/usr/bin:/usr/local/sbin:/usr/local/bin:/root/bin SHELL=/bin/sh CONFIG_SHELL=/bin/sh CMAKE_PREFIX_PATH="/usr/local" CONFIG_SITE=/usr/ports/Templates/config.site lt_cv_sys_max_cmd_len=524288
--End CONFIGURE_ENV--

--MAKE_ENV--
XDG_DATA_HOME=/wrkdirs/usr/ports/cad/nvc/work  XDG_CONFIG_HOME=/wrkdirs/usr/ports/cad/nvc/work  HOME=/wrkdirs/usr/ports/cad/nvc/work TMPDIR="/tmp" PATH=/wrkdirs/usr/ports/cad/nvc/work/.bin:/sbin:/bin:/usr/sbin:/usr/bin:/usr/local/sbin:/usr/local/bin:/root/bin NO_PIE=yes MK_DEBUG_FILES=no MK_KERNEL_SYMBOLS=no SHELL=/bin/sh NO_LINT=YES PREFIX=/usr/local  LOCALBASE=/usr/local  CC="/nxb-bin/usr/bin/cc" CFLAGS="-O2 -pipe -march=rv64imafdc -mabi=lp64d  -fstack-protector-strong -isystem /usr/local/include -fno-strict-aliasing "  CPP="/nxb-bin/usr/bin/cpp" CPPFLAGS="-isystem /usr/local/include"  LDFLAGS=" -lexecinfo -fstack-protector-strong " LIBS="-L/usr/local/lib"  CXX="/nxb-bin/usr/bin/c++" CXXFLAGS="-O2 -pipe -march=rv64imafdc -mabi=lp64d -fstack-protector-strong -isystem /usr/local/include -fno-strict-aliasing  -isystem /usr/local/include "  MANPREFIX="/usr/local" BSD_INSTALL_PROGRAM="install  -s -m 555"  BSD_INSTALL_LIB="install  -s -m 0644"  BSD_INSTALL_SCRIPT="install  -m 555"  BSD_I
 NSTALL_DATA="install  -m 0644"  BSD_INSTALL_MAN="install  -m 444"
--End MAKE_ENV--

--PLIST_SUB--
OSREL=14.0 PREFIX=%D LOCALBASE=/usr/local  RESETPREFIX=/usr/local LIB32DIR=lib DOCSDIR="share/doc/nvc"  EXAMPLESDIR="share/examples/nvc"  DATADIR="share/nvc"  WWWDIR="www/nvc"  ETCDIR="etc/nvc"
--End PLIST_SUB--

--SUB_LIST--
PREFIX=/usr/local LOCALBASE=/usr/local  DATADIR=/usr/local/share/nvc DOCSDIR=/usr/local/share/doc/nvc EXAMPLESDIR=/usr/local/share/examples/nvc  WWWDIR=/usr/local/www/nvc ETCDIR=/usr/local/etc/nvc
--End SUB_LIST--

---Begin make.conf---
.sinclude "/etc/make.nxb.conf"
USE_PACKAGE_DEPENDS=yes
BATCH=yes
WRKDIRPREFIX=/wrkdirs
PORTSDIR=/usr/ports
PACKAGES=/packages
DISTDIR=/distfiles
PACKAGE_BUILDING=yes
PACKAGE_BUILDING_FLAVORS=yes
MACHINE=riscv
MACHINE_ARCH=riscv64
ARCH=${MACHINE_ARCH}
#### /usr/local/etc/poudriere.d/make.conf ####
# XXX: We really need this but cannot use it while 'make checksum' does not
# try the next mirror on checksum failure.  It currently retries the same
# failed mirror and then fails rather then trying another.  It *does*
# try the next if the size is mismatched though.
#MASTER_SITE_FREEBSD=yes
# Build ALLOW_MAKE_JOBS_PACKAGES with 2 jobs
MAKE_JOBS_NUMBER=2
#### /usr/ports/Mk/Scripts/ports_env.sh ####
_CCVERSION_9d218390=FreeBSD clang version 12.0.1 (git_at_github.com:llvm/llvm-project.git llvmorg-12.0.1-0-gfed41342a82f) Target: riscv64-unknown-freebsd14.0 Thread model: posix InstalledDir: /nxb-bin/usr/bin
_ALTCCVERSION_9d218390=none
_CXXINTERNAL_9c45a5b1=FreeBSD clang version 12.0.1 (git_at_github.com:llvm/llvm-project.git llvmorg-12.0.1-0-gfed41342a82f) Target: riscv64-unknown-freebsd14.0 Thread model: posix InstalledDir: /nxb-bin/usr/bin "/nxb-bin/usr/bin/ld" "--eh-frame-hdr" "-dynamic-linker" "/libexec/ld-elf.so.1" "--enable-new-dtags" "-m" "elf64lriscv" "-o" "a.out" "/usr/lib/crt1.o" "/usr/lib/crti.o" "/usr/lib/crtbegin.o" "-L/usr/lib" "/dev/null" "-lc++" "-lm" "-lgcc" "--as-needed" "-lgcc_s" "--no-as-needed" "-lc" "-lgcc" "--as-needed" "-lgcc_s" "--no-as-needed" "/usr/lib/crtend.o" "/usr/lib/crtn.o"
CC_OUTPUT_9d218390_58173849=yes
CC_OUTPUT_9d218390_9bdba57c=yes
CC_OUTPUT_9d218390_6a4fe7f5=yes
CC_OUTPUT_9d218390_6bcac02b=yes
CC_OUTPUT_9d218390_67d20829=yes
CC_OUTPUT_9d218390_bfa62e83=yes
CC_OUTPUT_9d218390_f0b4d593=yes
CC_OUTPUT_9d218390_308abb44=yes
CC_OUTPUT_9d218390_f00456e5=yes
CC_OUTPUT_9d218390_65ad290d=yes
CC_OUTPUT_9d218390_f2776b26=yes
CC_OUTPUT_9d218390_b2657cc3=yes
CC_OUTPUT_9d218390_380987f7=yes
CC_OUTPUT_9d218390_160933ec=yes
CC_OUTPUT_9d218390_fb62803b=yes
_OBJC_CCVERSION_9d218390=FreeBSD clang version 12.0.1 (git_at_github.com:llvm/llvm-project.git llvmorg-12.0.1-0-gfed41342a82f) Target: riscv64-unknown-freebsd14.0 Thread model: posix InstalledDir: /nxb-bin/usr/bin
_OBJC_ALTCCVERSION_9d218390=none
ARCH=riscv64
OPSYS=FreeBSD
_OSRELEASE=14.0-CURRENT
OSREL=14.0
OSVERSION=1400026
PYTHONBASE=/usr/local
CONFIGURE_MAX_CMD_LEN=524288
HAVE_PORTS_ENV=1
#### Misc Poudriere ####
GID=0
UID=0
DISABLE_MAKE_JOBS=poudriere
---End make.conf---
---Begin make.nxb.conf---
CC=/nxb-bin/usr/bin/cc
CPP=/nxb-bin/usr/bin/cpp
CXX=/nxb-bin/usr/bin/c++
NM=/nxb-bin/usr/bin/nm
LD=/nxb-bin/usr/bin/ld
OBJCOPY=/nxb-bin/usr/bin/objcopy
SIZE=/nxb-bin/usr/bin/size
STRIPBIN=/nxb-bin/usr/bin/strip
SED=/nxb-bin/usr/bin/sed
RANLIB=/nxb-bin/usr/bin/ranlib
YACC=/nxb-bin/usr/bin/yacc
MAKE=/nxb-bin/usr/bin/make
STRINGS=/nxb-bin/usr/bin/strings
AWK=/nxb-bin/usr/bin/awk
FLEX=/nxb-bin/usr/bin/flex
---End make.nxb.conf---
--Resource limits--
cpu time               (seconds, -t)  unlimited
file size           (512-blocks, -f)  unlimited
data seg size           (kbytes, -d)  33554432
stack size              (kbytes, -s)  524288
core file size      (512-blocks, -c)  unlimited
max memory size         (kbytes, -m)  unlimited
locked memory           (kbytes, -l)  unlimited
max user processes              (-u)  89999
open files                      (-n)  1024
virtual mem size        (kbytes, -v)  unlimited
swap limit              (kbytes, -w)  unlimited
socket buffer size       (bytes, -b)  unlimited
pseudo-terminals                (-p)  unlimited
kqueues                         (-k)  unlimited
umtx shared locks               (-o)  unlimited
--End resource limits--
=======================<phase: check-sanity   >============================
===>  License GPLv3 accepted by the user
===========================================================================
=======================<phase: pkg-depends    >============================
===>   nvc-1.5.1 depends on file: /usr/local/sbin/pkg - not found
===>   Installing existing package /packages/All/pkg-1.17.1.pkg
[main-riscv64-default-job-11] Installing pkg-1.17.1...
[main-riscv64-default-job-11] Extracting pkg-1.17.1: .......... done
===>   nvc-1.5.1 depends on file: /usr/local/sbin/pkg - found
===>   Returning to build of nvc-1.5.1
===========================================================================
=======================<phase: fetch-depends  >============================
===========================================================================
=======================<phase: fetch          >============================
===>  License GPLv3 accepted by the user
===> Fetching all distfiles required by nvc-1.5.1 for building
===========================================================================
=======================<phase: checksum       >============================
===>  License GPLv3 accepted by the user
===> Fetching all distfiles required by nvc-1.5.1 for building
<snip>
[main-riscv64-default-job-11] |   | `-- Extracting indexinfo-0.3.1: .... done
[main-riscv64-default-job-11] |   `-- Extracting gettext-runtime-0.21: .......... done
[main-riscv64-default-job-11] |   `-- Installing libffi-3.3_1...
[main-riscv64-default-job-11] |   `-- Extracting libffi-3.3_1: .......... done
[main-riscv64-default-job-11] |   `-- Installing mpdecimal-2.5.1...
[main-riscv64-default-job-11] |   `-- Extracting mpdecimal-2.5.1: .......... done
[main-riscv64-default-job-11] |   `-- Installing readline-8.1.1...
[main-riscv64-default-job-11] |   `-- Extracting readline-8.1.1: .......... done
[main-riscv64-default-job-11] `-- Extracting python38-3.8.11: .......... done
[main-riscv64-default-job-11] Extracting llvm90-9.0.1_3: .......... done
=====
Message from python38-3.8.11:

--
Note that some standard Python modules are provided as separate ports
as they require additional dependencies. They are available as:

py38-gdbm       databases/py-gdbm_at_py38
py38-sqlite3    databases/py-sqlite3_at_py38
py38-tkinter    x11-toolkits/py-tkinter_at_py38
===>   nvc-1.5.1 depends on executable: llvm-config90 - found
===>   Returning to build of nvc-1.5.1
===>   nvc-1.5.1 depends on package: gmake>=4.3 - not found
===>   Installing existing package /packages/All/gmake-4.3_2.pkg
[main-riscv64-default-job-11] Installing gmake-4.3_2...
[main-riscv64-default-job-11] Extracting gmake-4.3_2: .......... done
===>   nvc-1.5.1 depends on package: gmake>=4.3 - found
===>   Returning to build of nvc-1.5.1
===>   nvc-1.5.1 depends on package: pkgconf>=1.3.0_1 - not found
===>   Installing existing package /packages/All/pkgconf-1.7.4,1.pkg
[main-riscv64-default-job-11] Installing pkgconf-1.7.4,1...
[main-riscv64-default-job-11] Extracting pkgconf-1.7.4,1: .......... done
===>   nvc-1.5.1 depends on package: pkgconf>=1.3.0_1 - found
===>   Returning to build of nvc-1.5.1
===>   nvc-1.5.1 depends on package: autoconf>=2.69 - not found
===>   Installing existing package /packages/All/autoconf-2.69_3.pkg
[main-riscv64-default-job-11] Installing autoconf-2.69_3...
[main-riscv64-default-job-11] `-- Installing autoconf-wrapper-20131203...
[main-riscv64-default-job-11] `-- Extracting autoconf-wrapper-20131203: .......... done
[main-riscv64-default-job-11] `-- Installing m4-1.4.19,1...
[main-riscv64-default-job-11] `-- Extracting m4-1.4.19,1: .......... done
[main-riscv64-default-job-11] Extracting autoconf-2.69_3: .......... done
===>   nvc-1.5.1 depends on package: autoconf>=2.69 - found
===>   Returning to build of nvc-1.5.1
===>   nvc-1.5.1 depends on package: automake>=1.16.1 - not found
===>   Installing existing package /packages/All/automake-1.16.3.pkg
[main-riscv64-default-job-11] Installing automake-1.16.3...
[main-riscv64-default-job-11] Extracting automake-1.16.3: .......... done
===>   nvc-1.5.1 depends on package: automake>=1.16.1 - found
===>   Returning to build of nvc-1.5.1
===========================================================================
=======================<phase: lib-depends    >============================
===========================================================================
=======================<phase: configure      >============================
===>  Configuring for nvc-1.5.1
configure.ac:26: installing './compile'
configure.ac:24: installing './config.guess'
configure.ac:24: installing './config.sub'
configure.ac:18: installing './install-sh'
configure.ac:18: installing './missing'
Makefile.am: installing './depcomp'
configure.ac: installing './ylwrap'
configure: loading site script /usr/ports/Templates/config.site
checking for a BSD-compatible install... /usr/bin/install -c
checking whether build environment is sane... yes
checking for a thread-safe mkdir -p... (cached) /bin/mkdir -p
checking for gawk... (cached) /usr/bin/awk
checking whether gmake sets $(MAKE)... yes
checking whether gmake supports nested variables... yes
checking whether gmake supports nested variables... (cached) yes
checking build system type... riscv64-portbld-freebsd14.0
checking host system type... riscv64-portbld-freebsd14.0
checking for gcc... /nxb-bin/usr/bin/cc
checking whether the C compiler works... yes
checking for C compiler default output file name... a.out
checking for suffix of executables... 
checking whether we are cross compiling... no
checking for suffix of object files... o
checking whether we are using the GNU C compiler... yes
checking whether /nxb-bin/usr/bin/cc accepts -g... yes
checking for /nxb-bin/usr/bin/cc option to accept ISO C89... none needed
checking whether /nxb-bin/usr/bin/cc understands -c and -o together... yes
checking whether gmake supports the include directive... yes (GNU style)
checking dependency style of /nxb-bin/usr/bin/cc... gcc3
checking for /nxb-bin/usr/bin/cc option to accept ISO C99... none needed
checking whether we are using the GNU C++ compiler... yes
checking whether /nxb-bin/usr/bin/c++ accepts -g... yes
checking dependency style of /nxb-bin/usr/bin/c++... gcc3
checking for flex... flex
checking lex output file root... lex.yy
checking lex library... -lfl
checking whether yytext is a pointer... yes
checking for ranlib... ranlib
checking for inline... inline
checking for C/C++ restrict keyword... __restrict
checking how to run the C preprocessor... /nxb-bin/usr/bin/cpp
checking for grep that handles long lines and -e... (cached) /usr/bin/grep
checking for egrep... (cached) /usr/bin/egrep
checking for ANSI C header files... (cached) yes
checking for sys/types.h... (cached) yes
checking for sys/stat.h... (cached) yes
checking for stdlib.h... (cached) yes
checking for string.h... (cached) yes
checking for memory.h... (cached) yes
checking for strings.h... (cached) yes
checking for inttypes.h... (cached) yes
checking for stdint.h... (cached) yes
checking for unistd.h... (cached) yes
checking execinfo.h usability... yes
checking execinfo.h presence... yes
checking for execinfo.h... yes
checking for sys/ptrace.h... (cached) yes
checking for sys/sysctl.h... (cached) yes
checking sys/prctl.h usability... no
checking sys/prctl.h presence... no
checking for sys/prctl.h... no
checking for struct stat.st_mtimespec.tv_nsec... yes
checking for struct stat.st_mtim.tv_nsec... yes
checking whether the linker accepts -rdynamic... yes
checking whether C compiler accepts -fPIC... yes
checking for __attribute__((returns_nonnull))... yes
checking if flex is the lexer generator... yes
checking for library containing dlopen... none required
checking for library containing pow... -lm
checking for deflate in -lz... (cached) yes
checking for LLVM (engine bitreader bitwriter ipo linker)... yes
checking for LLVM shared library... yes
checking pkg-config is at least version 0.9.0... yes
configure: WARNING: libcheck not found - unit tests will not run
checking for ucontext.h... (cached) yes
checking sys/ucontext.h usability... yes
checking sys/ucontext.h presence... yes
checking for sys/ucontext.h... yes
checking cygwin/signal.h usability... no
checking cygwin/signal.h presence... no
checking for cygwin/signal.h... no
checking asm/ptrace.h usability... no
checking asm/ptrace.h presence... no
checking for asm/ptrace.h... no
checking how to access the program counter from a struct ucontext... configure: WARNING: no way to access program counter - stack trace is disabled
checking for GNU make... gmake
checking for pandoc... no
checking that generated files are newer than configure... done
configure: creating ./config.status
config.status: creating Makefile
config.status: creating config.h
config.status: executing depfiles commands
===========================================================================
=======================<phase: build          >============================
===>  Building for nvc-1.5.1
gmake[1]: Entering directory '/wrkdirs/usr/ports/cad/nvc/work/nvc-r1.5.1'
gmake[2]: Entering directory '/wrkdirs/usr/ports/cad/nvc/work/nvc-r1.5.1'
src/util.c:431:12: warning: unused function 'color_fprintf' [-Wunused-function]
static int color_fprintf(FILE *f, const char *fmt, ...)
           ^
1 warning generated.
src/lexer.c:1273:13: warning: misleading indentation; statement is not part of the previous 'if' [-Wmisleading-indentation]
            if ( ! (yy_state_buf) )
            ^
src/lexer.c:1271:9: note: previous statement is here
        if ( ! (yy_state_buf) )
        ^
src/lexer.c:2411:3: warning: misleading indentation; statement is not part of the previous 'if' [-Wmisleading-indentation]
                return yy_is_jam ? 0 : yy_current_state;
                ^
src/lexer.c:2408:2: note: previous statement is here
        if ( ! yy_is_jam )
        ^
2 warnings generated.
src/lower.c:579:4: warning: unused variable '_old_loc' [-Wunused-variable]
   SAVE_DEBUG_INFO;
   ^
src/lower.c:104:16: note: expanded from macro 'SAVE_DEBUG_INFO'
   const loc_t _old_loc = *vcode_last_loc()
               ^
src/lower.c:1772:4: warning: unused variable '_old_loc' [-Wunused-variable]
   SAVE_DEBUG_INFO;
   ^
src/lower.c:104:16: note: expanded from macro 'SAVE_DEBUG_INFO'
   const loc_t _old_loc = *vcode_last_loc()
               ^
src/lower.c:4109:4: warning: unused variable '_old_loc' [-Wunused-variable]
   SAVE_DEBUG_INFO;
   ^
src/lower.c:104:16: note: expanded from macro 'SAVE_DEBUG_INFO'
   const loc_t _old_loc = *vcode_last_loc()
               ^
3 warnings generated.
/nxb-bin/usr/bin/cc -shared -o /wrkdirs/usr/ports/cad/nvc/work/nvc-r1.5.1/lib/ieee/_IEEE.NUMERIC_BIT.so /wrkdirs/usr/ports/cad/nvc/work/nvc-r1.5.1/lib/ieee/_IEEE.NUMERIC_BIT.o
ld: error: /wrkdirs/usr/ports/cad/nvc/work/nvc-r1.5.1/lib/ieee/_IEEE.NUMERIC_BIT.o: cannot link object files with different floating-point ABI
cc: error: linker command failed with exit code 1 (use -v to see invocation)
** Fatal: /nxb-bin/usr/bin/cc failed with status 1
gmake[2]: *** [Makefile:2615: lib/ieee/IEEE.NUMERIC_BIT] Error 1
gmake[2]: Leaving directory '/wrkdirs/usr/ports/cad/nvc/work/nvc-r1.5.1'
gmake[1]: *** [Makefile:921: all] Error 2
gmake[1]: Leaving directory '/wrkdirs/usr/ports/cad/nvc/work/nvc-r1.5.1'
*** Error code 1

Stop.
make: stopped in /usr/ports/cad/nvc
Received on Sat Jul 31 2021 - 14:24:34 UTC

Original text of this message