[package - main-riscv64-default][audio/faust-lv2] Failed for faust-lv2-1.4.20180118_6 in build

From: <pkg-fallout_at_FreeBSD.org>
Date: Sat, 31 Jul 2021 14:17:14 GMT
You are receiving this mail as a port that you maintain
is failing to build on the FreeBSD package build server.
Please investigate the failure and submit a PR to fix
build.

Maintainer:     yuri_at_FreeBSD.org
Log URL:        http://beefy7.nyi.freebsd.org/data/main-riscv64-default/pe777a21158a3_s7685f8344d/logs/faust-lv2-1.4.20180118_6.log
Build URL:      http://beefy7.nyi.freebsd.org/build.html?mastername=main-riscv64-default&build=pe777a21158a3_s7685f8344d
Log:

=>> Building audio/faust-lv2
build started at Sat Jul 31 14:14:42 UTC 2021
port directory: /usr/ports/audio/faust-lv2
package name: faust-lv2-1.4.20180118_6
building for: FreeBSD main-riscv64-default-job-03 14.0-CURRENT FreeBSD 14.0-CURRENT 1400026 riscv
maintained by: yuri_at_FreeBSD.org
Makefile ident: 
Poudriere version: 3.2.8-21-g883afb07
Host OSVERSION: 1400008
Jail OSVERSION: 1400026
Job Id: 03




!!! Jail is newer than host. (Jail: 1400026, Host: 1400008) !!!
!!! This is not supported. !!!
!!! Host kernel must be same or newer than jail. !!!
!!! Expect build failures. !!!



---Begin Environment---
SHELL=/bin/csh
UNAME_p=riscv64
UNAME_m=riscv
ABI_FILE=/usr/lib/crt1.o
OSVERSION=1400026
UNAME_v=FreeBSD 14.0-CURRENT 1400026
UNAME_r=14.0-CURRENT
BLOCKSIZE=K
MAIL=/var/mail/root
MM_CHARSET=UTF-8
LANG=C.UTF-8
STATUS=1
HOME=/root
PATH=/sbin:/bin:/usr/sbin:/usr/bin:/usr/local/sbin:/usr/local/bin:/root/bin
LOCALBASE=/usr/local
QEMU_EMULATING=1
USER=root
LIBEXECPREFIX=/usr/local/libexec/poudriere
POUDRIERE_VERSION=3.2.8-21-g883afb07
MASTERMNT=/usr/local/poudriere/data/.m/main-riscv64-default/ref
POUDRIERE_BUILD_TYPE=bulk
PACKAGE_BUILDING=yes
SAVED_TERM=
PWD=/usr/local/poudriere/data/.m/main-riscv64-default/ref/.p/pool
P_PORTS_FEATURES=FLAVORS SELECTED_OPTIONS
MASTERNAME=main-riscv64-default
SCRIPTPREFIX=/usr/local/share/poudriere
OLDPWD=/usr/local/poudriere/data/.m/main-riscv64-default/ref/.p
SCRIPTPATH=/usr/local/share/poudriere/bulk.sh
POUDRIEREPATH=/usr/local/bin/poudriere
---End Environment---

---Begin Poudriere Port Flags/Env---
PORT_FLAGS=
PKGENV=
FLAVOR=
DEPENDS_ARGS=
MAKE_ARGS=
---End Poudriere Port Flags/Env---

---Begin OPTIONS List---
---End OPTIONS List---

--MAINTAINER--
yuri_at_FreeBSD.org
--End MAINTAINER--

--CONFIGURE_ARGS--

--End CONFIGURE_ARGS--

--CONFIGURE_ENV--
MAKE=gmake XDG_DATA_HOME=/wrkdirs/usr/ports/audio/faust-lv2/work  XDG_CONFIG_HOME=/wrkdirs/usr/ports/audio/faust-lv2/work  HOME=/wrkdirs/usr/ports/audio/faust-lv2/work TMPDIR="/tmp" PATH=/wrkdirs/usr/ports/audio/faust-lv2/work/.bin:/sbin:/bin:/usr/sbin:/usr/bin:/usr/local/sbin:/usr/local/bin:/root/bin SHELL=/bin/sh CONFIG_SHELL=/bin/sh CMAKE_PREFIX_PATH="/usr/local"
--End CONFIGURE_ENV--

--MAKE_ENV--
XDG_DATA_HOME=/wrkdirs/usr/ports/audio/faust-lv2/work  XDG_CONFIG_HOME=/wrkdirs/usr/ports/audio/faust-lv2/work  HOME=/wrkdirs/usr/ports/audio/faust-lv2/work TMPDIR="/tmp" PATH=/wrkdirs/usr/ports/audio/faust-lv2/work/.bin:/sbin:/bin:/usr/sbin:/usr/bin:/usr/local/sbin:/usr/local/bin:/root/bin NO_PIE=yes MK_DEBUG_FILES=no MK_KERNEL_SYMBOLS=no SHELL=/bin/sh NO_LINT=YES PREFIX=/usr/local  LOCALBASE=/usr/local  CC="/nxb-bin/usr/bin/cc" CFLAGS="-O2 -pipe -march=rv64imafdc -mabi=lp64d  -fstack-protector-strong -isystem /usr/local/include -fno-strict-aliasing "  CPP="/nxb-bin/usr/bin/cpp" CPPFLAGS="-isystem /usr/local/include"  LDFLAGS=" -fPIC -fstack-protector-strong " LIBS="-L/usr/local/lib"  CXX="/nxb-bin/usr/bin/c++" CXXFLAGS="-O2 -pipe -march=rv64imafdc -mabi=lp64d -fstack-protector-strong -isystem /usr/local/include -fno-strict-aliasing  -isystem /usr/local/include "  MANPREFIX="/usr/local" BSD_INSTALL_PROGRAM="install  -s -m 555"  BSD_INSTALL_LIB="install  -s -m 0644"  BSD_INSTALL_SCRI
 PT="install  -m 555"  BSD_INSTALL_DATA="install  -m 0644"  BSD_INSTALL_MAN="install  -m 444"
--End MAKE_ENV--

--PLIST_SUB--
OSREL=14.0 PREFIX=%D LOCALBASE=/usr/local  RESETPREFIX=/usr/local LIB32DIR=lib DOCSDIR="share/doc/faust"  EXAMPLESDIR="share/examples/faust"  DATADIR="share/faust"  WWWDIR="www/faust"  ETCDIR="etc/faust"
--End PLIST_SUB--

--SUB_LIST--
PREFIX=/usr/local LOCALBASE=/usr/local  DATADIR=/usr/local/share/faust DOCSDIR=/usr/local/share/doc/faust EXAMPLESDIR=/usr/local/share/examples/faust  WWWDIR=/usr/local/www/faust ETCDIR=/usr/local/etc/faust
--End SUB_LIST--

---Begin make.conf---
.sinclude "/etc/make.nxb.conf"
USE_PACKAGE_DEPENDS=yes
BATCH=yes
WRKDIRPREFIX=/wrkdirs
PORTSDIR=/usr/ports
PACKAGES=/packages
DISTDIR=/distfiles
PACKAGE_BUILDING=yes
PACKAGE_BUILDING_FLAVORS=yes
MACHINE=riscv
MACHINE_ARCH=riscv64
ARCH=${MACHINE_ARCH}
#### /usr/local/etc/poudriere.d/make.conf ####
# XXX: We really need this but cannot use it while 'make checksum' does not
# try the next mirror on checksum failure.  It currently retries the same
# failed mirror and then fails rather then trying another.  It *does*
# try the next if the size is mismatched though.
#MASTER_SITE_FREEBSD=yes
# Build ALLOW_MAKE_JOBS_PACKAGES with 2 jobs
MAKE_JOBS_NUMBER=2
#### /usr/ports/Mk/Scripts/ports_env.sh ####
_CCVERSION_9d218390=FreeBSD clang version 12.0.1 (git_at_github.com:llvm/llvm-project.git llvmorg-12.0.1-0-gfed41342a82f) Target: riscv64-unknown-freebsd14.0 Thread model: posix InstalledDir: /nxb-bin/usr/bin
_ALTCCVERSION_9d218390=none
_CXXINTERNAL_9c45a5b1=FreeBSD clang version 12.0.1 (git_at_github.com:llvm/llvm-project.git llvmorg-12.0.1-0-gfed41342a82f) Target: riscv64-unknown-freebsd14.0 Thread model: posix InstalledDir: /nxb-bin/usr/bin "/nxb-bin/usr/bin/ld" "--eh-frame-hdr" "-dynamic-linker" "/libexec/ld-elf.so.1" "--enable-new-dtags" "-m" "elf64lriscv" "-o" "a.out" "/usr/lib/crt1.o" "/usr/lib/crti.o" "/usr/lib/crtbegin.o" "-L/usr/lib" "/dev/null" "-lc++" "-lm" "-lgcc" "--as-needed" "-lgcc_s" "--no-as-needed" "-lc" "-lgcc" "--as-needed" "-lgcc_s" "--no-as-needed" "/usr/lib/crtend.o" "/usr/lib/crtn.o"
CC_OUTPUT_9d218390_58173849=yes
CC_OUTPUT_9d218390_9bdba57c=yes
CC_OUTPUT_9d218390_6a4fe7f5=yes
CC_OUTPUT_9d218390_6bcac02b=yes
CC_OUTPUT_9d218390_67d20829=yes
CC_OUTPUT_9d218390_bfa62e83=yes
CC_OUTPUT_9d218390_f0b4d593=yes
CC_OUTPUT_9d218390_308abb44=yes
CC_OUTPUT_9d218390_f00456e5=yes
CC_OUTPUT_9d218390_65ad290d=yes
CC_OUTPUT_9d218390_f2776b26=yes
CC_OUTPUT_9d218390_b2657cc3=yes
CC_OUTPUT_9d218390_380987f7=yes
CC_OUTPUT_9d218390_160933ec=yes
CC_OUTPUT_9d218390_fb62803b=yes
_OBJC_CCVERSION_9d218390=FreeBSD clang version 12.0.1 (git_at_github.com:llvm/llvm-project.git llvmorg-12.0.1-0-gfed41342a82f) Target: riscv64-unknown-freebsd14.0 Thread model: posix InstalledDir: /nxb-bin/usr/bin
_OBJC_ALTCCVERSION_9d218390=none
ARCH=riscv64
OPSYS=FreeBSD
_OSRELEASE=14.0-CURRENT
OSREL=14.0
OSVERSION=1400026
PYTHONBASE=/usr/local
CONFIGURE_MAX_CMD_LEN=524288
HAVE_PORTS_ENV=1
#### Misc Poudriere ####
GID=0
UID=0
DISABLE_MAKE_JOBS=poudriere
---End make.conf---
---Begin make.nxb.conf---
CC=/nxb-bin/usr/bin/cc
CPP=/nxb-bin/usr/bin/cpp
CXX=/nxb-bin/usr/bin/c++
NM=/nxb-bin/usr/bin/nm
LD=/nxb-bin/usr/bin/ld
OBJCOPY=/nxb-bin/usr/bin/objcopy
SIZE=/nxb-bin/usr/bin/size
STRIPBIN=/nxb-bin/usr/bin/strip
SED=/nxb-bin/usr/bin/sed
RANLIB=/nxb-bin/usr/bin/ranlib
YACC=/nxb-bin/usr/bin/yacc
MAKE=/nxb-bin/usr/bin/make
STRINGS=/nxb-bin/usr/bin/strings
AWK=/nxb-bin/usr/bin/awk
FLEX=/nxb-bin/usr/bin/flex
---End make.nxb.conf---
--Resource limits--
cpu time               (seconds, -t)  unlimited
file size           (512-blocks, -f)  unlimited
data seg size           (kbytes, -d)  33554432
stack size              (kbytes, -s)  524288
core file size      (512-blocks, -c)  unlimited
max memory size         (kbytes, -m)  unlimited
locked memory           (kbytes, -l)  unlimited
max user processes              (-u)  89999
open files                      (-n)  1024
virtual mem size        (kbytes, -v)  unlimited
swap limit              (kbytes, -w)  unlimited
socket buffer size       (bytes, -b)  unlimited
pseudo-terminals                (-p)  unlimited
kqueues                         (-k)  unlimited
umtx shared locks               (-o)  unlimited
--End resource limits--
=======================<phase: check-sanity   >============================
===>  License GPLv3 accepted by the user
===========================================================================
=======================<phase: pkg-depends    >============================
===>   faust-lv2-1.4.20180118_6 depends on file: /usr/local/sbin/pkg - not found
===>   Installing existing package /packages/All/pkg-1.17.1.pkg
[main-riscv64-default-job-03] Installing pkg-1.17.1...
[main-riscv64-default-job-03] Extracting pkg-1.17.1: .......... done
===>   faust-lv2-1.4.20180118_6 depends on file: /usr/local/sbin/pkg - found
===>   Returning to build of faust-lv2-1.4.20180118_6
===========================================================================
=======================<phase: fetch-depends  >============================
===========================================================================
=======================<phase: fetch          >============================
===>  License GPLv3 accepted by the user
===> Fetching all distfiles required by faust-lv2-1.4.20180118_6 for building
===========================================================================
=======================<phase: checksum       >============================
===>  License GPLv3 accepted by the user
===> Fetching all distfiles required by faust-lv2-1.4.20180118_6 for building
<snip>
Qt UI with Jack audio backend:

$ cp files/example.dsp .
$ faust2jaqt example.dsp
$ ./example

It will create the window with sliders and a button that you would
need to press.

In order to compile programs for some audio backends (like Jack,
PortAudio) and UI frontends (like Qt), you need to first install them.
===>   faust-lv2-1.4.20180118_6 depends on package: faust>0 - found
===>   Returning to build of faust-lv2-1.4.20180118_6
===>   faust-lv2-1.4.20180118_6 depends on file: /usr/local/include/boost/circular_buffer.hpp - not found
===>   Installing existing package /packages/All/boost-libs-1.72.0_5.pkg
[main-riscv64-default-job-03] Installing boost-libs-1.72.0_5...
[main-riscv64-default-job-03] `-- Installing icu-69.1,1...
[main-riscv64-default-job-03] `-- Extracting icu-69.1,1: .......... done
[main-riscv64-default-job-03] Extracting boost-libs-1.72.0_5: .......... done
=====
Message from boost-libs-1.72.0_5:

--
You have built the Boost library with thread support.

Don't forget to add -pthread to your linker options when
linking your code.
===>   faust-lv2-1.4.20180118_6 depends on file: /usr/local/include/boost/circular_buffer.hpp - found
===>   Returning to build of faust-lv2-1.4.20180118_6
===>   faust-lv2-1.4.20180118_6 depends on package: gmake>=4.3 - not found
===>   Installing existing package /packages/All/gmake-4.3_2.pkg
[main-riscv64-default-job-03] Installing gmake-4.3_2...
[main-riscv64-default-job-03] Extracting gmake-4.3_2: .......... done
===>   faust-lv2-1.4.20180118_6 depends on package: gmake>=4.3 - found
===>   Returning to build of faust-lv2-1.4.20180118_6
===========================================================================
=======================<phase: lib-depends    >============================
===========================================================================
=======================<phase: configure      >============================
===>  Configuring for faust-lv2-1.4.20180118_6
===========================================================================
=======================<phase: build          >============================
===>  Building for faust-lv2-1.4.20180118_6
gmake[1]: Entering directory '/wrkdirs/usr/ports/audio/faust-lv2/work/agraef-faust-lv2-4dc83e28e998'
faust -a lv2.cpp -cn NLFeks -I examples examples/NLFeks.dsp -o examples/NLFeks.cpp
/nxb-bin/usr/bin/c++ -shared  -O2 -pipe -march=rv64imafdc -mabi=lp64d  -fstack-protector-strong -isystem /usr/local/include -fno-strict-aliasing  -DURI_PREFIX='"https://faustlv2.bitbucket.io"' -DDLLEXT='".so"' -Iexamples examples/NLFeks.cpp -o examples/NLFeks.so
lv2.cpp:1738:1: warning: duplicate 'extern' declaration specifier [-Wduplicate-decl-specifier]
LV2_SYMBOL_EXPORT
^
/usr/local/include/lv2/core/lv2.h:372:5: note: expanded from macro 'LV2_SYMBOL_EXPORT'
    LV2_SYMBOL_EXTERN __attribute__((visibility("default")))
    ^
/usr/local/include/lv2/core/lv2.h:359:29: note: expanded from macro 'LV2_SYMBOL_EXTERN'
#  define LV2_SYMBOL_EXTERN extern "C"
                            ^
lv2.cpp:1760:1: warning: duplicate 'extern' declaration specifier [-Wduplicate-decl-specifier]
LV2_SYMBOL_EXPORT
^
/usr/local/include/lv2/core/lv2.h:372:5: note: expanded from macro 'LV2_SYMBOL_EXPORT'
    LV2_SYMBOL_EXTERN __attribute__((visibility("default")))
    ^
/usr/local/include/lv2/core/lv2.h:359:29: note: expanded from macro 'LV2_SYMBOL_EXTERN'
#  define LV2_SYMBOL_EXTERN extern "C"
                            ^
lv2.cpp:1771:1: warning: duplicate 'extern' declaration specifier [-Wduplicate-decl-specifier]
LV2_SYMBOL_EXPORT
^
/usr/local/include/lv2/core/lv2.h:372:5: note: expanded from macro 'LV2_SYMBOL_EXPORT'
    LV2_SYMBOL_EXTERN __attribute__((visibility("default")))
    ^
/usr/local/include/lv2/core/lv2.h:359:29: note: expanded from macro 'LV2_SYMBOL_EXTERN'
#  define LV2_SYMBOL_EXTERN extern "C"
                            ^
lv2.cpp:1813:1: warning: duplicate 'extern' declaration specifier [-Wduplicate-decl-specifier]
LV2_SYMBOL_EXPORT
^
/usr/local/include/lv2/core/lv2.h:372:5: note: expanded from macro 'LV2_SYMBOL_EXPORT'
    LV2_SYMBOL_EXTERN __attribute__((visibility("default")))
    ^
/usr/local/include/lv2/core/lv2.h:359:29: note: expanded from macro 'LV2_SYMBOL_EXTERN'
#  define LV2_SYMBOL_EXTERN extern "C"
                            ^
lv2.cpp:2063:1: warning: duplicate 'extern' declaration specifier [-Wduplicate-decl-specifier]
LV2_SYMBOL_EXPORT
^
/usr/local/include/lv2/core/lv2.h:372:5: note: expanded from macro 'LV2_SYMBOL_EXPORT'
    LV2_SYMBOL_EXTERN __attribute__((visibility("default")))
    ^
/usr/local/include/lv2/core/lv2.h:359:29: note: expanded from macro 'LV2_SYMBOL_EXTERN'
#  define LV2_SYMBOL_EXTERN extern "C"
                            ^
5 warnings generated.
ld: error: can't create dynamic relocation R_RISCV_HI20 against symbol: vtable for LV2UI in readonly segment; recompile object files with -fPIC or pass '-Wl,-z,notext' to allow text relocations in the output
>>> defined in /tmp/NLFeks-25de22.o
>>> referenced by NLFeks.cpp
>>>               /tmp/NLFeks-25de22.o:(LV2UI::LV2UI(int))

ld: error: can't create dynamic relocation R_RISCV_LO12_I against symbol: vtable for LV2UI in readonly segment; recompile object files with -fPIC or pass '-Wl,-z,notext' to allow text relocations in the output
>>> defined in /tmp/NLFeks-25de22.o
>>> referenced by NLFeks.cpp
>>>               /tmp/NLFeks-25de22.o:(LV2UI::LV2UI(int))

ld: error: can't create dynamic relocation R_RISCV_HI20 against symbol: vtable for LV2UI in readonly segment; recompile object files with -fPIC or pass '-Wl,-z,notext' to allow text relocations in the output
>>> defined in /tmp/NLFeks-25de22.o
>>> referenced by NLFeks.cpp
>>>               /tmp/NLFeks-25de22.o:(LV2UI::~LV2UI())

ld: error: can't create dynamic relocation R_RISCV_LO12_I against symbol: vtable for LV2UI in readonly segment; recompile object files with -fPIC or pass '-Wl,-z,notext' to allow text relocations in the output
>>> defined in /tmp/NLFeks-25de22.o
>>> referenced by NLFeks.cpp
>>>               /tmp/NLFeks-25de22.o:(LV2UI::~LV2UI())

ld: error: can't create dynamic relocation R_RISCV_HI20 against symbol: vtable for LV2UI in readonly segment; recompile object files with -fPIC or pass '-Wl,-z,notext' to allow text relocations in the output
>>> defined in /tmp/NLFeks-25de22.o
>>> referenced by NLFeks.cpp
>>>               /tmp/NLFeks-25de22.o:(LV2UI::~LV2UI())

ld: error: can't create dynamic relocation R_RISCV_LO12_I against symbol: vtable for LV2UI in readonly segment; recompile object files with -fPIC or pass '-Wl,-z,notext' to allow text relocations in the output
>>> defined in /tmp/NLFeks-25de22.o
>>> referenced by NLFeks.cpp
>>>               /tmp/NLFeks-25de22.o:(LV2UI::~LV2UI())

ld: error: can't create dynamic relocation R_RISCV_HI20 against symbol: __stack_chk_guard in readonly segment; recompile object files with -fPIC or pass '-Wl,-z,notext' to allow text relocations in the output
>>> defined in /lib/libc.so.7
>>> referenced by NLFeks.cpp
>>>               /tmp/NLFeks-25de22.o:(LV2UI::declare(float*, char const*, char const*))

ld: error: can't create dynamic relocation R_RISCV_LO12_I against symbol: __stack_chk_guard in readonly segment; recompile object files with -fPIC or pass '-Wl,-z,notext' to allow text relocations in the output
>>> defined in /lib/libc.so.7
>>> referenced by NLFeks.cpp
>>>               /tmp/NLFeks-25de22.o:(LV2UI::declare(float*, char const*, char const*))

ld: error: can't create dynamic relocation R_RISCV_HI20 against symbol: __stack_chk_guard in readonly segment; recompile object files with -fPIC or pass '-Wl,-z,notext' to allow text relocations in the output
>>> defined in /lib/libc.so.7
>>> referenced by NLFeks.cpp
>>>               /tmp/NLFeks-25de22.o:(LV2UI::declare(float*, char const*, char const*))

ld: error: can't create dynamic relocation R_RISCV_LO12_I against symbol: __stack_chk_guard in readonly segment; recompile object files with -fPIC or pass '-Wl,-z,notext' to allow text relocations in the output
>>> defined in /lib/libc.so.7
>>> referenced by NLFeks.cpp
>>>               /tmp/NLFeks-25de22.o:(LV2UI::declare(float*, char const*, char const*))

ld: error: can't create dynamic relocation R_RISCV_HI20 against symbol: __stack_chk_guard in readonly segment; recompile object files with -fPIC or pass '-Wl,-z,notext' to allow text relocations in the output
>>> defined in /lib/libc.so.7
>>> referenced by NLFeks.cpp
>>>               /tmp/NLFeks-25de22.o:(MTSTuning::MTSTuning(char const*))

ld: error: can't create dynamic relocation R_RISCV_LO12_I against symbol: __stack_chk_guard in readonly segment; recompile object files with -fPIC or pass '-Wl,-z,notext' to allow text relocations in the output
>>> defined in /lib/libc.so.7
>>> referenced by NLFeks.cpp
>>>               /tmp/NLFeks-25de22.o:(MTSTuning::MTSTuning(char const*))

ld: error: can't create dynamic relocation R_RISCV_HI20 against symbol: .L.str in readonly segment; recompile object files with -fPIC or pass '-Wl,-z,notext' to allow text relocations in the output
>>> defined in /tmp/NLFeks-25de22.o
>>> referenced by NLFeks.cpp
>>>               /tmp/NLFeks-25de22.o:(MTSTuning::MTSTuning(char const*))

ld: error: can't create dynamic relocation R_RISCV_LO12_I against symbol: .L.str in readonly segment; recompile object files with -fPIC or pass '-Wl,-z,notext' to allow text relocations in the output
>>> defined in /tmp/NLFeks-25de22.o
>>> referenced by NLFeks.cpp
>>>               /tmp/NLFeks-25de22.o:(MTSTuning::MTSTuning(char const*))

ld: error: can't create dynamic relocation R_RISCV_LO12_I against symbol: __stack_chk_guard in readonly segment; recompile object files with -fPIC or pass '-Wl,-z,notext' to allow text relocations in the output
>>> defined in /lib/libc.so.7
>>> referenced by NLFeks.cpp
>>>               /tmp/NLFeks-25de22.o:(MTSTuning::MTSTuning(char const*))

ld: error: can't create dynamic relocation R_RISCV_HI20 against symbol: .L.str.3 in readonly segment; recompile object files with -fPIC or pass '-Wl,-z,notext' to allow text relocations in the output
>>> defined in /tmp/NLFeks-25de22.o
>>> referenced by NLFeks.cpp
>>>               /tmp/NLFeks-25de22.o:(MTSTuning::MTSTuning(char const*))

ld: error: can't create dynamic relocation R_RISCV_LO12_I against symbol: .L.str.3 in readonly segment; recompile object files with -fPIC or pass '-Wl,-z,notext' to allow text relocations in the output
>>> defined in /tmp/NLFeks-25de22.o
>>> referenced by NLFeks.cpp
>>>               /tmp/NLFeks-25de22.o:(MTSTuning::MTSTuning(char const*))

ld: error: can't create dynamic relocation R_RISCV_HI20 against symbol: .L__func__._ZN9MTSTuningC2EPKc in readonly segment; recompile object files with -fPIC or pass '-Wl,-z,notext' to allow text relocations in the output
>>> defined in /tmp/NLFeks-25de22.o
>>> referenced by NLFeks.cpp
>>>               /tmp/NLFeks-25de22.o:(MTSTuning::MTSTuning(char const*))

ld: error: can't create dynamic relocation R_RISCV_LO12_I against symbol: .L__func__._ZN9MTSTuningC2EPKc in readonly segment; recompile object files with -fPIC or pass '-Wl,-z,notext' to allow text relocations in the output
>>> defined in /tmp/NLFeks-25de22.o
>>> referenced by NLFeks.cpp
>>>               /tmp/NLFeks-25de22.o:(MTSTuning::MTSTuning(char const*))

ld: error: can't create dynamic relocation R_RISCV_HI20 against symbol: .L.str.1 in readonly segment; recompile object files with -fPIC or pass '-Wl,-z,notext' to allow text relocations in the output
>>> defined in /tmp/NLFeks-25de22.o
>>> referenced by NLFeks.cpp
>>>               /tmp/NLFeks-25de22.o:(MTSTuning::MTSTuning(char const*))

ld: error: too many errors emitted, stopping now (use -error-limit=0 to see all errors)
c++: error: linker command failed with exit code 1 (use -v to see invocation)
gmake[1]: *** [Makefile:247: examples/NLFeks.so] Error 1
gmake[1]: Leaving directory '/wrkdirs/usr/ports/audio/faust-lv2/work/agraef-faust-lv2-4dc83e28e998'
*** Error code 1

Stop.
make: stopped in /usr/ports/audio/faust-lv2
Received on Sat Jul 31 2021 - 14:17:14 UTC

Original text of this message