[package - 122arm64-quarterly][science/opensph] Failed for OpenSPH-0.3.5_1 in build

From: <pkg-fallout_at_FreeBSD.org>
Date: Sat, 31 Jul 2021 09:41:38 GMT
You are receiving this mail as a port that you maintain
is failing to build on the FreeBSD package build server.
Please investigate the failure and submit a PR to fix
build.

Maintainer:     yuri_at_FreeBSD.org
Log URL:        http://ampere1.nyi.freebsd.org/data/122arm64-quarterly/e17f46c5dd6b/logs/OpenSPH-0.3.5_1.log
Build URL:      http://ampere1.nyi.freebsd.org/build.html?mastername=122arm64-quarterly&build=e17f46c5dd6b
Log:

=>> Building science/opensph
build started at Sat Jul 31 09:40:26 UTC 2021
port directory: /usr/ports/science/opensph
package name: OpenSPH-0.3.5_1
building for: FreeBSD 122arm64-quarterly-job-08 12.2-RELEASE FreeBSD 12.2-RELEASE arm64
maintained by: yuri_at_FreeBSD.org
Makefile ident: 
Poudriere version: 3.2.8-21-g883afb07
Host OSVERSION: 1400008
Jail OSVERSION: 1202000
Job Id: 08

---Begin Environment---
SHELL=/bin/csh
OSVERSION=1202000
UNAME_v=FreeBSD 12.2-RELEASE
UNAME_r=12.2-RELEASE
BLOCKSIZE=K
MAIL=/var/mail/root
STATUS=1
HOME=/root
PATH=/sbin:/bin:/usr/sbin:/usr/bin:/usr/local/sbin:/usr/local/bin:/root/bin
LOCALBASE=/usr/local
USER=root
LIBEXECPREFIX=/usr/local/libexec/poudriere
POUDRIERE_VERSION=3.2.8-21-g883afb07
MASTERMNT=/usr/local/poudriere/data/.m/122arm64-quarterly/ref
POUDRIERE_BUILD_TYPE=bulk
PACKAGE_BUILDING=yes
SAVED_TERM=
PWD=/usr/local/poudriere/data/.m/122arm64-quarterly/ref/.p/pool
P_PORTS_FEATURES=FLAVORS SELECTED_OPTIONS
MASTERNAME=122arm64-quarterly
SCRIPTPREFIX=/usr/local/share/poudriere
OLDPWD=/usr/local/poudriere/data/.m/122arm64-quarterly/ref/.p
SCRIPTPATH=/usr/local/share/poudriere/bulk.sh
POUDRIEREPATH=/usr/local/bin/poudriere
---End Environment---

---Begin Poudriere Port Flags/Env---
PORT_FLAGS=
PKGENV=
FLAVOR=
DEPENDS_ARGS=
MAKE_ARGS=
---End Poudriere Port Flags/Env---

---Begin OPTIONS List---
===> The following configuration options are available for OpenSPH-0.3.5_1:
     CHAISCRIPT=on: Be able to read and modify particle data from a script
     EIGEN=on: Eigen for additional methods to set up initial conditions
     HDF5=on: Be able to read files generated by miluphcuda code
     OPENMP=on: Parallel processing support via OpenMP
     TBB=on: Parallelize with Intel Threading Building Blocks
     VDB=on: Use OpenVDB for converting particles to volumetric data
===> Use 'make config' to modify these settings
---End OPTIONS List---

--MAINTAINER--
yuri_at_FreeBSD.org
--End MAINTAINER--

--CONFIGURE_ARGS--
--with-qt-includes=/usr/local/include/qt5  --with-qt-libraries=/usr/local/lib/qt5  --with-extra-includes=/usr/local/include  --with-extra-libs=/usr/local/lib
--End CONFIGURE_ARGS--

--CONFIGURE_ENV--
QT_SELECT=qt5 QMAKEMODULES="/wrkdirs/usr/ports/science/opensph/work/sph-da3692e99fac19bc512c8462b0492eabd2de33af/mkspecs/modules:/usr/local/lib/qt5/mkspecs/modules" QTDIR="/usr/local/lib/qt5" QMAKE="/usr/local/lib/qt5/bin/qmake"  MOC="/usr/local/lib/qt5/bin/moc" RCC="/usr/local/lib/qt5/bin/rcc" UIC="/usr/local/lib/qt5/bin/uic"  QMAKESPEC="/usr/local/lib/qt5/mkspecs/freebsd-$(ccver="$(c++ --version)"; case "$ccver" in *clang*) echo clang ;; *) echo g++ ;; esac)" XDG_DATA_HOME=/wrkdirs/usr/ports/science/opensph/work  XDG_CONFIG_HOME=/wrkdirs/usr/ports/science/opensph/work  HOME=/wrkdirs/usr/ports/science/opensph/work TMPDIR="/tmp" PATH=/wrkdirs/usr/ports/science/opensph/work/.bin:/sbin:/bin:/usr/sbin:/usr/bin:/usr/local/sbin:/usr/local/bin:/root/bin SHELL=/bin/sh CONFIG_SHELL=/bin/sh WX_CONFIG=/usr/local/bin/wxgtk3u-3.1-config
--End CONFIGURE_ENV--

--MAKE_ENV--
QT_SELECT=qt5 QMAKEMODULES="/wrkdirs/usr/ports/science/opensph/work/sph-da3692e99fac19bc512c8462b0492eabd2de33af/mkspecs/modules:/usr/local/lib/qt5/mkspecs/modules" XDG_DATA_HOME=/wrkdirs/usr/ports/science/opensph/work  XDG_CONFIG_HOME=/wrkdirs/usr/ports/science/opensph/work  HOME=/wrkdirs/usr/ports/science/opensph/work TMPDIR="/tmp" PATH=/wrkdirs/usr/ports/science/opensph/work/.bin:/sbin:/bin:/usr/sbin:/usr/bin:/usr/local/sbin:/usr/local/bin:/root/bin NO_PIE=yes MK_DEBUG_FILES=no MK_KERNEL_SYMBOLS=no SHELL=/bin/sh NO_LINT=YES WX_CONFIG=/usr/local/bin/wxgtk3u-3.1-config PREFIX=/usr/local  LOCALBASE=/usr/local  CC="cc" CFLAGS="-O2 -pipe  -fstack-protector-strong -fno-strict-aliasing "  CPP="cpp" CPPFLAGS=""  LDFLAGS=" -fstack-protector-strong " LIBS=""  CXX="c++" CXXFLAGS="-O2 -pipe -fstack-protector-strong -fno-strict-aliasing  -DSPH_CONFIG_SET "  MANPREFIX="/usr/local" BSD_INSTALL_PROGRAM="install  -s -m 555"  BSD_INSTALL_LIB="install  -s -m 0644"  BSD_INSTALL_SCRIPT="install  -m 55
 5"  BSD_INSTALL_DATA="install  -m 0644"  BSD_INSTALL_MAN="install  -m 444"
--End MAKE_ENV--

--PLIST_SUB--
QT_BINDIR="lib/qt5/bin" QT_INCDIR="include/qt5" QT_LIBDIR="lib/qt5" QT_ARCHDIR="lib/qt5" QT_PLUGINDIR="lib/qt5/plugins" QT_LIBEXECDIR="libexec/qt5" QT_IMPORTDIR="lib/qt5/imports" QT_QMLDIR="lib/qt5/qml" QT_DATADIR="share/qt5" QT_DOCDIR="share/doc/qt5" QT_L10NDIR="share/qt5/translations" QT_EXAMPLEDIR="share/examples/qt5" QT_TESTDIR="share/qt5/tests" QT_MKSPECDIR="lib/qt5/mkspecs" QT_QTCHOOSERDIR="etc/xdg/qtchooser" DEBUG="_at_comment " OSREL=12.2 PREFIX=%D LOCALBASE=/usr/local  RESETPREFIX=/usr/local LIB32DIR=lib DOCSDIR="share/doc/OpenSPH"  EXAMPLESDIR="share/examples/OpenSPH"  DATADIR="share/OpenSPH"  WWWDIR="www/OpenSPH"  ETCDIR="etc/OpenSPH"
--End PLIST_SUB--

--SUB_LIST--
PREFIX=/usr/local LOCALBASE=/usr/local  DATADIR=/usr/local/share/OpenSPH DOCSDIR=/usr/local/share/doc/OpenSPH EXAMPLESDIR=/usr/local/share/examples/OpenSPH  WWWDIR=/usr/local/www/OpenSPH ETCDIR=/usr/local/etc/OpenSPH
--End SUB_LIST--

---Begin make.conf---
USE_PACKAGE_DEPENDS=yes
BATCH=yes
WRKDIRPREFIX=/wrkdirs
PORTSDIR=/usr/ports
PACKAGES=/packages
DISTDIR=/distfiles
PACKAGE_BUILDING=yes
PACKAGE_BUILDING_FLAVORS=yes
#### /usr/local/etc/poudriere.d/make.conf ####
# XXX: We really need this but cannot use it while 'make checksum' does not
# try the next mirror on checksum failure.  It currently retries the same
# failed mirror and then fails rather then trying another.  It *does*
# try the next if the size is mismatched though.
#MASTER_SITE_FREEBSD=yes
# Build ALLOW_MAKE_JOBS_PACKAGES with 2 jobs
MAKE_JOBS_NUMBER=2
#### /usr/ports/Mk/Scripts/ports_env.sh ####
_CCVERSION_921dbbb2=FreeBSD clang version 10.0.1 (git_at_github.com:llvm/llvm-project.git llvmorg-10.0.1-0-gef32c611aa2) Target: aarch64-unknown-freebsd12.2 Thread model: posix InstalledDir: /usr/bin
_ALTCCVERSION_921dbbb2=none
_CXXINTERNAL_acaad9ca=FreeBSD clang version 10.0.1 (git_at_github.com:llvm/llvm-project.git llvmorg-10.0.1-0-gef32c611aa2) Target: aarch64-unknown-freebsd12.2 Thread model: posix InstalledDir: /usr/bin "/usr/bin/ld" "--eh-frame-hdr" "-dynamic-linker" "/libexec/ld-elf.so.1" "--enable-new-dtags" "-o" "a.out" "/usr/lib/crt1.o" "/usr/lib/crti.o" "/usr/lib/crtbegin.o" "-L/usr/lib" "/dev/null" "-lc++" "-lm" "-lgcc" "--as-needed" "-lgcc_s" "--no-as-needed" "-lc" "-lgcc" "--as-needed" "-lgcc_s" "--no-as-needed" "/usr/lib/crtend.o" "/usr/lib/crtn.o"
CC_OUTPUT_921dbbb2_58173849=yes
CC_OUTPUT_921dbbb2_9bdba57c=yes
CC_OUTPUT_921dbbb2_6a4fe7f5=yes
CC_OUTPUT_921dbbb2_6bcac02b=yes
CC_OUTPUT_921dbbb2_67d20829=yes
CC_OUTPUT_921dbbb2_bfa62e83=yes
CC_OUTPUT_921dbbb2_f0b4d593=yes
CC_OUTPUT_921dbbb2_308abb44=yes
CC_OUTPUT_921dbbb2_f00456e5=yes
CC_OUTPUT_921dbbb2_65ad290d=yes
CC_OUTPUT_921dbbb2_f2776b26=yes
CC_OUTPUT_921dbbb2_b2657cc3=yes
CC_OUTPUT_921dbbb2_380987f7=yes
CC_OUTPUT_921dbbb2_160933ec=yes
CC_OUTPUT_921dbbb2_fb62803b=yes
_OBJC_CCVERSION_921dbbb2=FreeBSD clang version 10.0.1 (git_at_github.com:llvm/llvm-project.git llvmorg-10.0.1-0-gef32c611aa2) Target: aarch64-unknown-freebsd12.2 Thread model: posix InstalledDir: /usr/bin
_OBJC_ALTCCVERSION_921dbbb2=none
ARCH=aarch64
OPSYS=FreeBSD
_OSRELEASE=12.2-RELEASE
OSREL=12.2
OSVERSION=1202000
PYTHONBASE=/usr/local
CONFIGURE_MAX_CMD_LEN=524288
HAVE_PORTS_ENV=1
#### Misc Poudriere ####
GID=0
UID=0
---End make.conf---
--Resource limits--
cpu time               (seconds, -t)  unlimited
file size           (512-blocks, -f)  unlimited
data seg size           (kbytes, -d)  1048576
stack size              (kbytes, -s)  1048576
core file size      (512-blocks, -c)  unlimited
max memory size         (kbytes, -m)  unlimited
locked memory           (kbytes, -l)  unlimited
max user processes              (-u)  89999
open files                      (-n)  1024
virtual mem size        (kbytes, -v)  unlimited
swap limit              (kbytes, -w)  unlimited
socket buffer size       (bytes, -b)  unlimited
pseudo-terminals                (-p)  unlimited
kqueues                         (-k)  unlimited
umtx shared locks               (-o)  unlimited
--End resource limits--
=======================<phase: check-sanity   >============================
===>  License MIT accepted by the user
===========================================================================
=======================<phase: pkg-depends    >============================
===>   OpenSPH-0.3.5_1 depends on file: /usr/local/sbin/pkg - not found
===>   Installing existing package /packages/All/pkg-1.16.3.txz
[122arm64-quarterly-job-08] Installing pkg-1.16.3...
[122arm64-quarterly-job-08] Extracting pkg-1.16.3: .......... done
===>   OpenSPH-0.3.5_1 depends on file: /usr/local/sbin/pkg - found
===>   Returning to build of OpenSPH-0.3.5_1
===========================================================================
=======================<phase: fetch-depends  >============================
===========================================================================
=======================<phase: fetch          >============================
===>  License MIT accepted by the user
===> Fetching all distfiles required by OpenSPH-0.3.5_1 for building
===========================================================================
=======================<phase: checksum       >============================
===>  License MIT accepted by the user
===> Fetching all distfiles required by OpenSPH-0.3.5_1 for building
=> SHA256 Checksum OK for sevecekp-sph-da3692e99fac19bc512c8462b0492eabd2de33af_GL0.tar.gz.
===========================================================================
=======================<phase: extract-depends>============================
===========================================================================
=======================<phase: extract        >============================
===>  License MIT accepted by the user
===> Fetching all distfiles required by OpenSPH-0.3.5_1 for building
===>  Extracting for OpenSPH-0.3.5_1
=> SHA256 Checksum OK for sevecekp-sph-da3692e99fac19bc512c8462b0492eabd2de33af_GL0.tar.gz.
===========================================================================
=======================<phase: patch-depends  >============================
===========================================================================
=======================<phase: patch          >============================
===>  Patching for OpenSPH-0.3.5_1
===>  Applying FreeBSD patches for OpenSPH-0.3.5_1 from /usr/ports/science/opensph/files
===========================================================================
=======================<phase: build-depends  >============================
===>   OpenSPH-0.3.5_1 depends on file: /usr/local/include/chaiscript/chaiscript.hpp - not found
===>   Installing existing package /packages/All/ChaiScript-6.1.0_3.txz
[122arm64-quarterly-job-08] Installing ChaiScript-6.1.0_3...
[122arm64-quarterly-job-08] `-- Installing readline-8.1.1...
[122arm64-quarterly-job-08] |   `-- Installing indexinfo-0.3.1...
[122arm64-quarterly-job-08] |   `-- Extracting indexinfo-0.3.1: .... done
[122arm64-quarterly-job-08] `-- Extracting readline-8.1.1: .......... done
[122arm64-quarterly-job-08] Extracting ChaiScript-6.1.0_3: .......... done
===>   OpenSPH-0.3.5_1 depends on file: /usr/local/include/chaiscript/chaiscript.hpp - found
===>   Returning to build of OpenSPH-0.3.5_1
===>   OpenSPH-0.3.5_1 depends on file: /usr/local/libdata/pkgconfig/eigen3.pc - not found
===>   Installing existing package /packages/All/eigen-3.3.9.txz
[122arm64-quarterly-job-08] Installing eigen-3.3.9...
<snip>
compiling common/Assert.cpp
--- AggregateSolver.o ---
compiling gravity/AggregateSolver.cpp
--- Assert.o ---
c++: warning: argument unused during compilation: '-msse4.1' [-Wunused-command-line-argument]
--- AggregateSolver.o ---
c++: warning: argument unused during compilation: '-msse4.1' [-Wunused-command-line-argument]
In file included from gravity/AggregateSolver.cpp:1:
In file included from ./gravity/AggregateSolver.h:3:
In file included from ./gravity/NBodySolver.h:10:
In file included from ./timestepping/ISolver.h:9:
In file included from ./objects/geometry/Vector.h:12:
In file included from /usr/lib/clang/10.0.1/include/immintrin.h:14:
/usr/lib/clang/10.0.1/include/mmintrin.h:33:5: error: use of undeclared identifier '__builtin_ia32_emms'; did you mean '__builtin_isless'?
    __builtin_ia32_emms();
    ^
/usr/include/c++/v1/math.h:651:12: note: '__builtin_isless' declared here
    return isless(__lcpp_x, __lcpp_y);
           ^
/usr/include/math.h:120:23: note: expanded from macro 'isless'
#define isless(x, y)            __builtin_isless((x), (y))
                                ^
In file included from gravity/AggregateSolver.cpp:1:
In file included from ./gravity/AggregateSolver.h:3:
In file included from ./gravity/NBodySolver.h:10:
In file included from ./timestepping/ISolver.h:9:
In file included from ./objects/geometry/Vector.h:12:
In file included from /usr/lib/clang/10.0.1/include/immintrin.h:14:
/usr/lib/clang/10.0.1/include/mmintrin.h:33:25: error: too few arguments to function call, expected 2, have 0
    __builtin_ia32_emms();
                        ^
/usr/lib/clang/10.0.1/include/mmintrin.h:50:19: error: use of undeclared identifier '__builtin_ia32_vec_init_v2si'
    return (__m64)__builtin_ia32_vec_init_v2si(__i, 0);
                  ^
/usr/lib/clang/10.0.1/include/mmintrin.h:67:12: error: use of undeclared identifier '__builtin_ia32_vec_ext_v2si'
    return __builtin_ia32_vec_ext_v2si((__v2si)__m, 0);
           ^
/usr/lib/clang/10.0.1/include/mmintrin.h:129:19: error: use of undeclared identifier '__builtin_ia32_packsswb'
    return (__m64)__builtin_ia32_packsswb((__v4hi)__m1, (__v4hi)__m2);
                  ^
/usr/lib/clang/10.0.1/include/mmintrin.h:159:19: error: use of undeclared identifier '__builtin_ia32_packssdw'
    return (__m64)__builtin_ia32_packssdw((__v2si)__m1, (__v2si)__m2);
                  ^
/usr/lib/clang/10.0.1/include/mmintrin.h:189:19: error: use of undeclared identifier '__builtin_ia32_packuswb'
    return (__m64)__builtin_ia32_packuswb((__v4hi)__m1, (__v4hi)__m2);
                  ^
/usr/lib/clang/10.0.1/include/mmintrin.h:216:19: error: use of undeclared identifier '__builtin_ia32_punpckhbw'
    return (__m64)__builtin_ia32_punpckhbw((__v8qi)__m1, (__v8qi)__m2);
                  ^
/usr/lib/clang/10.0.1/include/mmintrin.h:239:19: error: use of undeclared identifier '__builtin_ia32_punpckhwd'
    return (__m64)__builtin_ia32_punpckhwd((__v4hi)__m1, (__v4hi)__m2);
                  ^
/usr/lib/clang/10.0.1/include/mmintrin.h:260:19: error: use of undeclared identifier '__builtin_ia32_punpckhdq'
    return (__m64)__builtin_ia32_punpckhdq((__v2si)__m1, (__v2si)__m2);
                  ^
/usr/lib/clang/10.0.1/include/mmintrin.h:287:19: error: use of undeclared identifier '__builtin_ia32_punpcklbw'
    return (__m64)__builtin_ia32_punpcklbw((__v8qi)__m1, (__v8qi)__m2);
                  ^
/usr/lib/clang/10.0.1/include/mmintrin.h:310:19: error: use of undeclared identifier '__builtin_ia32_punpcklwd'
    return (__m64)__builtin_ia32_punpcklwd((__v4hi)__m1, (__v4hi)__m2);
                  ^
/usr/lib/clang/10.0.1/include/mmintrin.h:331:19: error: use of undeclared identifier '__builtin_ia32_punpckldq'
    return (__m64)__builtin_ia32_punpckldq((__v2si)__m1, (__v2si)__m2);
                  ^
/usr/lib/clang/10.0.1/include/mmintrin.h:352:19: error: use of undeclared identifier '__builtin_ia32_paddb'; did you mean '__builtin_arm_addg'?
    return (__m64)__builtin_ia32_paddb((__v8qi)__m1, (__v8qi)__m2);
                  ^
/usr/lib/clang/10.0.1/include/mmintrin.h:352:19: note: '__builtin_arm_addg' declared here
/usr/lib/clang/10.0.1/include/mmintrin.h:352:19: error: first argument of MTE builtin function must be a pointer ('__v8qi' (vector of 8 'char' values) invalid)
    return (__m64)__builtin_ia32_paddb((__v8qi)__m1, (__v8qi)__m2);
                  ^                    ~~~~~~~~~~~~
/usr/lib/clang/10.0.1/include/mmintrin.h:373:19: error: use of undeclared identifier '__builtin_ia32_paddw'; did you mean '__builtin_arm_addg'?
    return (__m64)__builtin_ia32_paddw((__v4hi)__m1, (__v4hi)__m2);
                  ^
/usr/lib/clang/10.0.1/include/mmintrin.h:352:19: note: '__builtin_arm_addg' declared here
    return (__m64)__builtin_ia32_paddb((__v8qi)__m1, (__v8qi)__m2);
                  ^
/usr/lib/clang/10.0.1/include/mmintrin.h:373:19: error: first argument of MTE builtin function must be a pointer ('__v4hi' (vector of 4 'short' values) invalid)
    return (__m64)__builtin_ia32_paddw((__v4hi)__m1, (__v4hi)__m2);
                  ^                    ~~~~~~~~~~~~
/usr/lib/clang/10.0.1/include/mmintrin.h:394:19: error: use of undeclared identifier '__builtin_ia32_paddd'; did you mean '__builtin_arm_addg'?
    return (__m64)__builtin_ia32_paddd((__v2si)__m1, (__v2si)__m2);
                  ^
/usr/lib/clang/10.0.1/include/mmintrin.h:352:19: note: '__builtin_arm_addg' declared here
    return (__m64)__builtin_ia32_paddb((__v8qi)__m1, (__v8qi)__m2);
                  ^
/usr/lib/clang/10.0.1/include/mmintrin.h:394:19: error: first argument of MTE builtin function must be a pointer ('__v2si' (vector of 2 'int' values) invalid)
    return (__m64)__builtin_ia32_paddd((__v2si)__m1, (__v2si)__m2);
                  ^                    ~~~~~~~~~~~~
fatal error: too many errors emitted, stopping now [-ferror-limit=]
--- BarnesHut.o ---
compiling gravity/BarnesHut.cpp
c++: warning: argument unused during compilation: '-msse4.1' [-Wunused-command-line-argument]
--- AggregateSolver.o ---
20 errors generated.
*** [AggregateSolver.o] Error code 1

make[2]: stopped in /wrkdirs/usr/ports/science/opensph/work/sph-da3692e99fac19bc512c8462b0492eabd2de33af/lib
--- BarnesHut.o ---
In file included from gravity/BarnesHut.cpp:1:
In file included from ./gravity/BarnesHut.h:9:
In file included from ./gravity/IGravity.h:9:
In file included from ./objects/geometry/Vector.h:12:
In file included from /usr/lib/clang/10.0.1/include/immintrin.h:14:
/usr/lib/clang/10.0.1/include/mmintrin.h:33:5: error: use of undeclared identifier '__builtin_ia32_emms'; did you mean '__builtin_isless'?
    __builtin_ia32_emms();
    ^
/usr/include/c++/v1/math.h:651:12: note: '__builtin_isless' declared here
    return isless(__lcpp_x, __lcpp_y);
           ^
/usr/include/math.h:120:23: note: expanded from macro 'isless'
#define isless(x, y)            __builtin_isless((x), (y))
                                ^
In file included from gravity/BarnesHut.cpp:1:
In file included from ./gravity/BarnesHut.h:9:
In file included from ./gravity/IGravity.h:9:
In file included from ./objects/geometry/Vector.h:12:
In file included from /usr/lib/clang/10.0.1/include/immintrin.h:14:
/usr/lib/clang/10.0.1/include/mmintrin.h:33:25: error: too few arguments to function call, expected 2, have 0
    __builtin_ia32_emms();
                        ^
/usr/lib/clang/10.0.1/include/mmintrin.h:50:19: error: use of undeclared identifier '__builtin_ia32_vec_init_v2si'
    return (__m64)__builtin_ia32_vec_init_v2si(__i, 0);
                  ^
/usr/lib/clang/10.0.1/include/mmintrin.h:67:12: error: use of undeclared identifier '__builtin_ia32_vec_ext_v2si'
    return __builtin_ia32_vec_ext_v2si((__v2si)__m, 0);
           ^
/usr/lib/clang/10.0.1/include/mmintrin.h:129:19: error: use of undeclared identifier '__builtin_ia32_packsswb'
    return (__m64)__builtin_ia32_packsswb((__v4hi)__m1, (__v4hi)__m2);
                  ^
/usr/lib/clang/10.0.1/include/mmintrin.h:159:19: error: use of undeclared identifier '__builtin_ia32_packssdw'
    return (__m64)__builtin_ia32_packssdw((__v2si)__m1, (__v2si)__m2);
                  ^
/usr/lib/clang/10.0.1/include/mmintrin.h:189:19: error: use of undeclared identifier '__builtin_ia32_packuswb'
    return (__m64)__builtin_ia32_packuswb((__v4hi)__m1, (__v4hi)__m2);
                  ^
/usr/lib/clang/10.0.1/include/mmintrin.h:216:19: error: use of undeclared identifier '__builtin_ia32_punpckhbw'
    return (__m64)__builtin_ia32_punpckhbw((__v8qi)__m1, (__v8qi)__m2);
                  ^
/usr/lib/clang/10.0.1/include/mmintrin.h:239:19: error: use of undeclared identifier '__builtin_ia32_punpckhwd'
    return (__m64)__builtin_ia32_punpckhwd((__v4hi)__m1, (__v4hi)__m2);
                  ^
/usr/lib/clang/10.0.1/include/mmintrin.h:260:19: error: use of undeclared identifier '__builtin_ia32_punpckhdq'
    return (__m64)__builtin_ia32_punpckhdq((__v2si)__m1, (__v2si)__m2);
                  ^
/usr/lib/clang/10.0.1/include/mmintrin.h:287:19: error: use of undeclared identifier '__builtin_ia32_punpcklbw'
    return (__m64)__builtin_ia32_punpcklbw((__v8qi)__m1, (__v8qi)__m2);
                  ^
/usr/lib/clang/10.0.1/include/mmintrin.h:310:19: error: use of undeclared identifier '__builtin_ia32_punpcklwd'
    return (__m64)__builtin_ia32_punpcklwd((__v4hi)__m1, (__v4hi)__m2);
                  ^
/usr/lib/clang/10.0.1/include/mmintrin.h:331:19: error: use of undeclared identifier '__builtin_ia32_punpckldq'
    return (__m64)__builtin_ia32_punpckldq((__v2si)__m1, (__v2si)__m2);
                  ^
/usr/lib/clang/10.0.1/include/mmintrin.h:352:19: error: use of undeclared identifier '__builtin_ia32_paddb'; did you mean '__builtin_arm_addg'?
    return (__m64)__builtin_ia32_paddb((__v8qi)__m1, (__v8qi)__m2);
                  ^
/usr/lib/clang/10.0.1/include/mmintrin.h:352:19: note: '__builtin_arm_addg' declared here
/usr/lib/clang/10.0.1/include/mmintrin.h:352:19: error: first argument of MTE builtin function must be a pointer ('__v8qi' (vector of 8 'char' values) invalid)
    return (__m64)__builtin_ia32_paddb((__v8qi)__m1, (__v8qi)__m2);
                  ^                    ~~~~~~~~~~~~
/usr/lib/clang/10.0.1/include/mmintrin.h:373:19: error: use of undeclared identifier '__builtin_ia32_paddw'; did you mean '__builtin_arm_addg'?
    return (__m64)__builtin_ia32_paddw((__v4hi)__m1, (__v4hi)__m2);
                  ^
/usr/lib/clang/10.0.1/include/mmintrin.h:352:19: note: '__builtin_arm_addg' declared here
    return (__m64)__builtin_ia32_paddb((__v8qi)__m1, (__v8qi)__m2);
                  ^
/usr/lib/clang/10.0.1/include/mmintrin.h:373:19: error: first argument of MTE builtin function must be a pointer ('__v4hi' (vector of 4 'short' values) invalid)
    return (__m64)__builtin_ia32_paddw((__v4hi)__m1, (__v4hi)__m2);
                  ^                    ~~~~~~~~~~~~
/usr/lib/clang/10.0.1/include/mmintrin.h:394:19: error: use of undeclared identifier '__builtin_ia32_paddd'; did you mean '__builtin_arm_addg'?
    return (__m64)__builtin_ia32_paddd((__v2si)__m1, (__v2si)__m2);
                  ^
/usr/lib/clang/10.0.1/include/mmintrin.h:352:19: note: '__builtin_arm_addg' declared here
    return (__m64)__builtin_ia32_paddb((__v8qi)__m1, (__v8qi)__m2);
                  ^
/usr/lib/clang/10.0.1/include/mmintrin.h:394:19: error: first argument of MTE builtin function must be a pointer ('__v2si' (vector of 2 'int' values) invalid)
    return (__m64)__builtin_ia32_paddd((__v2si)__m1, (__v2si)__m2);
                  ^                    ~~~~~~~~~~~~
fatal error: too many errors emitted, stopping now [-ferror-limit=]
20 errors generated.
*** [BarnesHut.o] Error code 1

make[2]: stopped in /wrkdirs/usr/ports/science/opensph/work/sph-da3692e99fac19bc512c8462b0492eabd2de33af/lib
2 errors

make[2]: stopped in /wrkdirs/usr/ports/science/opensph/work/sph-da3692e99fac19bc512c8462b0492eabd2de33af/lib
*** [sub-lib-all-ordered] Error code 2

make[1]: stopped in /wrkdirs/usr/ports/science/opensph/work/sph-da3692e99fac19bc512c8462b0492eabd2de33af
1 error

make[1]: stopped in /wrkdirs/usr/ports/science/opensph/work/sph-da3692e99fac19bc512c8462b0492eabd2de33af
===> Compilation failed unexpectedly.
Try to set MAKE_JOBS_UNSAFE=yes and rebuild before reporting the failure to
the maintainer.
*** Error code 1

Stop.
make: stopped in /usr/ports/science/opensph
Received on Sat Jul 31 2021 - 09:41:38 UTC

Original text of this message