[package - 130powerpc64-quarterly][multimedia/gpac-libgpac] Failed for gpac-libgpac-1.0.0_1,1 in build

From: <pkg-fallout_at_FreeBSD.org>
Date: Sat, 31 Jul 2021 06:25:45 GMT
You are receiving this mail as a port that you maintain
is failing to build on the FreeBSD package build server.
Please investigate the failure and submit a PR to fix
build.

Maintainer:     multimedia_at_FreeBSD.org
Log URL:        http://foul1.nyi.freebsd.org/data/130powerpc64-quarterly/e17f46c5dd6b/logs/gpac-libgpac-1.0.0_1,1.log
Build URL:      http://foul1.nyi.freebsd.org/build.html?mastername=130powerpc64-quarterly&build=e17f46c5dd6b
Log:

=>> Building multimedia/gpac-libgpac
build started at Sat Jul 31 06:21:07 UTC 2021
port directory: /usr/ports/multimedia/gpac-libgpac
package name: gpac-libgpac-1.0.0_1,1
building for: FreeBSD 130powerpc64-quarterly-job-11 13.0-RELEASE FreeBSD 13.0-RELEASE powerpc
maintained by: multimedia_at_FreeBSD.org
Makefile ident: 
Poudriere version: 3.2.8-21-g883afb07
Host OSVERSION: 1400008
Jail OSVERSION: 1300139
Job Id: 11

---Begin Environment---
SHELL=/bin/csh
OSVERSION=1300139
UNAME_v=FreeBSD 13.0-RELEASE
UNAME_r=13.0-RELEASE
BLOCKSIZE=K
MAIL=/var/mail/root
MM_CHARSET=UTF-8
LANG=C.UTF-8
STATUS=1
HOME=/root
PATH=/sbin:/bin:/usr/sbin:/usr/bin:/usr/local/sbin:/usr/local/bin:/root/bin
LOCALBASE=/usr/local
USER=root
LIBEXECPREFIX=/usr/local/libexec/poudriere
POUDRIERE_VERSION=3.2.8-21-g883afb07
MASTERMNT=/usr/local/poudriere/data/.m/130powerpc64-quarterly/ref
POUDRIERE_BUILD_TYPE=bulk
PACKAGE_BUILDING=yes
SAVED_TERM=
PWD=/usr/local/poudriere/data/.m/130powerpc64-quarterly/ref/.p/pool
P_PORTS_FEATURES=FLAVORS SELECTED_OPTIONS
MASTERNAME=130powerpc64-quarterly
SCRIPTPREFIX=/usr/local/share/poudriere
OLDPWD=/usr/local/poudriere/data/.m/130powerpc64-quarterly/ref/.p
SCRIPTPATH=/usr/local/share/poudriere/bulk.sh
POUDRIEREPATH=/usr/local/bin/poudriere
---End Environment---

---Begin Poudriere Port Flags/Env---
PORT_FLAGS=
PKGENV=
FLAVOR=
DEPENDS_ARGS=
MAKE_ARGS=
---End Poudriere Port Flags/Env---

---Begin OPTIONS List---
===> The following configuration options are available for gpac-libgpac-1.0.0_1,1:
     IPV6=on: IPv6 protocol support
     JPEG=on: JPEG image format support
     OPENGL=off: 2D/3D rendering support via OpenGL
     PNG=on: PNG image format support
     SSL=on: SSL protocol support
     XVIDEO=off: X11 Video extension library support
===> Use 'make config' to modify these settings
---End OPTIONS List---

--MAINTAINER--
multimedia_at_FreeBSD.org
--End MAINTAINER--

--CONFIGURE_ARGS--
--prefix="/usr/local" --cc="cc" --X11-path="/usr/local"  --extra-cflags="-O2 -pipe  -I/wrkdirs/usr/ports/multimedia/gpac-libgpac/work/gpac-1.0.0/include -I/usr/local/include -fstack-protector-strong -fno-strict-aliasing " --extra-ldflags=" -L/usr/local/lib  -fstack-protector-strong "  --static-modules  --enable-pic  --disable-wx  --use-js=no --use-a52=no --use-faad=no --use-ffmpeg=no  --use-ft=no --use-mad=no --use-ogg=no --use-xvid=no  --use-openjpeg=no --use-theora=no --use-vorbis=no --enable-ipv6 --use-jpeg=local --disable-3d --use-png=local --enable-ssl --disable-x11-xv --disable-x11-shm
--End CONFIGURE_ARGS--

--CONFIGURE_ENV--
MAKE=gmake XDG_DATA_HOME=/wrkdirs/usr/ports/multimedia/gpac-libgpac/work  XDG_CONFIG_HOME=/wrkdirs/usr/ports/multimedia/gpac-libgpac/work  HOME=/wrkdirs/usr/ports/multimedia/gpac-libgpac/work TMPDIR="/tmp" PATH=/wrkdirs/usr/ports/multimedia/gpac-libgpac/work/.bin:/sbin:/bin:/usr/sbin:/usr/bin:/usr/local/sbin:/usr/local/bin:/root/bin SHELL=/bin/sh CONFIG_SHELL=/bin/sh
--End CONFIGURE_ENV--

--MAKE_ENV--
OPENSSLBASE=/usr OPENSSLDIR=/etc/ssl OPENSSLINC=/usr/include OPENSSLLIB=/usr/lib XDG_DATA_HOME=/wrkdirs/usr/ports/multimedia/gpac-libgpac/work  XDG_CONFIG_HOME=/wrkdirs/usr/ports/multimedia/gpac-libgpac/work  HOME=/wrkdirs/usr/ports/multimedia/gpac-libgpac/work TMPDIR="/tmp" PATH=/wrkdirs/usr/ports/multimedia/gpac-libgpac/work/.bin:/sbin:/bin:/usr/sbin:/usr/bin:/usr/local/sbin:/usr/local/bin:/root/bin NO_PIE=yes MK_DEBUG_FILES=no MK_KERNEL_SYMBOLS=no SHELL=/bin/sh NO_LINT=YES PREFIX=/usr/local  LOCALBASE=/usr/local  CC="cc" CFLAGS="-O2 -pipe  -I/wrkdirs/usr/ports/multimedia/gpac-libgpac/work/gpac-1.0.0/include -I/usr/local/include -fstack-protector-strong -fno-strict-aliasing "  CPP="cpp" CPPFLAGS=""  LDFLAGS=" -L/usr/local/lib  -fstack-protector-strong " LIBS=""  CXX="c++" CXXFLAGS="-O2 -pipe -I/wrkdirs/usr/ports/multimedia/gpac-libgpac/work/gpac-1.0.0/include -I/usr/local/include -fstack-protector-strong -fno-strict-aliasing  "  MANPREFIX="/usr/local" BSD_INSTALL_PROGRAM="install  
 -s -m 555"  BSD_INSTALL_LIB="install  -s -m 0644"  BSD_INSTALL_SCRIPT="install  -m 555"  BSD_INSTALL_DATA="install  -m 0644"  BSD_INSTALL_MAN="install  -m 444"
--End MAKE_ENV--

--PLIST_SUB--
OSREL=13.0 PREFIX=%D LOCALBASE=/usr/local  RESETPREFIX=/usr/local LIB32DIR=lib DOCSDIR="share/doc/gpac"  EXAMPLESDIR="share/examples/gpac"  DATADIR="share/gpac"  WWWDIR="www/gpac"  ETCDIR="etc/gpac"
--End PLIST_SUB--

--SUB_LIST--
PREFIX=/usr/local LOCALBASE=/usr/local  DATADIR=/usr/local/share/gpac DOCSDIR=/usr/local/share/doc/gpac EXAMPLESDIR=/usr/local/share/examples/gpac  WWWDIR=/usr/local/www/gpac ETCDIR=/usr/local/etc/gpac
--End SUB_LIST--

---Begin make.conf---
USE_PACKAGE_DEPENDS=yes
BATCH=yes
WRKDIRPREFIX=/wrkdirs
PORTSDIR=/usr/ports
PACKAGES=/packages
DISTDIR=/distfiles
PACKAGE_BUILDING=yes
PACKAGE_BUILDING_FLAVORS=yes
#### /usr/local/etc/poudriere.d/make.conf ####
# XXX: We really need this but cannot use it while 'make checksum' does not
# try the next mirror on checksum failure.  It currently retries the same
# failed mirror and then fails rather then trying another.  It *does*
# try the next if the size is mismatched though.
#MASTER_SITE_FREEBSD=yes
# Build ALLOW_MAKE_JOBS_PACKAGES with 2 jobs
MAKE_JOBS_NUMBER=2
#### /usr/ports/Mk/Scripts/ports_env.sh ####
_CCVERSION_921dbbb2=FreeBSD clang version 11.0.1 (git_at_github.com:llvm/llvm-project.git llvmorg-11.0.1-0-g43ff75f2c3fe) Target: powerpc64-unknown-freebsd13.0 Thread model: posix InstalledDir: /usr/bin
_ALTCCVERSION_921dbbb2=none
_CXXINTERNAL_acaad9ca=FreeBSD clang version 11.0.1 (git_at_github.com:llvm/llvm-project.git llvmorg-11.0.1-0-g43ff75f2c3fe) Target: powerpc64-unknown-freebsd13.0 Thread model: posix InstalledDir: /usr/bin "/usr/bin/ld" "--eh-frame-hdr" "-dynamic-linker" "/libexec/ld-elf.so.1" "--enable-new-dtags" "-o" "a.out" "/usr/lib/crt1.o" "/usr/lib/crti.o" "/usr/lib/crtbegin.o" "-L/usr/lib" "/dev/null" "-lc++" "-lm" "-lgcc" "--as-needed" "-lgcc_s" "--no-as-needed" "-lc" "-lgcc" "--as-needed" "-lgcc_s" "--no-as-needed" "/usr/lib/crtend.o" "/usr/lib/crtn.o"
CC_OUTPUT_921dbbb2_58173849=yes
CC_OUTPUT_921dbbb2_9bdba57c=yes
CC_OUTPUT_921dbbb2_6a4fe7f5=yes
CC_OUTPUT_921dbbb2_6bcac02b=yes
CC_OUTPUT_921dbbb2_67d20829=yes
CC_OUTPUT_921dbbb2_bfa62e83=yes
CC_OUTPUT_921dbbb2_f0b4d593=yes
CC_OUTPUT_921dbbb2_308abb44=yes
CC_OUTPUT_921dbbb2_f00456e5=yes
CC_OUTPUT_921dbbb2_65ad290d=yes
CC_OUTPUT_921dbbb2_f2776b26=yes
CC_OUTPUT_921dbbb2_b2657cc3=yes
CC_OUTPUT_921dbbb2_380987f7=yes
CC_OUTPUT_921dbbb2_160933ec=yes
CC_OUTPUT_921dbbb2_fb62803b=yes
_OBJC_CCVERSION_921dbbb2=FreeBSD clang version 11.0.1 (git_at_github.com:llvm/llvm-project.git llvmorg-11.0.1-0-g43ff75f2c3fe) Target: powerpc64-unknown-freebsd13.0 Thread model: posix InstalledDir: /usr/bin
_OBJC_ALTCCVERSION_921dbbb2=none
ARCH=powerpc64
PPC_ABI=ELFv2
OPSYS=FreeBSD
_OSRELEASE=13.0-RELEASE
OSREL=13.0
OSVERSION=1300139
PYTHONBASE=/usr/local
CONFIGURE_MAX_CMD_LEN=524288
HAVE_PORTS_ENV=1
#### Misc Poudriere ####
GID=0
UID=0
---End make.conf---
--Resource limits--
cpu time               (seconds, -t)  unlimited
file size           (512-blocks, -f)  unlimited
data seg size           (kbytes, -d)  33554432
stack size              (kbytes, -s)  524288
core file size      (512-blocks, -c)  unlimited
max memory size         (kbytes, -m)  unlimited
locked memory           (kbytes, -l)  unlimited
max user processes              (-u)  89999
open files                      (-n)  1024
virtual mem size        (kbytes, -v)  unlimited
swap limit              (kbytes, -w)  unlimited
socket buffer size       (bytes, -b)  unlimited
pseudo-terminals                (-p)  unlimited
kqueues                         (-k)  unlimited
umtx shared locks               (-o)  unlimited
--End resource limits--
=======================<phase: check-sanity   >============================
===>  License LGPL21 accepted by the user
===========================================================================
=======================<phase: pkg-depends    >============================
===>   gpac-libgpac-1.0.0_1,1 depends on file: /usr/local/sbin/pkg - not found
===>   Installing existing package /packages/All/pkg-1.16.3.txz
[130powerpc64-quarterly-job-11] Installing pkg-1.16.3...
[130powerpc64-quarterly-job-11] Extracting pkg-1.16.3: .......... done
===>   gpac-libgpac-1.0.0_1,1 depends on file: /usr/local/sbin/pkg - found
===>   Returning to build of gpac-libgpac-1.0.0_1,1
===========================================================================
=======================<phase: fetch-depends  >============================
===========================================================================
=======================<phase: fetch          >============================
===>  License LGPL21 accepted by the user
===> Fetching all distfiles required by gpac-libgpac-1.0.0_1,1 for building
===========================================================================
=======================<phase: checksum       >============================
===>  License LGPL21 accepted by the user
===> Fetching all distfiles required by gpac-libgpac-1.0.0_1,1 for building
=> SHA256 Checksum OK for gpac-gpac-v1.0.0_GH0.tar.gz.
===========================================================================
=======================<phase: extract-depends>============================
===========================================================================
=======================<phase: extract        >============================
===>  License LGPL21 accepted by the user
===> Fetching all distfiles required by gpac-libgpac-1.0.0_1,1 for building
===>  Extracting for gpac-libgpac-1.0.0_1,1
=> SHA256 Checksum OK for gpac-gpac-v1.0.0_GH0.tar.gz.
===========================================================================
=======================<phase: patch-depends  >============================
===========================================================================
=======================<phase: patch          >============================
===>  Patching for gpac-libgpac-1.0.0_1,1
===>   Converting DOS text files to UNIX text files
===>  Applying FreeBSD patches for gpac-libgpac-1.0.0_1,1 from /usr/ports/multimedia/gpac-libgpac/files
/usr/bin/sed -i.bak -e 's|s/\.\*\\(\[0-9\]\\)\\+\$/\\1/|s/^[^0-9]*//| ; /CFLAGS=/s/-O3//' /wrkdirs/usr/ports/multimedia/gpac-libgpac/work/gpac-1.0.0/configure
===========================================================================
=======================<phase: build-depends  >============================
===>   gpac-libgpac-1.0.0_1,1 depends on executable: bash - not found
===>   Installing existing package /packages/All/bash-5.1.8.txz
[130powerpc64-quarterly-job-11] Installing bash-5.1.8...
[130powerpc64-quarterly-job-11] `-- Installing gettext-runtime-0.21...
[130powerpc64-quarterly-job-11] |   `-- Installing indexinfo-0.3.1...
[130powerpc64-quarterly-job-11] |   `-- Extracting indexinfo-0.3.1: .... done
[130powerpc64-quarterly-job-11] `-- Extracting gettext-runtime-0.21: .......... done
[130powerpc64-quarterly-job-11] `-- Installing readline-8.1.1...
<snip>
1 warning generated.
  CC filters/in_atsc.c
  CC filters/in_dvb4linux.c
  CC filters/in_file.c
  CC filters/in_http.c
  CC filters/in_pipe.c
  CC filters/in_rtp.c
filters/in_pipe.c:203:3: warning: implicit declaration of function 'mkfifo' is invalid in C99 [-Wimplicit-function-declaration]
                mkfifo(src, 0666);
                ^
1 warning generated.
  CC filters/in_rtp_rtsp.c
  CC filters/in_rtp_sdp.c
  CC filters/in_rtp_signaling.c
  CC filters/in_rtp_stream.c
  CC filters/in_sock.c
  CC filters/inspect.c
  CC filters/isoffin_load.c
  CC filters/isoffin_read.c
  CC filters/isoffin_read_ch.c
  CC filters/jsfilter.c
  CC filters/load_bt_xmt.c
  CC filters/load_svg.c
  CC filters/load_text.c
  CC filters/mux_avi.c
  CC filters/mux_gsf.c
  CC filters/mux_isom.c
  CC filters/mux_ts.c
  CC filters/out_audio.c
  CC filters/out_file.c
  CC filters/out_http.c
  CC filters/out_pipe.c
filters/out_pipe.c:186:3: warning: implicit declaration of function 'mkfifo' is invalid in C99 [-Wimplicit-function-declaration]
                mkfifo(szFinalName, 0666);
                ^
1 warning generated.
  CC filters/out_rtp.c
  CC filters/out_rtsp.c
  CC filters/out_sock.c
  CC filters/out_video.c
  CC filters/reframer.c
  CC filters/reframe_ac3.c
  CC filters/reframe_adts.c
  CC filters/reframe_latm.c
  CC filters/reframe_amr.c
  CC filters/reframe_av1.c
  CC filters/reframe_flac.c
  CC filters/reframe_h263.c
  CC filters/reframe_img.c
filters/reframe_img.c:299:17: warning: implicit declaration of function 'ntohl' is invalid in C99 [-Wimplicit-function-declaration]
        fh.bfOffBits = ntohl(fh.bfOffBits);
                       ^
  CC filters/reframe_mp3.c
1 warning generated.
  CC filters/reframe_mpgvid.c
  CC filters/reframe_nalu.c
  CC filters/reframe_prores.c
  CC filters/reframe_qcp.c
  CC filters/reframe_rawvid.c
  CC filters/reframe_rawpcm.c
  CC filters/resample_audio.c
  CC filters/tileagg.c
  CC filters/tssplit.c
  CC filters/unit_test_filter.c
  CC filters/rewind.c
  CC filters/rewrite_adts.c
  CC filters/rewrite_mp4v.c
  CC filters/rewrite_nalu.c
  CC filters/rewrite_obu.c
  CC filters/vflip.c
  CC filters/vcrop.c
  CC filters/write_generic.c
  CC filters/write_nhml.c
  CC filters/write_nhnt.c
  CC filters/write_qcp.c
  CC filters/write_vtt.c
  CC ../modules/dektec_out/dektec_video_decl.c
  CC filters/dec_openhevc.c
filters/dec_openhevc.c:1283:20: warning: unused function 'RegisterFilter' [-Wunused-function]
GF_FilterRegister *RegisterFilter(GF_FilterSession *session)
                   ^
1 warning generated.
  CC filters/dec_opensvc.c
  CC evg/ftgrays.c
  CC evg/raster3d.c
  CC evg/raster_565.c
  CC evg/raster_argb.c
  CC evg/raster_rgb.c
  CC evg/raster_yuv.c
  CC evg/stencil.c
evg/raster_yuv.c:1329:2: error: use of undeclared identifier 'ptr'
        get_u16_le(dstc, dst);
        ^
evg/raster_yuv.c:1294:55: note: expanded from macro 'get_u16_le'
#define get_u16_le(val, _ptr) { val = ((u32) (*(u8 *) ptr+1)<< 8) | *(u8 *) ptr; }
                                                      ^
evg/raster_yuv.c:1329:2: error: use of undeclared identifier 'ptr'
evg/raster_yuv.c:1294:77: note: expanded from macro 'get_u16_le'
#define get_u16_le(val, _ptr) { val = ((u32) (*(u8 *) ptr+1)<< 8) | *(u8 *) ptr; }
                                                                            ^
evg/raster_yuv.c:1376:5: error: use of undeclared identifier 'ptr'
                                get_u16_le(dst, s_ptr_u);
                                ^
evg/raster_yuv.c:1294:55: note: expanded from macro 'get_u16_le'
#define get_u16_le(val, _ptr) { val = ((u32) (*(u8 *) ptr+1)<< 8) | *(u8 *) ptr; }
                                                      ^
evg/raster_yuv.c:1376:5: error: use of undeclared identifier 'ptr'
evg/raster_yuv.c:1294:77: note: expanded from macro 'get_u16_le'
#define get_u16_le(val, _ptr) { val = ((u32) (*(u8 *) ptr+1)<< 8) | *(u8 *) ptr; }
                                                                            ^
evg/raster_yuv.c:1378:5: error: use of undeclared identifier 'ptr'
                                get_u16_le(dst, s_ptr_v);
                                ^
evg/raster_yuv.c:1294:55: note: expanded from macro 'get_u16_le'
#define get_u16_le(val, _ptr) { val = ((u32) (*(u8 *) ptr+1)<< 8) | *(u8 *) ptr; }
                                                      ^
evg/raster_yuv.c:1378:5: error: use of undeclared identifier 'ptr'
evg/raster_yuv.c:1294:77: note: expanded from macro 'get_u16_le'
#define get_u16_le(val, _ptr) { val = ((u32) (*(u8 *) ptr+1)<< 8) | *(u8 *) ptr; }
                                                                            ^
evg/raster_yuv.c:1537:5: error: use of undeclared identifier 'ptr'
                                get_u16_le(cdst, pU);
                                ^
evg/raster_yuv.c:1294:55: note: expanded from macro 'get_u16_le'
#define get_u16_le(val, _ptr) { val = ((u32) (*(u8 *) ptr+1)<< 8) | *(u8 *) ptr; }
                                                      ^
evg/raster_yuv.c:1537:5: error: use of undeclared identifier 'ptr'
evg/raster_yuv.c:1294:77: note: expanded from macro 'get_u16_le'
#define get_u16_le(val, _ptr) { val = ((u32) (*(u8 *) ptr+1)<< 8) | *(u8 *) ptr; }
                                                                            ^
evg/raster_yuv.c:1557:5: error: use of undeclared identifier 'ptr'
                                get_u16_le(cdst, pV);
                                ^
evg/raster_yuv.c:1294:55: note: expanded from macro 'get_u16_le'
#define get_u16_le(val, _ptr) { val = ((u32) (*(u8 *) ptr+1)<< 8) | *(u8 *) ptr; }
                                                      ^
evg/raster_yuv.c:1557:5: error: use of undeclared identifier 'ptr'
evg/raster_yuv.c:1294:77: note: expanded from macro 'get_u16_le'
#define get_u16_le(val, _ptr) { val = ((u32) (*(u8 *) ptr+1)<< 8) | *(u8 *) ptr; }
                                                                            ^
evg/raster_yuv.c:1727:5: error: use of undeclared identifier 'ptr'
                                get_u16_le(dst, pU);
                                ^
evg/raster_yuv.c:1294:55: note: expanded from macro 'get_u16_le'
#define get_u16_le(val, _ptr) { val = ((u32) (*(u8 *) ptr+1)<< 8) | *(u8 *) ptr; }
                                                      ^
evg/raster_yuv.c:1727:5: error: use of undeclared identifier 'ptr'
evg/raster_yuv.c:1294:77: note: expanded from macro 'get_u16_le'
#define get_u16_le(val, _ptr) { val = ((u32) (*(u8 *) ptr+1)<< 8) | *(u8 *) ptr; }
                                                                            ^
evg/raster_yuv.c:1729:5: error: use of undeclared identifier 'ptr'
                                get_u16_le(dst, pV);
                                ^
evg/raster_yuv.c:1294:55: note: expanded from macro 'get_u16_le'
#define get_u16_le(val, _ptr) { val = ((u32) (*(u8 *) ptr+1)<< 8) | *(u8 *) ptr; }
                                                      ^
evg/raster_yuv.c:1729:5: error: use of undeclared identifier 'ptr'
evg/raster_yuv.c:1294:77: note: expanded from macro 'get_u16_le'
#define get_u16_le(val, _ptr) { val = ((u32) (*(u8 *) ptr+1)<< 8) | *(u8 *) ptr; }
                                                                            ^
evg/raster_yuv.c:1769:5: error: use of undeclared identifier 'ptr'
                                get_u16_le(cdst, pU);
                                ^
evg/raster_yuv.c:1294:55: note: expanded from macro 'get_u16_le'
#define get_u16_le(val, _ptr) { val = ((u32) (*(u8 *) ptr+1)<< 8) | *(u8 *) ptr; }
                                                      ^
evg/raster_yuv.c:1769:5: error: use of undeclared identifier 'ptr'
evg/raster_yuv.c:1294:77: note: expanded from macro 'get_u16_le'
#define get_u16_le(val, _ptr) { val = ((u32) (*(u8 *) ptr+1)<< 8) | *(u8 *) ptr; }
                                                                            ^
evg/raster_yuv.c:1787:5: error: use of undeclared identifier 'ptr'
                                get_u16_le(cdst, pV);
                                ^
evg/raster_yuv.c:1294:55: note: expanded from macro 'get_u16_le'
#define get_u16_le(val, _ptr) { val = ((u32) (*(u8 *) ptr+1)<< 8) | *(u8 *) ptr; }
                                                      ^
evg/raster_yuv.c:1787:5: error: use of undeclared identifier 'ptr'
evg/raster_yuv.c:1294:77: note: expanded from macro 'get_u16_le'
#define get_u16_le(val, _ptr) { val = ((u32) (*(u8 *) ptr+1)<< 8) | *(u8 *) ptr; }
                                                                            ^
evg/raster_yuv.c:1907:5: error: use of undeclared identifier 'ptr'
                                get_u16_le(dst, s_ptr_u);
                                ^
evg/raster_yuv.c:1294:55: note: expanded from macro 'get_u16_le'
#define get_u16_le(val, _ptr) { val = ((u32) (*(u8 *) ptr+1)<< 8) | *(u8 *) ptr; }
                                                      ^
fatal error: too many errors emitted, stopping now [-ferror-limit=]
20 errors generated.
gmake[2]: *** [../config.mak:146: evg/raster_yuv.o] Error 1
gmake[2]: *** Waiting for unfinished jobs....
gmake[2]: Leaving directory '/wrkdirs/usr/ports/multimedia/gpac-libgpac/work/gpac-1.0.0/src'
gmake[1]: *** [Makefile:40: lib] Error 2
gmake[1]: Leaving directory '/wrkdirs/usr/ports/multimedia/gpac-libgpac/work/gpac-1.0.0'
===> Compilation failed unexpectedly.
Try to set MAKE_JOBS_UNSAFE=yes and rebuild before reporting the failure to
the maintainer.
*** Error code 1

Stop.
make: stopped in /usr/ports/multimedia/gpac-libgpac
Received on Sat Jul 31 2021 - 06:25:45 UTC

Original text of this message