[package - main-riscv64-default][net/gamenetworkingsockets] Failed for gamenetworkingsockets-1.3.0_1 in build

From: <pkg-fallout_at_FreeBSD.org>
Date: Thu, 29 Jul 2021 20:55:22 GMT
You are receiving this mail as a port that you maintain
is failing to build on the FreeBSD package build server.
Please investigate the failure and submit a PR to fix
build.

Maintainer:     kpedersen_at_disroot.org
Log URL:        http://beefy7.nyi.freebsd.org/data/main-riscv64-default/pd69639d824b8_s7685f8344d/logs/gamenetworkingsockets-1.3.0_1.log
Build URL:      http://beefy7.nyi.freebsd.org/build.html?mastername=main-riscv64-default&build=pd69639d824b8_s7685f8344d
Log:

=>> Building net/gamenetworkingsockets
build started at Thu Jul 29 20:54:32 UTC 2021
port directory: /usr/ports/net/gamenetworkingsockets
package name: gamenetworkingsockets-1.3.0_1
building for: FreeBSD main-riscv64-default-job-14 14.0-CURRENT FreeBSD 14.0-CURRENT 1400026 riscv
maintained by: kpedersen_at_disroot.org
Makefile ident: 
Poudriere version: 3.2.8-20-g137a4a48
Host OSVERSION: 1400008
Jail OSVERSION: 1400026
Job Id: 14




!!! Jail is newer than host. (Jail: 1400026, Host: 1400008) !!!
!!! This is not supported. !!!
!!! Host kernel must be same or newer than jail. !!!
!!! Expect build failures. !!!



---Begin Environment---
SHELL=/bin/csh
UNAME_p=riscv64
UNAME_m=riscv
ABI_FILE=/usr/lib/crt1.o
OSVERSION=1400026
UNAME_v=FreeBSD 14.0-CURRENT 1400026
UNAME_r=14.0-CURRENT
BLOCKSIZE=K
MAIL=/var/mail/root
MM_CHARSET=UTF-8
LANG=C.UTF-8
STATUS=1
HOME=/root
PATH=/sbin:/bin:/usr/sbin:/usr/bin:/usr/local/sbin:/usr/local/bin:/root/bin
LOCALBASE=/usr/local
QEMU_EMULATING=1
USER=root
LIBEXECPREFIX=/usr/local/libexec/poudriere
POUDRIERE_VERSION=3.2.8-20-g137a4a48
MASTERMNT=/usr/local/poudriere/data/.m/main-riscv64-default/ref
POUDRIERE_BUILD_TYPE=bulk
PACKAGE_BUILDING=yes
SAVED_TERM=
PWD=/usr/local/poudriere/data/.m/main-riscv64-default/ref/.p/pool
P_PORTS_FEATURES=FLAVORS SELECTED_OPTIONS
MASTERNAME=main-riscv64-default
SCRIPTPREFIX=/usr/local/share/poudriere
OLDPWD=/usr/local/poudriere/data/.m/main-riscv64-default/ref/.p
SCRIPTPATH=/usr/local/share/poudriere/bulk.sh
POUDRIEREPATH=/usr/local/bin/poudriere
---End Environment---

---Begin Poudriere Port Flags/Env---
PORT_FLAGS=
PKGENV=
FLAVOR=
DEPENDS_ARGS=
MAKE_ARGS=
---End Poudriere Port Flags/Env---

---Begin OPTIONS List---
---End OPTIONS List---

--MAINTAINER--
kpedersen_at_disroot.org
--End MAINTAINER--

--CONFIGURE_ARGS--

--End CONFIGURE_ARGS--

--CONFIGURE_ENV--
XDG_DATA_HOME=/wrkdirs/usr/ports/net/gamenetworkingsockets/work  XDG_CONFIG_HOME=/wrkdirs/usr/ports/net/gamenetworkingsockets/work  HOME=/wrkdirs/usr/ports/net/gamenetworkingsockets/work TMPDIR="/tmp" PATH=/wrkdirs/usr/ports/net/gamenetworkingsockets/work/.bin:/sbin:/bin:/usr/sbin:/usr/bin:/usr/local/sbin:/usr/local/bin:/root/bin SHELL=/bin/sh CONFIG_SHELL=/bin/sh
--End CONFIGURE_ENV--

--MAKE_ENV--
NINJA_STATUS="[%p %s/%t] " XDG_DATA_HOME=/wrkdirs/usr/ports/net/gamenetworkingsockets/work  XDG_CONFIG_HOME=/wrkdirs/usr/ports/net/gamenetworkingsockets/work  HOME=/wrkdirs/usr/ports/net/gamenetworkingsockets/work TMPDIR="/tmp" PATH=/wrkdirs/usr/ports/net/gamenetworkingsockets/work/.bin:/sbin:/bin:/usr/sbin:/usr/bin:/usr/local/sbin:/usr/local/bin:/root/bin NO_PIE=yes MK_DEBUG_FILES=no MK_KERNEL_SYMBOLS=no SHELL=/bin/sh NO_LINT=YES DESTDIR=/wrkdirs/usr/ports/net/gamenetworkingsockets/work/stage PREFIX=/usr/local  LOCALBASE=/usr/local  CC="/nxb-bin/usr/bin/cc" CFLAGS="-O2 -pipe -march=rv64imafdc -mabi=lp64d  -fstack-protector-strong -fno-strict-aliasing "  CPP="/nxb-bin/usr/bin/cpp" CPPFLAGS=""  LDFLAGS=" -fstack-protector-strong " LIBS=""  CXX="/nxb-bin/usr/bin/c++" CXXFLAGS="-O2 -pipe -march=rv64imafdc -mabi=lp64d -fstack-protector-strong -fno-strict-aliasing  "  MANPREFIX="/usr/local" BSD_INSTALL_PROGRAM="install  -s -m 555"  BSD_INSTALL_LIB="install  -s -m 0644"  BSD_INSTALL_SCRIPT
 ="install  -m 555"  BSD_INSTALL_DATA="install  -m 0644"  BSD_INSTALL_MAN="install  -m 444"
--End MAKE_ENV--

--PLIST_SUB--
CMAKE_BUILD_TYPE="release" OSREL=14.0 PREFIX=%D LOCALBASE=/usr/local  RESETPREFIX=/usr/local LIB32DIR=lib DOCSDIR="share/doc/gamenetworkingsockets"  EXAMPLESDIR="share/examples/gamenetworkingsockets"  DATADIR="share/gamenetworkingsockets"  WWWDIR="www/gamenetworkingsockets"  ETCDIR="etc/gamenetworkingsockets"
--End PLIST_SUB--

--SUB_LIST--
PREFIX=/usr/local LOCALBASE=/usr/local  DATADIR=/usr/local/share/gamenetworkingsockets DOCSDIR=/usr/local/share/doc/gamenetworkingsockets EXAMPLESDIR=/usr/local/share/examples/gamenetworkingsockets  WWWDIR=/usr/local/www/gamenetworkingsockets ETCDIR=/usr/local/etc/gamenetworkingsockets
--End SUB_LIST--

---Begin make.conf---
.sinclude "/etc/make.nxb.conf"
USE_PACKAGE_DEPENDS=yes
BATCH=yes
WRKDIRPREFIX=/wrkdirs
PORTSDIR=/usr/ports
PACKAGES=/packages
DISTDIR=/distfiles
PACKAGE_BUILDING=yes
PACKAGE_BUILDING_FLAVORS=yes
MACHINE=riscv
MACHINE_ARCH=riscv64
ARCH=${MACHINE_ARCH}
#### /usr/local/etc/poudriere.d/make.conf ####
# XXX: We really need this but cannot use it while 'make checksum' does not
# try the next mirror on checksum failure.  It currently retries the same
# failed mirror and then fails rather then trying another.  It *does*
# try the next if the size is mismatched though.
#MASTER_SITE_FREEBSD=yes
# Build ALLOW_MAKE_JOBS_PACKAGES with 2 jobs
MAKE_JOBS_NUMBER=2
#### /usr/ports/Mk/Scripts/ports_env.sh ####
_CCVERSION_9d218390=FreeBSD clang version 12.0.1 (git_at_github.com:llvm/llvm-project.git llvmorg-12.0.1-0-gfed41342a82f) Target: riscv64-unknown-freebsd14.0 Thread model: posix InstalledDir: /nxb-bin/usr/bin
_ALTCCVERSION_9d218390=none
_CXXINTERNAL_9c45a5b1=FreeBSD clang version 12.0.1 (git_at_github.com:llvm/llvm-project.git llvmorg-12.0.1-0-gfed41342a82f) Target: riscv64-unknown-freebsd14.0 Thread model: posix InstalledDir: /nxb-bin/usr/bin "/nxb-bin/usr/bin/ld" "--eh-frame-hdr" "-dynamic-linker" "/libexec/ld-elf.so.1" "--enable-new-dtags" "-m" "elf64lriscv" "-o" "a.out" "/usr/lib/crt1.o" "/usr/lib/crti.o" "/usr/lib/crtbegin.o" "-L/usr/lib" "/dev/null" "-lc++" "-lm" "-lgcc" "--as-needed" "-lgcc_s" "--no-as-needed" "-lc" "-lgcc" "--as-needed" "-lgcc_s" "--no-as-needed" "/usr/lib/crtend.o" "/usr/lib/crtn.o"
CC_OUTPUT_9d218390_58173849=yes
CC_OUTPUT_9d218390_9bdba57c=yes
CC_OUTPUT_9d218390_6a4fe7f5=yes
CC_OUTPUT_9d218390_6bcac02b=yes
CC_OUTPUT_9d218390_67d20829=yes
CC_OUTPUT_9d218390_bfa62e83=yes
CC_OUTPUT_9d218390_f0b4d593=yes
CC_OUTPUT_9d218390_308abb44=yes
CC_OUTPUT_9d218390_f00456e5=yes
CC_OUTPUT_9d218390_65ad290d=yes
CC_OUTPUT_9d218390_f2776b26=yes
CC_OUTPUT_9d218390_b2657cc3=yes
CC_OUTPUT_9d218390_380987f7=yes
CC_OUTPUT_9d218390_160933ec=yes
CC_OUTPUT_9d218390_fb62803b=yes
_OBJC_CCVERSION_9d218390=FreeBSD clang version 12.0.1 (git_at_github.com:llvm/llvm-project.git llvmorg-12.0.1-0-gfed41342a82f) Target: riscv64-unknown-freebsd14.0 Thread model: posix InstalledDir: /nxb-bin/usr/bin
_OBJC_ALTCCVERSION_9d218390=none
ARCH=riscv64
OPSYS=FreeBSD
_OSRELEASE=14.0-CURRENT
OSREL=14.0
OSVERSION=1400026
PYTHONBASE=/usr/local
CONFIGURE_MAX_CMD_LEN=524288
HAVE_PORTS_ENV=1
#### Misc Poudriere ####
GID=0
UID=0
DISABLE_MAKE_JOBS=poudriere
---End make.conf---
---Begin make.nxb.conf---
CC=/nxb-bin/usr/bin/cc
CPP=/nxb-bin/usr/bin/cpp
CXX=/nxb-bin/usr/bin/c++
NM=/nxb-bin/usr/bin/nm
LD=/nxb-bin/usr/bin/ld
OBJCOPY=/nxb-bin/usr/bin/objcopy
SIZE=/nxb-bin/usr/bin/size
STRIPBIN=/nxb-bin/usr/bin/strip
SED=/nxb-bin/usr/bin/sed
RANLIB=/nxb-bin/usr/bin/ranlib
YACC=/nxb-bin/usr/bin/yacc
MAKE=/nxb-bin/usr/bin/make
STRINGS=/nxb-bin/usr/bin/strings
AWK=/nxb-bin/usr/bin/awk
FLEX=/nxb-bin/usr/bin/flex
---End make.nxb.conf---
--Resource limits--
cpu time               (seconds, -t)  unlimited
file size           (512-blocks, -f)  unlimited
data seg size           (kbytes, -d)  33554432
stack size              (kbytes, -s)  524288
core file size      (512-blocks, -c)  unlimited
max memory size         (kbytes, -m)  unlimited
locked memory           (kbytes, -l)  unlimited
max user processes              (-u)  89999
open files                      (-n)  1024
virtual mem size        (kbytes, -v)  unlimited
swap limit              (kbytes, -w)  unlimited
socket buffer size       (bytes, -b)  unlimited
pseudo-terminals                (-p)  unlimited
kqueues                         (-k)  unlimited
umtx shared locks               (-o)  unlimited
--End resource limits--
=======================<phase: check-sanity   >============================
===>  License BSD3CLAUSE accepted by the user
===========================================================================
=======================<phase: pkg-depends    >============================
===>   gamenetworkingsockets-1.3.0_1 depends on file: /usr/local/sbin/pkg - not found
===>   Installing existing package /packages/All/pkg-1.17.1.pkg
[main-riscv64-default-job-14] Installing pkg-1.17.1...
[main-riscv64-default-job-14] Extracting pkg-1.17.1: .......... done
===>   gamenetworkingsockets-1.3.0_1 depends on file: /usr/local/sbin/pkg - found
===>   Returning to build of gamenetworkingsockets-1.3.0_1
===========================================================================
=======================<phase: fetch-depends  >============================
===========================================================================
=======================<phase: fetch          >============================
===>  License BSD3CLAUSE accepted by the user
===> Fetching all distfiles required by gamenetworkingsockets-1.3.0_1 for building
===========================================================================
=======================<phase: checksum       >============================
===>  License BSD3CLAUSE accepted by the user
===> Fetching all distfiles required by gamenetworkingsockets-1.3.0_1 for building
<snip>
===>   Installing existing package /packages/All/cmake-3.20.5.pkg
[main-riscv64-default-job-14] Installing cmake-3.20.5...
[main-riscv64-default-job-14] `-- Installing curl-7.78.0...
[main-riscv64-default-job-14] |   `-- Installing ca_root_nss-3.68...
[main-riscv64-default-job-14] |   `-- Extracting ca_root_nss-3.68: ........ done
[main-riscv64-default-job-14] |   `-- Installing libnghttp2-1.44.0...
[main-riscv64-default-job-14] |   `-- Extracting libnghttp2-1.44.0: .......... done
[main-riscv64-default-job-14] |   `-- Installing libssh2-1.9.0_3,3...
[main-riscv64-default-job-14] |   `-- Extracting libssh2-1.9.0_3,3: .......... done
[main-riscv64-default-job-14] `-- Extracting curl-7.78.0: .......... done
[main-riscv64-default-job-14] `-- Installing expat-2.4.1...
[main-riscv64-default-job-14] `-- Extracting expat-2.4.1: .......... done
[main-riscv64-default-job-14] `-- Installing jsoncpp-1.9.4...
[main-riscv64-default-job-14] `-- Extracting jsoncpp-1.9.4: .......... done
[main-riscv64-default-job-14] `-- Installing libarchive-3.5.1,1...
[main-riscv64-default-job-14] |   `-- Installing liblz4-1.9.3,1...
[main-riscv64-default-job-14] |   `-- Extracting liblz4-1.9.3,1: .......... done
[main-riscv64-default-job-14] `-- Extracting libarchive-3.5.1,1: .......... done
[main-riscv64-default-job-14] `-- Installing libuv-1.41.0...
[main-riscv64-default-job-14] `-- Extracting libuv-1.41.0: .......... done
[main-riscv64-default-job-14] `-- Installing rhash-1.4.2...
[main-riscv64-default-job-14] |   `-- Installing gettext-runtime-0.21...
[main-riscv64-default-job-14] |   | `-- Installing indexinfo-0.3.1...
[main-riscv64-default-job-14] |   | `-- Extracting indexinfo-0.3.1: .... done
[main-riscv64-default-job-14] |   `-- Extracting gettext-runtime-0.21: .......... done
[main-riscv64-default-job-14] `-- Extracting rhash-1.4.2: .......... done
[main-riscv64-default-job-14] Extracting cmake-3.20.5: .......... done
=====
Message from ca_root_nss-3.68:

--
FreeBSD does not, and can not warrant that the certification authorities
whose certificates are included in this package have in any way been
audited for trustworthiness or RFC 3647 compliance.

Assessment and verification of trust is the complete responsibility of the
system administrator.


This package installs symlinks to support root certificates discovery by
default for software that uses OpenSSL.

This enables SSL Certificate Verification by client software without manual
intervention.

If you prefer to do this manually, replace the following symlinks with
either an empty file or your site-local certificate bundle.

  * /etc/ssl/cert.pem
  * /usr/local/etc/ssl/cert.pem
  * /usr/local/openssl/cert.pem
===>   gamenetworkingsockets-1.3.0_1 depends on file: /usr/local/bin/cmake - found
===>   Returning to build of gamenetworkingsockets-1.3.0_1
===>   gamenetworkingsockets-1.3.0_1 depends on executable: ninja - not found
===>   Installing existing package /packages/All/ninja-1.10.2,2.pkg
[main-riscv64-default-job-14] Installing ninja-1.10.2,2...
[main-riscv64-default-job-14] `-- Installing python38-3.8.11...
[main-riscv64-default-job-14] |   `-- Installing libffi-3.3_1...
[main-riscv64-default-job-14] |   `-- Extracting libffi-3.3_1: .......... done
[main-riscv64-default-job-14] |   `-- Installing mpdecimal-2.5.1...
[main-riscv64-default-job-14] |   `-- Extracting mpdecimal-2.5.1: .......... done
[main-riscv64-default-job-14] |   `-- Installing readline-8.1.1...
[main-riscv64-default-job-14] |   `-- Extracting readline-8.1.1: .......... done
[main-riscv64-default-job-14] `-- Extracting python38-3.8.11: .......... done
[main-riscv64-default-job-14] Extracting ninja-1.10.2,2: ........ done
=====
Message from python38-3.8.11:

--
Note that some standard Python modules are provided as separate ports
as they require additional dependencies. They are available as:

py38-gdbm       databases/py-gdbm_at_py38
py38-sqlite3    databases/py-sqlite3_at_py38
py38-tkinter    x11-toolkits/py-tkinter_at_py38
===>   gamenetworkingsockets-1.3.0_1 depends on executable: ninja - found
===>   Returning to build of gamenetworkingsockets-1.3.0_1
===========================================================================
=======================<phase: lib-depends    >============================
===>   gamenetworkingsockets-1.3.0_1 depends on shared library: libprotobuf.so - not found
===>   Installing existing package /packages/All/protobuf-3.17.3,1.pkg
[main-riscv64-default-job-14] Installing protobuf-3.17.3,1...
[main-riscv64-default-job-14] Extracting protobuf-3.17.3,1: .......... done
===>   gamenetworkingsockets-1.3.0_1 depends on shared library: libprotobuf.so - found (/usr/local/lib/libprotobuf.so)
===>   Returning to build of gamenetworkingsockets-1.3.0_1
===========================================================================
=======================<phase: configure      >============================
===>  Configuring for gamenetworkingsockets-1.3.0_1
===>  Performing out-of-source build
/bin/mkdir -p /wrkdirs/usr/ports/net/gamenetworkingsockets/work/.build
-- The C compiler identification is Clang 12.0.1
-- The CXX compiler identification is Clang 12.0.1
-- Detecting C compiler ABI info
-- Detecting C compiler ABI info - done
-- Check for working C compiler: /nxb-bin/usr/bin/cc - skipped
-- Detecting C compile features
-- Detecting C compile features - done
-- Detecting CXX compiler ABI info
-- Detecting CXX compiler ABI info - done
-- Check for working CXX compiler: /nxb-bin/usr/bin/c++ - skipped
-- Detecting CXX compile features
-- Detecting CXX compile features - done
-- CMAKE_BUILD_TYPE='Release'
-- Found OpenSSL: /usr/lib/libcrypto.so (found version "1.1.1k")  
-- OPENSSL_INCLUDE_DIR = /usr/include
-- Looking for EVP_MD_CTX_free
-- Looking for EVP_MD_CTX_free - found
-- Looking for EVP_PKEY_get_raw_public_key
-- Looking for EVP_PKEY_get_raw_public_key - found
-- Found Protobuf: /usr/local/lib/libprotobuf.so;-pthread (found version "3.17.3") 
-- Found Threads: TRUE  
-- Performing Test _fvisibility_hidden_TEST
-- Performing Test _fvisibility_hidden_TEST - Success
-- Performing Test _fno_strict_aliasing_TEST
-- Performing Test _fno_strict_aliasing_TEST - Success
-- Performing Test _Wall_TEST
-- Performing Test _Wall_TEST - Success
-- Performing Test _Wno_unknown_pragmas_TEST
-- Performing Test _Wno_unknown_pragmas_TEST - Success
-- Performing Test _Wno_sign_compare_TEST
-- Performing Test _Wno_sign_compare_TEST - Success
-- Performing Test _Wno_unused_local_typedef_TEST
-- Performing Test _Wno_unused_local_typedef_TEST - Success
-- Performing Test _Wno_unused_const_variable_TEST
-- Performing Test _Wno_unused_const_variable_TEST - Success
-- Performing Test _Wno_nested_anon_types_TEST
-- Performing Test _Wno_nested_anon_types_TEST - Success
-- Performing Test _Wno_format_truncation_TEST
-- Performing Test _Wno_format_truncation_TEST - Failed
-- Performing Test _Wstrict_prototypes_TEST
-- Performing Test _Wstrict_prototypes_TEST - Success
-- Performing Test _fvisibility_inlines_hidden_TEST
-- Performing Test _fvisibility_inlines_hidden_TEST - Success
-- Performing Test _Wno_reorder_TEST
-- Performing Test _Wno_reorder_TEST - Success
-- Performing Test _Wno_non_virtual_dtor_TEST
-- Performing Test _Wno_non_virtual_dtor_TEST - Success
-- Performing Test _Wno_zero_as_null_pointer_constant_TEST
-- Performing Test _Wno_zero_as_null_pointer_constant_TEST - Success
-- Performing Test _fno_exceptions_TEST
-- Performing Test _fno_exceptions_TEST - Success
-- Performing Test _fno_rtti_TEST
-- Performing Test _fno_rtti_TEST - Success
-- Crypto library for AES/SHA256: OpenSSL
-- Crypto library for ed25519/curve25519: OpenSSL
-- Link-time optimization: OFF
-- Configuring done
-- Generating done
CMake Warning:
  Manually-specified variables were not used by the project:

    CMAKE_COLOR_MAKEFILE
    CMAKE_MODULE_LINKER_FLAGS
    CMAKE_VERBOSE_MAKEFILE


-- Build files have been written to: /wrkdirs/usr/ports/net/gamenetworkingsockets/work/.build
===========================================================================
=======================<phase: build          >============================
===>  Building for gamenetworkingsockets-1.3.0_1
[  1% 1/68] cd /wrkdirs/usr/ports/net/gamenetworkingsockets/work/.build/src && /usr/local/bin/protoc --cpp_out /wrkdirs/usr/ports/net/gamenetworkingsockets/work/.build/src -I /wrkdirs/usr/ports/net/gamenetworkingsockets/work/GameNetworkingSockets-1.3.0/src/common /wrkdirs/usr/ports/net/gamenetworkingsockets/work/GameNetworkingSockets-1.3.0/src/common/steamnetworkingsockets_messages_certs.proto
[  2% 2/68] cd /wrkdirs/usr/ports/net/gamenetworkingsockets/work/.build/src && /usr/local/bin/protoc --cpp_out /wrkdirs/usr/ports/net/gamenetworkingsockets/work/.build/src -I /wrkdirs/usr/ports/net/gamenetworkingsockets/work/GameNetworkingSockets-1.3.0/src/common /wrkdirs/usr/ports/net/gamenetworkingsockets/work/GameNetworkingSockets-1.3.0/src/common/steamnetworkingsockets_messages.proto
[  4% 3/68] cd /wrkdirs/usr/ports/net/gamenetworkingsockets/work/.build/src && /usr/local/bin/protoc --cpp_out /wrkdirs/usr/ports/net/gamenetworkingsockets/work/.build/src -I /wrkdirs/usr/ports/net/gamenetworkingsockets/work/GameNetworkingSockets-1.3.0/src/common /wrkdirs/usr/ports/net/gamenetworkingsockets/work/GameNetworkingSockets-1.3.0/src/common/steamnetworkingsockets_messages_udp.proto
[  5% 4/68] /nxb-bin/usr/bin/c++ -DCRYPTO_DISABLE_ENCRYPT_WITH_PASSWORD -DENABLE_OPENSSLCONNECTION -DFREEBSD -DGOOGLE_PROTOBUF_NO_RTTI -DPOSIX -DSTEAMNETWORKINGSOCKETS_CRYPTO_25519_OPENSSL -DSTEAMNETWORKINGSOCKETS_CRYPTO_VALVEOPENSSL -DSTEAMNETWORKINGSOCKETS_FOREXPORT -DVALVE_CRYPTO_ENABLE_25519 -I/wrkdirs/usr/ports/net/gamenetworkingsockets/work/GameNetworkingSockets-1.3.0/src/../include -I/wrkdirs/usr/ports/net/gamenetworkingsockets/work/GameNetworkingSockets-1.3.0/src/common -I/wrkdirs/usr/ports/net/gamenetworkingsockets/work/GameNetworkingSockets-1.3.0/src/public -Isrc -I/usr/local/include -O2 -pipe -march=rv64imafdc -mabi=lp64d -fstack-protector-strong -fno-strict-aliasing -O2 -pipe -march=rv64imafdc -mabi=lp64d -fstack-protector-strong -fno-strict-aliasing -ffunction-sections -fdata-sections -fstack-protector-strong -fvisibility=hidden -fno-strict-aliasing -Wall -Wno-unknown-pragmas -Wno-sign-compare -Wno-unused-local-typedef -Wno-unused-const-variable -Wno-nested-anon-types -f
 visibility-inlines-hidden -Wno-reorder -Wno-non-virtual-dtor -Wno-zero-as-null-pointer-constant -fno-exceptions -fno-rtti -pthread -std=gnu++11 -MD -MT src/CMakeFiles/GameNetworkingSockets_s.dir/common/crypto.cpp.o -MF src/CMakeFiles/GameNetworkingSockets_s.dir/common/crypto.cpp.o.d -o src/CMakeFiles/GameNetworkingSockets_s.dir/common/crypto.cpp.o -c /wrkdirs/usr/ports/net/gamenetworkingsockets/work/GameNetworkingSockets-1.3.0/src/common/crypto.cpp
[  7% 5/68] /nxb-bin/usr/bin/c++ -DCRYPTO_DISABLE_ENCRYPT_WITH_PASSWORD -DENABLE_OPENSSLCONNECTION -DFREEBSD -DGOOGLE_PROTOBUF_NO_RTTI -DPOSIX -DSTEAMNETWORKINGSOCKETS_CRYPTO_25519_OPENSSL -DSTEAMNETWORKINGSOCKETS_CRYPTO_VALVEOPENSSL -DSTEAMNETWORKINGSOCKETS_FOREXPORT -DVALVE_CRYPTO_ENABLE_25519 -I/wrkdirs/usr/ports/net/gamenetworkingsockets/work/GameNetworkingSockets-1.3.0/src/../include -I/wrkdirs/usr/ports/net/gamenetworkingsockets/work/GameNetworkingSockets-1.3.0/src/common -I/wrkdirs/usr/ports/net/gamenetworkingsockets/work/GameNetworkingSockets-1.3.0/src/public -Isrc -I/usr/local/include -O2 -pipe -march=rv64imafdc -mabi=lp64d -fstack-protector-strong -fno-strict-aliasing -O2 -pipe -march=rv64imafdc -mabi=lp64d -fstack-protector-strong -fno-strict-aliasing -ffunction-sections -fdata-sections -fstack-protector-strong -fvisibility=hidden -fno-strict-aliasing -Wall -Wno-unknown-pragmas -Wno-sign-compare -Wno-unused-local-typedef -Wno-unused-const-variable -Wno-nested-anon-types -f
 visibility-inlines-hidden -Wno-reorder -Wno-non-virtual-dtor -Wno-zero-as-null-pointer-constant -fno-exceptions -fno-rtti -pthread -std=gnu++11 -MD -MT src/CMakeFiles/GameNetworkingSockets_s.dir/common/crypto_textencode.cpp.o -MF src/CMakeFiles/GameNetworkingSockets_s.dir/common/crypto_textencode.cpp.o.d -o src/CMakeFiles/GameNetworkingSockets_s.dir/common/crypto_textencode.cpp.o -c /wrkdirs/usr/ports/net/gamenetworkingsockets/work/GameNetworkingSockets-1.3.0/src/common/crypto_textencode.cpp
[  8% 6/68] /nxb-bin/usr/bin/c++ -DCRYPTO_DISABLE_ENCRYPT_WITH_PASSWORD -DENABLE_OPENSSLCONNECTION -DFREEBSD -DGOOGLE_PROTOBUF_NO_RTTI -DPOSIX -DSTEAMNETWORKINGSOCKETS_CRYPTO_25519_OPENSSL -DSTEAMNETWORKINGSOCKETS_CRYPTO_VALVEOPENSSL -DSTEAMNETWORKINGSOCKETS_FOREXPORT -DVALVE_CRYPTO_ENABLE_25519 -I/wrkdirs/usr/ports/net/gamenetworkingsockets/work/GameNetworkingSockets-1.3.0/src/../include -I/wrkdirs/usr/ports/net/gamenetworkingsockets/work/GameNetworkingSockets-1.3.0/src/common -I/wrkdirs/usr/ports/net/gamenetworkingsockets/work/GameNetworkingSockets-1.3.0/src/public -Isrc -I/usr/local/include -O2 -pipe -march=rv64imafdc -mabi=lp64d -fstack-protector-strong -fno-strict-aliasing -O2 -pipe -march=rv64imafdc -mabi=lp64d -fstack-protector-strong -fno-strict-aliasing -ffunction-sections -fdata-sections -fstack-protector-strong -fvisibility=hidden -fno-strict-aliasing -Wall -Wno-unknown-pragmas -Wno-sign-compare -Wno-unused-local-typedef -Wno-unused-const-variable -Wno-nested-anon-types -f
 visibility-inlines-hidden -Wno-reorder -Wno-non-virtual-dtor -Wno-zero-as-null-pointer-constant -fno-exceptions -fno-rtti -pthread -std=gnu++11 -MD -MT src/CMakeFiles/GameNetworkingSockets_s.dir/common/keypair.cpp.o -MF src/CMakeFiles/GameNetworkingSockets_s.dir/common/keypair.cpp.o.d -o src/CMakeFiles/GameNetworkingSockets_s.dir/common/keypair.cpp.o -c /wrkdirs/usr/ports/net/gamenetworkingsockets/work/GameNetworkingSockets-1.3.0/src/common/keypair.cpp
[ 10% 7/68] /nxb-bin/usr/bin/c++ -DCRYPTO_DISABLE_ENCRYPT_WITH_PASSWORD -DENABLE_OPENSSLCONNECTION -DFREEBSD -DGOOGLE_PROTOBUF_NO_RTTI -DPOSIX -DSTEAMNETWORKINGSOCKETS_CRYPTO_25519_OPENSSL -DSTEAMNETWORKINGSOCKETS_CRYPTO_VALVEOPENSSL -DSTEAMNETWORKINGSOCKETS_FOREXPORT -DVALVE_CRYPTO_ENABLE_25519 -I/wrkdirs/usr/ports/net/gamenetworkingsockets/work/GameNetworkingSockets-1.3.0/src/../include -I/wrkdirs/usr/ports/net/gamenetworkingsockets/work/GameNetworkingSockets-1.3.0/src/common -I/wrkdirs/usr/ports/net/gamenetworkingsockets/work/GameNetworkingSockets-1.3.0/src/public -Isrc -I/usr/local/include -O2 -pipe -march=rv64imafdc -mabi=lp64d -fstack-protector-strong -fno-strict-aliasing -O2 -pipe -march=rv64imafdc -mabi=lp64d -fstack-protector-strong -fno-strict-aliasing -ffunction-sections -fdata-sections -fstack-protector-strong -fvisibility=hidden -fno-strict-aliasing -Wall -Wno-unknown-pragmas -Wno-sign-compare -Wno-unused-local-typedef -Wno-unused-const-variable -Wno-nested-anon-types -f
 visibility-inlines-hidden -Wno-reorder -Wno-non-virtual-dtor -Wno-zero-as-null-pointer-constant -fno-exceptions -fno-rtti -pthread -std=gnu++11 -MD -MT src/CMakeFiles/GameNetworkingSockets_s.dir/common/steamid.cpp.o -MF src/CMakeFiles/GameNetworkingSockets_s.dir/common/steamid.cpp.o.d -o src/CMakeFiles/GameNetworkingSockets_s.dir/common/steamid.cpp.o -c /wrkdirs/usr/ports/net/gamenetworkingsockets/work/GameNetworkingSockets-1.3.0/src/common/steamid.cpp
[ 11% 8/68] /nxb-bin/usr/bin/c++ -DCRYPTO_DISABLE_ENCRYPT_WITH_PASSWORD -DENABLE_OPENSSLCONNECTION -DFREEBSD -DGOOGLE_PROTOBUF_NO_RTTI -DPOSIX -DSTEAMNETWORKINGSOCKETS_CRYPTO_25519_OPENSSL -DSTEAMNETWORKINGSOCKETS_CRYPTO_VALVEOPENSSL -DSTEAMNETWORKINGSOCKETS_FOREXPORT -DVALVE_CRYPTO_ENABLE_25519 -I/wrkdirs/usr/ports/net/gamenetworkingsockets/work/GameNetworkingSockets-1.3.0/src/../include -I/wrkdirs/usr/ports/net/gamenetworkingsockets/work/GameNetworkingSockets-1.3.0/src/common -I/wrkdirs/usr/ports/net/gamenetworkingsockets/work/GameNetworkingSockets-1.3.0/src/public -Isrc -I/usr/local/include -O2 -pipe -march=rv64imafdc -mabi=lp64d -fstack-protector-strong -fno-strict-aliasing -O2 -pipe -march=rv64imafdc -mabi=lp64d -fstack-protector-strong -fno-strict-aliasing -ffunction-sections -fdata-sections -fstack-protector-strong -fvisibility=hidden -fno-strict-aliasing -Wall -Wno-unknown-pragmas -Wno-sign-compare -Wno-unused-local-typedef -Wno-unused-const-variable -Wno-nested-anon-types -f
 visibility-inlines-hidden -Wno-reorder -Wno-non-virtual-dtor -Wno-zero-as-null-pointer-constant -fno-exceptions -fno-rtti -pthread -std=gnu++11 -MD -MT src/CMakeFiles/GameNetworkingSockets_s.dir/steamnetworkingsockets/clientlib/csteamnetworkingsockets.cpp.o -MF src/CMakeFiles/GameNetworkingSockets_s.dir/steamnetworkingsockets/clientlib/csteamnetworkingsockets.cpp.o.d -o src/CMakeFiles/GameNetworkingSockets_s.dir/steamnetworkingsockets/clientlib/csteamnetworkingsockets.cpp.o -c /wrkdirs/usr/ports/net/gamenetworkingsockets/work/GameNetworkingSockets-1.3.0/src/steamnetworkingsockets/clientlib/csteamnetworkingsockets.cpp
FAILED: src/CMakeFiles/GameNetworkingSockets_s.dir/steamnetworkingsockets/clientlib/csteamnetworkingsockets.cpp.o 
/nxb-bin/usr/bin/c++ -DCRYPTO_DISABLE_ENCRYPT_WITH_PASSWORD -DENABLE_OPENSSLCONNECTION -DFREEBSD -DGOOGLE_PROTOBUF_NO_RTTI -DPOSIX -DSTEAMNETWORKINGSOCKETS_CRYPTO_25519_OPENSSL -DSTEAMNETWORKINGSOCKETS_CRYPTO_VALVEOPENSSL -DSTEAMNETWORKINGSOCKETS_FOREXPORT -DVALVE_CRYPTO_ENABLE_25519 -I/wrkdirs/usr/ports/net/gamenetworkingsockets/work/GameNetworkingSockets-1.3.0/src/../include -I/wrkdirs/usr/ports/net/gamenetworkingsockets/work/GameNetworkingSockets-1.3.0/src/common -I/wrkdirs/usr/ports/net/gamenetworkingsockets/work/GameNetworkingSockets-1.3.0/src/public -Isrc -I/usr/local/include -O2 -pipe -march=rv64imafdc -mabi=lp64d -fstack-protector-strong -fno-strict-aliasing -O2 -pipe -march=rv64imafdc -mabi=lp64d -fstack-protector-strong -fno-strict-aliasing -ffunction-sections -fdata-sections -fstack-protector-strong -fvisibility=hidden -fno-strict-aliasing -Wall -Wno-unknown-pragmas -Wno-sign-compare -Wno-unused-local-typedef -Wno-unused-const-variable -Wno-nested-anon-types -fvisibility-i
 nlines-hidden -Wno-reorder -Wno-non-virtual-dtor -Wno-zero-as-null-pointer-constant -fno-exceptions -fno-rtti -pthread -std=gnu++11 -MD -MT src/CMakeFiles/GameNetworkingSockets_s.dir/steamnetworkingsockets/clientlib/csteamnetworkingsockets.cpp.o -MF src/CMakeFiles/GameNetworkingSockets_s.dir/steamnetworkingsockets/clientlib/csteamnetworkingsockets.cpp.o.d -o src/CMakeFiles/GameNetworkingSockets_s.dir/steamnetworkingsockets/clientlib/csteamnetworkingsockets.cpp.o -c /wrkdirs/usr/ports/net/gamenetworkingsockets/work/GameNetworkingSockets-1.3.0/src/steamnetworkingsockets/clientlib/csteamnetworkingsockets.cpp
In file included from /wrkdirs/usr/ports/net/gamenetworkingsockets/work/GameNetworkingSockets-1.3.0/src/steamnetworkingsockets/clientlib/csteamnetworkingsockets.cpp:3:
In file included from /wrkdirs/usr/ports/net/gamenetworkingsockets/work/GameNetworkingSockets-1.3.0/src/steamnetworkingsockets/clientlib/csteamnetworkingsockets.h:22:
In file included from /wrkdirs/usr/ports/net/gamenetworkingsockets/work/GameNetworkingSockets-1.3.0/src/steamnetworkingsockets/clientlib/steamnetworkingsockets_connections.h:7:
In file included from /wrkdirs/usr/ports/net/gamenetworkingsockets/work/GameNetworkingSockets-1.3.0/src/steamnetworkingsockets/clientlib/../steamnetworkingsockets_internal.h:12:
In file included from /wrkdirs/usr/ports/net/gamenetworkingsockets/work/GameNetworkingSockets-1.3.0/src/public/tier0/basetypes.h:15:
In file included from /wrkdirs/usr/ports/net/gamenetworkingsockets/work/GameNetworkingSockets-1.3.0/src/public/tier0/platform.h:28:
/wrkdirs/usr/ports/net/gamenetworkingsockets/work/GameNetworkingSockets-1.3.0/src/public/minbase/minbase_types.h:58:15: error: typedef redefinition with different types ('int64' (aka 'long long') vs 'int')
typedef int64 intp;
              ^
/wrkdirs/usr/ports/net/gamenetworkingsockets/work/GameNetworkingSockets-1.3.0/src/../include/steam/steamtypes.h:86:13: note: previous definition is here
typedef int intp;
            ^
In file included from /wrkdirs/usr/ports/net/gamenetworkingsockets/work/GameNetworkingSockets-1.3.0/src/steamnetworkingsockets/clientlib/csteamnetworkingsockets.cpp:3:
In file included from /wrkdirs/usr/ports/net/gamenetworkingsockets/work/GameNetworkingSockets-1.3.0/src/steamnetworkingsockets/clientlib/csteamnetworkingsockets.h:22:
In file included from /wrkdirs/usr/ports/net/gamenetworkingsockets/work/GameNetworkingSockets-1.3.0/src/steamnetworkingsockets/clientlib/steamnetworkingsockets_connections.h:7:
In file included from /wrkdirs/usr/ports/net/gamenetworkingsockets/work/GameNetworkingSockets-1.3.0/src/steamnetworkingsockets/clientlib/../steamnetworkingsockets_internal.h:12:
In file included from /wrkdirs/usr/ports/net/gamenetworkingsockets/work/GameNetworkingSockets-1.3.0/src/public/tier0/basetypes.h:15:
In file included from /wrkdirs/usr/ports/net/gamenetworkingsockets/work/GameNetworkingSockets-1.3.0/src/public/tier0/platform.h:28:
/wrkdirs/usr/ports/net/gamenetworkingsockets/work/GameNetworkingSockets-1.3.0/src/public/minbase/minbase_types.h:59:16: error: typedef redefinition with different types ('uint64' (aka 'unsigned long long') vs 'unsigned int')
typedef uint64 uintp;
               ^
/wrkdirs/usr/ports/net/gamenetworkingsockets/work/GameNetworkingSockets-1.3.0/src/../include/steam/steamtypes.h:87:22: note: previous definition is here
typedef unsigned int uintp;
                     ^
2 errors generated.
ninja: build stopped: subcommand failed.
*** Error code 1

Stop.
make: stopped in /usr/ports/net/gamenetworkingsockets
Received on Thu Jul 29 2021 - 20:55:22 UTC

Original text of this message