[package - main-i386-default][math/elpa] Failed for elpa-2019.05.002_2 in build

From: <pkg-fallout_at_FreeBSD.org>
Date: Thu, 29 Jul 2021 19:36:48 GMT
You are receiving this mail as a port that you maintain
is failing to build on the FreeBSD package build server.
Please investigate the failure and submit a PR to fix
build.

Maintainer:     yuri_at_FreeBSD.org
Log URL:        http://beefy17.nyi.freebsd.org/data/main-i386-default/pd69639d824b8_s7cbf1de38e/logs/elpa-2019.05.002_2.log
Build URL:      http://beefy17.nyi.freebsd.org/build.html?mastername=main-i386-default&build=pd69639d824b8_s7cbf1de38e
Log:

=>> Building math/elpa
build started at Thu Jul 29 19:36:16 UTC 2021
port directory: /usr/ports/math/elpa
package name: elpa-2019.05.002_2
building for: FreeBSD main-i386-default-job-12 14.0-CURRENT FreeBSD 14.0-CURRENT 1400027 i386
maintained by: yuri_at_FreeBSD.org
Makefile ident: 
Poudriere version: 3.2.8-20-g137a4a48
Host OSVERSION: 1400008
Jail OSVERSION: 1400027
Job Id: 12




!!! Jail is newer than host. (Jail: 1400027, Host: 1400008) !!!
!!! This is not supported. !!!
!!! Host kernel must be same or newer than jail. !!!
!!! Expect build failures. !!!



---Begin Environment---
SHELL=/bin/csh
UNAME_p=i386
UNAME_m=i386
OSVERSION=1400027
UNAME_v=FreeBSD 14.0-CURRENT 1400027
UNAME_r=14.0-CURRENT
BLOCKSIZE=K
MAIL=/var/mail/root
MM_CHARSET=UTF-8
LANG=C.UTF-8
STATUS=1
HOME=/root
PATH=/sbin:/bin:/usr/sbin:/usr/bin:/usr/local/sbin:/usr/local/bin:/root/bin
LOCALBASE=/usr/local
USER=root
LIBEXECPREFIX=/usr/local/libexec/poudriere
POUDRIERE_VERSION=3.2.8-20-g137a4a48
MASTERMNT=/usr/local/poudriere/data/.m/main-i386-default/ref
POUDRIERE_BUILD_TYPE=bulk
PACKAGE_BUILDING=yes
SAVED_TERM=
PWD=/usr/local/poudriere/data/.m/main-i386-default/ref/.p/pool
P_PORTS_FEATURES=FLAVORS SELECTED_OPTIONS
MASTERNAME=main-i386-default
SCRIPTPREFIX=/usr/local/share/poudriere
OLDPWD=/usr/local/poudriere/data/.m/main-i386-default/ref/.p
SCRIPTPATH=/usr/local/share/poudriere/bulk.sh
POUDRIEREPATH=/usr/local/bin/poudriere
---End Environment---

---Begin Poudriere Port Flags/Env---
PORT_FLAGS=
PKGENV=
FLAVOR=
DEPENDS_ARGS=
MAKE_ARGS=
---End Poudriere Port Flags/Env---

---Begin OPTIONS List---
===> The following configuration options are available for elpa-2019.05.002_2:
     DOCS=on: Build and/or install documentation
     MPI=off: MPI (Message Passing Interface) support
     OPENMP=off: Parallel processing support via OpenMP
===> Use 'make config' to modify these settings
---End OPTIONS List---

--MAINTAINER--
yuri_at_FreeBSD.org
--End MAINTAINER--

--CONFIGURE_ARGS--
--disable-avx --disable-avx2 --disable-static --without-mpi --disable-openmp --disable-sse --disable-sse-assembly --prefix=/usr/local ${_LATE_CONFIGURE_ARGS}
--End CONFIGURE_ARGS--

--CONFIGURE_ENV--
F77="gfortran10" FC="gfortran10" FFLAGS="-O -Wl,-rpath=/usr/local/lib/gcc10" FCFLAGS="-std=legacy -I/usr/local/include -Wl,-rpath=/usr/local/lib/gcc10" MAKE=gmake ac_cv_path_PERL=/usr/local/bin/perl ac_cv_path_PERL_PATH=/usr/local/bin/perl  PERL_USE_UNSAFE_INC=1 XDG_DATA_HOME=/wrkdirs/usr/ports/math/elpa/work  XDG_CONFIG_HOME=/wrkdirs/usr/ports/math/elpa/work  HOME=/wrkdirs/usr/ports/math/elpa/work TMPDIR="/tmp" PATH=/wrkdirs/usr/ports/math/elpa/work/.bin:/sbin:/bin:/usr/sbin:/usr/bin:/usr/local/sbin:/usr/local/bin:/root/bin SHELL=/bin/sh CONFIG_SHELL=/bin/sh ADDR2LINE="/usr/local/bin/addr2line" AR="/usr/local/bin/ar" AS="/usr/local/bin/as" CPPFILT="/usr/local/bin/c++filt" GPROF="/usr/local/bin/gprof" LD="/usr/local/bin/ld" NM="/usr/local/bin/nm" OBJCOPY="/usr/local/bin/objcopy" OBJDUMP="/usr/local/bin/objdump" RANLIB="/usr/local/bin/ranlib" READELF="/usr/local/bin/readelf" SIZE="/usr/local/bin/size" STRINGS="/usr/local/bin/strings" CMAKE_PREFIX_PATH="/usr/local" CONFIG_SITE=/usr/por
 ts/Templates/config.site lt_cv_sys_max_cmd_len=524288
--End CONFIGURE_ENV--

--MAKE_ENV--
F77="gfortran10" FC="gfortran10" FFLAGS="-O -Wl,-rpath=/usr/local/lib/gcc10" FCFLAGS="-std=legacy -I/usr/local/include -Wl,-rpath=/usr/local/lib/gcc10" PERL_USE_UNSAFE_INC=1 XDG_DATA_HOME=/wrkdirs/usr/ports/math/elpa/work  XDG_CONFIG_HOME=/wrkdirs/usr/ports/math/elpa/work  HOME=/wrkdirs/usr/ports/math/elpa/work TMPDIR="/tmp" PATH=/wrkdirs/usr/ports/math/elpa/work/.bin:/sbin:/bin:/usr/sbin:/usr/bin:/usr/local/sbin:/usr/local/bin:/root/bin NO_PIE=yes MK_DEBUG_FILES=no MK_KERNEL_SYMBOLS=no SHELL=/bin/sh NO_LINT=YES ADDR2LINE="/usr/local/bin/addr2line" AR="/usr/local/bin/ar" AS="/usr/local/bin/as" CPPFILT="/usr/local/bin/c++filt" GPROF="/usr/local/bin/gprof" LD="/usr/local/bin/ld" NM="/usr/local/bin/nm" OBJCOPY="/usr/local/bin/objcopy" OBJDUMP="/usr/local/bin/objdump" RANLIB="/usr/local/bin/ranlib" READELF="/usr/local/bin/readelf" SIZE="/usr/local/bin/size" STRINGS="/usr/local/bin/strings" PREFIX=/usr/local  LOCALBASE=/usr/local  CC="cc" CFLAGS="-O2 -pipe  -fstack-protector-strong -isyst
 em /usr/local/include -fno-strict-aliasing "  CPP="cpp" CPPFLAGS="-isystem /usr/local/include"  LDFLAGS=" -Wl,-rpath=/usr/local/lib/gcc10  -L/usr/local/lib/gcc10 -B/usr/local/bin -fstack-protector-strong " LIBS="-L/usr/local/lib"  CXX="c++" CXXFLAGS="-O2 -pipe -fstack-protector-strong -isystem /usr/local/include -fno-strict-aliasing  -isystem /usr/local/include "  MANPREFIX="/usr/local" BSD_INSTALL_PROGRAM="install  -s -m 555"  BSD_INSTALL_LIB="install  -s -m 0644"  BSD_INSTALL_SCRIPT="install  -m 555"  BSD_INSTALL_DATA="install  -m 0644"  BSD_INSTALL_MAN="install  -m 444"
--End MAKE_ENV--

--PLIST_SUB--
PORTDOCS="" OSREL=14.0 PREFIX=%D LOCALBASE=/usr/local  RESETPREFIX=/usr/local LIB32DIR=lib PERL_VERSION=5.32.1  PERL_VER=5.32  PERL5_MAN1=lib/perl5/site_perl/man/man1  PERL5_MAN3=lib/perl5/site_perl/man/man3  SITE_PERL=lib/perl5/site_perl  SITE_ARCH=lib/perl5/site_perl/mach/5.32 DOCSDIR="share/doc/elpa"  EXAMPLESDIR="share/examples/elpa"  DATADIR="share/elpa"  WWWDIR="www/elpa"  ETCDIR="etc/elpa"
--End PLIST_SUB--

--SUB_LIST--
PREFIX=/usr/local LOCALBASE=/usr/local  DATADIR=/usr/local/share/elpa DOCSDIR=/usr/local/share/doc/elpa EXAMPLESDIR=/usr/local/share/examples/elpa  WWWDIR=/usr/local/www/elpa ETCDIR=/usr/local/etc/elpa
--End SUB_LIST--

---Begin make.conf---
USE_PACKAGE_DEPENDS=yes
BATCH=yes
WRKDIRPREFIX=/wrkdirs
PORTSDIR=/usr/ports
PACKAGES=/packages
DISTDIR=/distfiles
PACKAGE_BUILDING=yes
PACKAGE_BUILDING_FLAVORS=yes
MACHINE=i386
MACHINE_ARCH=i386
ARCH=${MACHINE_ARCH}
#### /usr/local/etc/poudriere.d/make.conf ####
# XXX: We really need this but cannot use it while 'make checksum' does not
# try the next mirror on checksum failure.  It currently retries the same
# failed mirror and then fails rather then trying another.  It *does*
# try the next if the size is mismatched though.
#MASTER_SITE_FREEBSD=yes
# Build ALLOW_MAKE_JOBS_PACKAGES with 2 jobs
MAKE_JOBS_NUMBER=2
#### /usr/ports/Mk/Scripts/ports_env.sh ####
_CCVERSION_921dbbb2=FreeBSD clang version 12.0.1 (git_at_github.com:llvm/llvm-project.git llvmorg-12.0.1-0-gfed41342a82f) Target: i386-unknown-freebsd14.0 Thread model: posix InstalledDir: /usr/bin
_ALTCCVERSION_921dbbb2=none
_CXXINTERNAL_acaad9ca=FreeBSD clang version 12.0.1 (git_at_github.com:llvm/llvm-project.git llvmorg-12.0.1-0-gfed41342a82f) Target: i386-unknown-freebsd14.0 Thread model: posix InstalledDir: /usr/bin "/usr/bin/ld" "--eh-frame-hdr" "-dynamic-linker" "/libexec/ld-elf.so.1" "--hash-style=both" "--enable-new-dtags" "-m" "elf_i386_fbsd" "-o" "a.out" "/usr/lib/crt1.o" "/usr/lib/crti.o" "/usr/lib/crtbegin.o" "-L/usr/lib" "/dev/null" "-lc++" "-lm" "-lgcc" "--as-needed" "-lgcc_s" "--no-as-needed" "-lc" "-lgcc" "--as-needed" "-lgcc_s" "--no-as-needed" "/usr/lib/crtend.o" "/usr/lib/crtn.o"
CC_OUTPUT_921dbbb2_58173849=yes
CC_OUTPUT_921dbbb2_9bdba57c=yes
CC_OUTPUT_921dbbb2_6a4fe7f5=yes
CC_OUTPUT_921dbbb2_6bcac02b=yes
CC_OUTPUT_921dbbb2_67d20829=yes
CC_OUTPUT_921dbbb2_bfa62e83=yes
CC_OUTPUT_921dbbb2_f0b4d593=yes
CC_OUTPUT_921dbbb2_308abb44=yes
CC_OUTPUT_921dbbb2_f00456e5=yes
CC_OUTPUT_921dbbb2_65ad290d=yes
CC_OUTPUT_921dbbb2_f2776b26=yes
CC_OUTPUT_921dbbb2_b2657cc3=yes
CC_OUTPUT_921dbbb2_380987f7=yes
CC_OUTPUT_921dbbb2_160933ec=yes
CC_OUTPUT_921dbbb2_fb62803b=yes
_OBJC_CCVERSION_921dbbb2=FreeBSD clang version 12.0.1 (git_at_github.com:llvm/llvm-project.git llvmorg-12.0.1-0-gfed41342a82f) Target: i386-unknown-freebsd14.0 Thread model: posix InstalledDir: /usr/bin
_OBJC_ALTCCVERSION_921dbbb2=none
ARCH=i386
OPSYS=FreeBSD
_OSRELEASE=14.0-CURRENT
OSREL=14.0
OSVERSION=1400027
PYTHONBASE=/usr/local
CONFIGURE_MAX_CMD_LEN=524288
HAVE_PORTS_ENV=1
#### Misc Poudriere ####
GID=0
UID=0
---End make.conf---
--Resource limits--
cpu time               (seconds, -t)  unlimited
file size           (512-blocks, -f)  unlimited
data seg size           (kbytes, -d)  524288
stack size              (kbytes, -s)  65536
core file size      (512-blocks, -c)  unlimited
max memory size         (kbytes, -m)  unlimited
locked memory           (kbytes, -l)  unlimited
max user processes              (-u)  89999
open files                      (-n)  1024
virtual mem size        (kbytes, -v)  unlimited
swap limit              (kbytes, -w)  unlimited
socket buffer size       (bytes, -b)  unlimited
pseudo-terminals                (-p)  unlimited
kqueues                         (-k)  unlimited
umtx shared locks               (-o)  unlimited
--End resource limits--
=======================<phase: check-sanity   >============================
===>  License GPLv3 LGPL3 accepted by the user
===========================================================================
=======================<phase: pkg-depends    >============================
===>   elpa-2019.05.002_2 depends on file: /usr/local/sbin/pkg - not found
===>   Installing existing package /packages/All/pkg-1.17.1.pkg
[main-i386-default-job-12] Installing pkg-1.17.1...
[main-i386-default-job-12] Extracting pkg-1.17.1: .......... done
===>   elpa-2019.05.002_2 depends on file: /usr/local/sbin/pkg - found
===>   Returning to build of elpa-2019.05.002_2
===========================================================================
=======================<phase: fetch-depends  >============================
===========================================================================
=======================<phase: fetch          >============================
===>  License GPLv3 LGPL3 accepted by the user
===> Fetching all distfiles required by elpa-2019.05.002_2 for building
===========================================================================
=======================<phase: checksum       >============================
===>  License GPLv3 LGPL3 accepted by the user
===> Fetching all distfiles required by elpa-2019.05.002_2 for building
=> SHA256 Checksum OK for elpa-2019.05.002.tar.gz.
===========================================================================
=======================<phase: extract-depends>============================
===========================================================================
=======================<phase: extract        >============================
===>  License GPLv3 LGPL3 accepted by the user
===> Fetching all distfiles required by elpa-2019.05.002_2 for building
===>  Extracting for elpa-2019.05.002_2
=> SHA256 Checksum OK for elpa-2019.05.002.tar.gz.
===========================================================================
=======================<phase: patch-depends  >============================
===========================================================================
=======================<phase: patch          >============================
===>  Patching for elpa-2019.05.002_2
===>  Applying FreeBSD patches for elpa-2019.05.002_2 from /usr/ports/math/elpa/files
===========================================================================
<snip>
cpp: error: argument unused during compilation: '-Wall' [-Werror,-Wunused-command-line-argument]
cpp: error: argument unused during compilation: '-D HAVE_CONFIG_H' [-Werror,-Wunused-command-line-argument]
cpp: error: argument unused during compilation: '-Werror' [-Werror,-Wunused-command-line-argument]
cppcpp: error: argument unused during compilation: '-D HAVE_CONFIG_H' [-Werror,-Wunused-command-line-argument]
: error: argument unused during compilation: '-I .' [-Werror,-Wunused-command-line-argument]
cpp: error: argument unused during compilation: '-I .' [-Werror,-Wunused-command-line-argument]
cpp: error: argument unused during compilation: '-isystem /usr/local/include' [-Werror,-Wunused-command-line-argument]
cpp: error: argument unused during compilation: '-isystem /usr/local/include' [-Werror,-Wunused-command-line-argument]
cpp -P -traditional -Wall -Werror -DHAVE_CONFIG_H -I.   -isystem /usr/local/include -o /dev/stdout src/general/elpa_utilities.F90 | grep -i -o '^ *use [^ ,!:]*' | sed 's/^[[:space:]]*//;' | tr '[:upper:]' '[:lower:]' | sort -u > src/general/libelpa_private_la-elpa_utilities.use_mods_libelpa_private_la.lo
cpp -P -traditional -Wall -Werror -DHAVE_CONFIG_H -I.   -isystem /usr/local/include -o /dev/stdout src/ftimings/ftimings.F90 | grep -i -o '^ *use [^ ,!:]*' | sed 's/^[[:space:]]*//;' | tr '[:upper:]' '[:lower:]' | sort -u > src/ftimings/libelpa_private_la-ftimings.use_mods_libelpa_private_la.lo
cpp: error: argument unused during compilation: '-P' [-Werror,-Wunused-command-line-argument]
cpp: error: cpp: error: argument unused during compilation: '-traditional' [-Werror,-Wunused-command-line-argument]
argument unused during compilation: '-P' [-Werror,-Wunused-command-line-argument]
cpp: error: argument unused during compilation: '-Wall' [-Werror,-Wunused-command-line-argument]
cpp: error: argument unused during compilation: '-Werror' [-Werror,-Wunused-command-line-argument]
cpp: error: argument unused during compilation: '-traditional' [-Werror,-Wunused-command-line-argument]
cpp: error: argument unused during compilation: '-D HAVE_CONFIG_H' [-Werror,-Wunused-command-line-argument]
cpp: error: argument unused during compilation: '-Wall' [-Werror,-Wunused-command-line-argument]
cpp: error: argument unused during compilation: '-I .' [-Werror,-Wunused-command-line-argument]
cpp: error: argument unused during compilation: '-Werror' [-Werror,-Wunused-command-line-argument]
cpp: error: argument unused during compilation: '-isystem /usr/local/include' [-Werror,-Wunused-command-line-argument]
cpp: error: argument unused during compilation: '-D HAVE_CONFIG_H' [-Werror,-Wunused-command-line-argument]
cpp: error: argument unused during compilation: '-I .' [-Werror,-Wunused-command-line-argument]
cpp: error: argument unused during compilation: '-isystem /usr/local/include' [-Werror,-Wunused-command-line-argument]
cpp -P -traditional -Wall -Werror -DHAVE_CONFIG_H -I.   -isystem /usr/local/include -o /dev/stdout src/ftimings/ftimings_type.F90 | grep -i -o '^ *use [^ ,!:]*' | sed 's/^[[:space:]]*//;' | tr '[:upper:]' '[:lower:]' | sort -u > src/ftimings/libelpa_private_la-ftimings_type.use_mods_libelpa_private_la.lo
cpp -P -traditional -Wall -Werror -DHAVE_CONFIG_H -I.   -isystem /usr/local/include -o /dev/stdout src/ftimings/ftimings_value.F90 | grep -i -o '^ *use [^ ,!:]*' | sed 's/^[[:space:]]*//;' | tr '[:upper:]' '[:lower:]' | sort -u > src/ftimings/libelpa_private_la-ftimings_value.use_mods_libelpa_private_la.lo
cpp: error: argument unused during compilation: '-P' [-Werror,-Wunused-command-line-argument]
cpp: error: argument unused during compilation: '-traditional' [-Werror,-Wunused-command-line-argument]
cpp: error: argument unused during compilation: '-Wall' [-Werror,-Wunused-command-line-argument]
cpp: error: argument unused during compilation: '-Werror' [-Werror,-Wunused-command-line-argument]
cpp: error: argument unused during compilation: '-D HAVE_CONFIG_H' [-Werror,-Wunused-command-line-argument]
cpp: error: argument unused during compilation: '-I .' [-Werror,-Wunused-command-line-argument]
cpp: error: argument unused during compilation: '-isystem /usr/local/include' [-Werror,-Wunused-command-line-argument]
cpp: error: argument unused during compilation: '-P' [-Werror,-Wunused-command-line-argument]
cpp: error: argument unused during compilation: '-traditional' [-Werror,-Wunused-command-line-argument]
cpp: error: argument unused during compilation: '-Wall' [-Werror,-Wunused-command-line-argument]
cpp: error: argument unused during compilation: '-Werror' [-Werror,-Wunused-command-line-argument]
cpp: error: argument unused during compilation: '-D HAVE_CONFIG_H' [-Werror,-Wunused-command-line-argument]
cpp: error: argument unused during compilation: '-I .' [-Werror,-Wunused-command-line-argument]
cpp: error: argument unused during compilation: '-isystem /usr/local/include' [-Werror,-Wunused-command-line-argument]
cpp -P -traditional -Wall -Werror -DHAVE_CONFIG_H -I.   -isystem /usr/local/include -o /dev/stdout test/shared/test_util.F90 | grep -i -o '^ *use [^ ,!:]*' | sed 's/^[[:space:]]*//;' | tr '[:upper:]' '[:lower:]' | sort -u > test/shared/libelpatest_la-test_util.use_mods_libelpatest_la.lo
cpp -P -traditional -Wall -Werror -DHAVE_CONFIG_H -I.   -isystem /usr/local/include -o /dev/stdout test/shared/test_read_input_parameters.F90 | grep -i -o '^ *use [^ ,!:]*' | sed 's/^[[:space:]]*//;' | tr '[:upper:]' '[:lower:]' | sort -u > test/shared/libelpatest_la-test_read_input_parameters.use_mods_libelpatest_la.lo
cpp: error: argument unused during compilation: '-P' [-Werror,-Wunused-command-line-argument]
cpp: error: cpp: error: argument unused during compilation: '-traditional' [-Werror,-Wunused-command-line-argument]
argument unused during compilation: '-P' [-Werror,-Wunused-command-line-argument]
cpp: error: argument unused during compilation: '-Wall' [-Werror,-Wunused-command-line-argument]
cpp: error: argument unused during compilation: '-traditional' [-Werror,-Wunused-command-line-argument]
cpp: error: argument unused during compilation: '-Werror' [-Werror,-Wunused-command-line-argument]
cpp: error: argument unused during compilation: '-Wall' [-Werror,-Wunused-command-line-argument]
cpp: error: argument unused during compilation: '-D HAVE_CONFIG_H' [-Werror,-Wunused-command-line-argument]
cpp: error: argument unused during compilation: '-Werror' [-Werror,-Wunused-command-line-argument]
cpp: error: argument unused during compilation: '-I .' [-Werror,-Wunused-command-line-argument]
cpp: error: argument unused during compilation: '-D HAVE_CONFIG_H' [-Werror,-Wunused-command-line-argument]
cpp: error: argument unused during compilation: '-isystem /usr/local/include' [-Werror,-Wunused-command-line-argument]
cpp: error: argument unused during compilation: '-I .' [-Werror,-Wunused-command-line-argument]
cpp: error: argument unused during compilation: '-isystem /usr/local/include' [-Werror,-Wunused-command-line-argument]
cpp -P -traditional -Wall -Werror -DHAVE_CONFIG_H -I.   -isystem /usr/local/include -o /dev/stdout test/shared/test_check_correctness.F90 | grep -i -o '^ *use [^ ,!:]*' | sed 's/^[[:space:]]*//;' | tr '[:upper:]' '[:lower:]' | sort -u > test/shared/libelpatest_la-test_check_correctness.use_mods_libelpatest_la.lo
cpp -P -traditional -Wall -Werror -DHAVE_CONFIG_H -I.   -isystem /usr/local/include -o /dev/stdout test/shared/test_setup_mpi.F90 | grep -i -o '^ *use [^ ,!:]*' | sed 's/^[[:space:]]*//;' | tr '[:upper:]' '[:lower:]' | sort -u > test/shared/libelpatest_la-test_setup_mpi.use_mods_libelpatest_la.lo
cpp: error: argument unused during compilation: '-P' [-Werror,-Wunused-command-line-argument]
cpp: error: cpp: error: argument unused during compilation: '-traditional' [-Werror,-Wunused-command-line-argument]
argument unused during compilation: '-P' [-Werror,-Wunused-command-line-argument]
cpp: error: argument unused during compilation: '-Wall' [-Werror,-Wunused-command-line-argument]
cpp: error: argument unused during compilation: '-traditional' [-Werror,-Wunused-command-line-argument]
cpp: error: argument unused during compilation: '-Werror' [-Werror,-Wunused-command-line-argument]
cppcpp: error: argument unused during compilation: '-D HAVE_CONFIG_H' [-Werror,-Wunused-command-line-argument]
: error: argument unused during compilation: '-Wall' [-Werror,-Wunused-command-line-argument]
cpp: error: argument unused during compilation: '-I .' [-Werror,-Wunused-command-line-argument]
cpp: error: argument unused during compilation: '-Werror' [-Werror,-Wunused-command-line-argument]
cpp: error: argument unused during compilation: '-isystem /usr/local/include' [-Werror,-Wunused-command-line-argument]
cpp: error: argument unused during compilation: '-D HAVE_CONFIG_H' [-Werror,-Wunused-command-line-argument]
cpp: error: argument unused during compilation: '-I .' [-Werror,-Wunused-command-line-argument]
cpp: error: argument unused during compilation: '-isystem /usr/local/include' [-Werror,-Wunused-command-line-argument]
cpp -P -traditional -Wall -Werror -DHAVE_CONFIG_H -I.   -isystem /usr/local/include -o /dev/stdout test/shared/test_blacs_infrastructure.F90 | grep -i -o '^ *use [^ ,!:]*' | sed 's/^[[:space:]]*//;' | tr '[:upper:]' '[:lower:]' | sort -u > test/shared/libelpatest_la-test_blacs_infrastructure.use_mods_libelpatest_la.lo
cpp -P -traditional -Wall -Werror -DHAVE_CONFIG_H -I.   -isystem /usr/local/include -o /dev/stdout test/shared/test_prepare_matrix.F90 | grep -i -o '^ *use [^ ,!:]*' | sed 's/^[[:space:]]*//;' | tr '[:upper:]' '[:lower:]' | sort -u > test/shared/libelpatest_la-test_prepare_matrix.use_mods_libelpatest_la.lo
cpp: error: argument unused during compilation: '-P' [-Werror,-Wunused-command-line-argument]
cpp: error: argument unused during compilation: '-traditional' [-Werror,-Wunused-command-line-argument]
cpp: error: argument unused during compilation: '-Wall' [-Werror,-Wunused-command-line-argument]
cpp: cpp: error: argument unused during compilation: '-P' [-Werror,-Wunused-command-line-argument]
error: argument unused during compilation: '-Werror' [-Werror,-Wunused-command-line-argument]
cpp: error: argument unused during compilation: '-traditional' [-Werror,-Wunused-command-line-argument]
cpp: error: argument unused during compilation: '-D HAVE_CONFIG_H' [-Werror,-Wunused-command-line-argument]
cpp: error: argument unused during compilation: '-Wall' [-Werror,-Wunused-command-line-argument]
cpp: error: argument unused during compilation: '-I .' [-Werror,-Wunused-command-line-argument]
cpp: error: argument unused during compilation: '-Werror' [-Werror,-Wunused-command-line-argument]
cpp: error: argument unused during compilation: '-isystem /usr/local/include' [-Werror,-Wunused-command-line-argument]
cpp: error: argument unused during compilation: '-D HAVE_CONFIG_H' [-Werror,-Wunused-command-line-argument]
cpp: error: argument unused during compilation: '-I .' [-Werror,-Wunused-command-line-argument]
cpp: error: argument unused during compilation: '-isystem /usr/local/include' [-Werror,-Wunused-command-line-argument]
cpp -P -traditional -Wall -Werror -DHAVE_CONFIG_H -I.   -isystem /usr/local/include -o /dev/stdout test/shared/test_analytic.F90 | grep -i -o '^ *use [^ ,!:]*' | sed 's/^[[:space:]]*//;' | tr '[:upper:]' '[:lower:]' | sort -u > test/shared/libelpatest_la-test_analytic.use_mods_libelpatest_la.lo
cpp -P -traditional -Wall -Werror -DHAVE_CONFIG_H -I.   -isystem /usr/local/include -o /dev/stdout test/shared/test_output_type.F90 | grep -i -o '^ *use [^ ,!:]*' | sed 's/^[[:space:]]*//;' | tr '[:upper:]' '[:lower:]' | sort -u > test/shared/libelpatest_la-test_output_type.use_mods_libelpatest_la.lo
cpp: error: argument unused during compilation: '-P' [-Werror,-Wunused-command-line-argument]
cpp: error: argument unused during compilation: '-traditional' [-Werror,-Wunused-command-line-argument]
cpp: error: argument unused during compilation: '-Wall' [-Werror,-Wunused-command-line-argument]
cpp: error: argument unused during compilation: '-Werror' [-Werror,-Wunused-command-line-argument]
cpp: error: argument unused during compilation: '-D HAVE_CONFIG_H' [-Werror,-Wunused-command-line-argument]
cpp: error: argument unused during compilation: '-I .' [-Werror,-Wunused-command-line-argument]
cpp: error: argument unused during compilation: '-isystem /usr/local/include' [-Werror,-Wunused-command-line-argument]
cpp: error: argument unused during compilation: '-P' [-Werror,-Wunused-command-line-argument]
cpp: error: argument unused during compilation: '-traditional' [-Werror,-Wunused-command-line-argument]
cpp: error: argument unused during compilation: '-Wall' [-Werror,-Wunused-command-line-argument]
cpp: error: argument unused during compilation: '-Werror' [-Werror,-Wunused-command-line-argument]
cpp: error: argument unused during compilation: '-D HAVE_CONFIG_H' [-Werror,-Wunused-command-line-argument]
cpp: error: argument unused during compilation: '-I .' [-Werror,-Wunused-command-line-argument]
cpp: error: argument unused during compilation: '-isystem /usr/local/include' [-Werror,-Wunused-command-line-argument]
cpp -P -traditional -Wall -Werror -DHAVE_CONFIG_H -I.   -isystem /usr/local/include -o /dev/stdout test/shared/test_util.F90 | grep -i -o '^ *module [^!]*' | sed 's/^[[:space:]]*//;' | tr '[:upper:]' '[:lower:]' | grep -v "\<procedure\>\|\<intrinsic\>" > test/shared/libelpatest_la-test_util.def_mods_libelpatest_la.lo || true
cpp -P -traditional -Wall -Werror -DHAVE_CONFIG_H -I.   -isystem /usr/local/include -o /dev/stdout test/shared/test_read_input_parameters.F90 | grep -i -o '^ *module [^!]*' | sed 's/^[[:space:]]*//;' | tr '[:upper:]' '[:lower:]' | grep -v "\<procedure\>\|\<intrinsic\>" > test/shared/libelpatest_la-test_read_input_parameters.def_mods_libelpatest_la.lo || true
cpp: error: argument unused during compilation: '-P' [-Werror,-Wunused-command-line-argument]
cpp: error: argument unused during compilation: '-traditional' [-Werror,-Wunused-command-line-argument]
cpp: error: argument unused during compilation: '-Wall' [-Werror,-Wunused-command-line-argument]
cpp: error: argument unused during compilation: '-Werror' [-Werror,-Wunused-command-line-argument]
cpp: error: argument unused during compilation: '-D HAVE_CONFIG_H' [-Werror,-Wunused-command-line-argument]
cpp: error: argument unused during compilation: '-I .' [-Werror,-Wunused-command-line-argument]
cpp: error: argument unused during compilation: '-isystem /usr/local/include' [-Werror,-Wunused-command-line-argument]
cpp: error: argument unused during compilation: '-P' [-Werror,-Wunused-command-line-argument]
cpp: error: argument unused during compilation: '-traditional' [-Werror,-Wunused-command-line-argument]
cpp: error: argument unused during compilation: '-Wall' [-Werror,-Wunused-command-line-argument]
cpp: error: argument unused during compilation: '-Werror' [-Werror,-Wunused-command-line-argument]
cpp: error: argument unused during compilation: '-D HAVE_CONFIG_H' [-Werror,-Wunused-command-line-argument]
cpp: error: argument unused during compilation: '-I .' [-Werror,-Wunused-command-line-argument]
cpp: error: argument unused during compilation: '-isystem /usr/local/include' [-Werror,-Wunused-command-line-argument]
cpp -P -traditional -Wall -Werror -DHAVE_CONFIG_H -I.   -isystem /usr/local/include -o /dev/stdout test/shared/test_check_correctness.F90 | grep -i -o '^ *module [^!]*' | sed 's/^[[:space:]]*//;' | tr '[:upper:]' '[:lower:]' | grep -v "\<procedure\>\|\<intrinsic\>" > test/shared/libelpatest_la-test_check_correctness.def_mods_libelpatest_la.lo || true
cpp -P -traditional -Wall -Werror -DHAVE_CONFIG_H -I.   -isystem /usr/local/include -o /dev/stdout test/shared/test_setup_mpi.F90 | grep -i -o '^ *module [^!]*' | sed 's/^[[:space:]]*//;' | tr '[:upper:]' '[:lower:]' | grep -v "\<procedure\>\|\<intrinsic\>" > test/shared/libelpatest_la-test_setup_mpi.def_mods_libelpatest_la.lo || true
cpp: error: argument unused during compilation: '-P' [-Werror,-Wunused-command-line-argument]
cpp: error: argument unused during compilation: '-traditional' [-Werror,-Wunused-command-line-argument]
cpp: error: argument unused during compilation: '-Wall' [-Werror,-Wunused-command-line-argument]
cpp: error: argument unused during compilation: '-Werror' [-Werror,-Wunused-command-line-argument]
cpp: error: argument unused during compilation: '-D HAVE_CONFIG_H' [-Werror,-Wunused-command-line-argument]
cpp: error: argument unused during compilation: '-I .' [-Werror,-Wunused-command-line-argument]
cpp: error: argument unused during compilation: '-isystem /usr/local/include' [-Werror,-Wunused-command-line-argument]
cpp: error: argument unused during compilation: '-P' [-Werror,-Wunused-command-line-argument]
cpp: error: argument unused during compilation: '-traditional' [-Werror,-Wunused-command-line-argument]
cpp: error: argument unused during compilation: '-Wall' [-Werror,-Wunused-command-line-argument]
cpp: error: argument unused during compilation: '-Werror' [-Werror,-Wunused-command-line-argument]
cpp: error: argument unused during compilation: '-D HAVE_CONFIG_H' [-Werror,-Wunused-command-line-argument]
cpp: error: argument unused during compilation: '-I .' [-Werror,-Wunused-command-line-argument]
cpp: error: argument unused during compilation: '-isystem /usr/local/include' [-Werror,-Wunused-command-line-argument]
cpp -P -traditional -Wall -Werror -DHAVE_CONFIG_H -I.   -isystem /usr/local/include -o /dev/stdout test/shared/test_blacs_infrastructure.F90 | grep -i -o '^ *module [^!]*' | sed 's/^[[:space:]]*//;' | tr '[:upper:]' '[:lower:]' | grep -v "\<procedure\>\|\<intrinsic\>" > test/shared/libelpatest_la-test_blacs_infrastructure.def_mods_libelpatest_la.lo || true
cpp -P -traditional -Wall -Werror -DHAVE_CONFIG_H -I.   -isystem /usr/local/include -o /dev/stdout test/shared/test_prepare_matrix.F90 | grep -i -o '^ *module [^!]*' | sed 's/^[[:space:]]*//;' | tr '[:upper:]' '[:lower:]' | grep -v "\<procedure\>\|\<intrinsic\>" > test/shared/libelpatest_la-test_prepare_matrix.def_mods_libelpatest_la.lo || true
cpp: error: argument unused during compilation: '-P' [-Werror,-Wunused-command-line-argument]
cpp: error: argument unused during compilation: '-P' [-Werror,-Wunused-command-line-argument]
cpp: error: argument unused during compilation: '-traditional' [-Werror,-Wunused-command-line-argument]
cpp: error: argument unused during compilation: '-traditional' [-Werror,-Wunused-command-line-argument]
cpp: error: argument unused during compilation: '-Wall' [-Werror,-Wunused-command-line-argument]
cpp: error: argument unused during compilation: '-Wall' [-Werror,-Wunused-command-line-argument]
cpp: error: argument unused during compilation: '-Werror' [-Werror,-Wunused-command-line-argument]
cpp: error: argument unused during compilation: '-Werror' [-Werror,-Wunused-command-line-argument]
cpp: error: argument unused during compilation: '-D HAVE_CONFIG_H' [-Werror,-Wunused-command-line-argument]
cpp: error: argument unused during compilation: '-D HAVE_CONFIG_H' [-Werror,-Wunused-command-line-argument]
cpp: error: argument unused during compilation: '-I .' [-Werror,-Wunused-command-line-argument]
cpp: error: argument unused during compilation: '-I .' [-Werror,-Wunused-command-line-argument]
cpp: error: argument unused during compilation: '-isystem /usr/local/include' [-Werror,-Wunused-command-line-argument]
cpp: error: argument unused during compilation: '-isystem /usr/local/include' [-Werror,-Wunused-command-line-argument]
cpp -P -traditional -Wall -Werror -DHAVE_CONFIG_H -I.   -isystem /usr/local/include -o /dev/stdout test/shared/test_analytic.F90 | grep -i -o '^ *module [^!]*' | sed 's/^[[:space:]]*//;' | tr '[:upper:]' '[:lower:]' | grep -v "\<procedure\>\|\<intrinsic\>" > test/shared/libelpatest_la-test_analytic.def_mods_libelpatest_la.lo || true
cpp -P -traditional -Wall -Werror -DHAVE_CONFIG_H -I.   -isystem /usr/local/include -o /dev/stdout test/shared/test_output_type.F90 | grep -i -o '^ *module [^!]*' | sed 's/^[[:space:]]*//;' | tr '[:upper:]' '[:lower:]' | grep -v "\<procedure\>\|\<intrinsic\>" > test/shared/libelpatest_la-test_output_type.def_mods_libelpatest_la.lo || true
cpp: error: argument unused during compilation: '-P' [-Werror,-Wunused-command-line-argument]
cpp: error: argument unused during compilation: '-traditional' [-Werror,-Wunused-command-line-argument]
cpp: error: argument unused during compilation: '-P' [-Werror,-Wunused-command-line-argument]
cpp: error: argument unused during compilation: '-Wall' [-Werror,-Wunused-command-line-argument]
cpp: error: argument unused during compilation: '-traditional' [-Werror,-Wunused-command-line-argument]
cpp: error: argument unused during compilation: '-Werror' [-Werror,-Wunused-command-line-argument]
cpp: error: argument unused during compilation: '-Wall' [-Werror,-Wunused-command-line-argument]
cpp: error: argument unused during compilation: '-D HAVE_CONFIG_H' [-Werror,-Wunused-command-line-argument]
cpp: error: argument unused during compilation: '-Werror' [-Werror,-Wunused-command-line-argument]
cpp: error: argument unused during compilation: '-I .' [-Werror,-Wunused-command-line-argument]
cpp: error: argument unused during compilation: '-D HAVE_CONFIG_H' [-Werror,-Wunused-command-line-argument]
cpp: error: argument unused during compilation: '-isystem /usr/local/include' [-Werror,-Wunused-command-line-argument]
cpp: error: argument unused during compilation: '-I .' [-Werror,-Wunused-command-line-argument]
cpp: error: argument unused during compilation: '-isystem /usr/local/include' [-Werror,-Wunused-command-line-argument]
echo > /wrkdirs/usr/ports/math/elpa/work/elpa-2019.05.002/.fortran_dependencies/dependencies.mk;
gmake  all-am
gmake[2]: Entering directory '/wrkdirs/usr/ports/math/elpa/work/elpa-2019.05.002'
/bin/sh ./libtool  --tag=FC   --mode=compile gfortran10 -DHAVE_CONFIG_H -I.   -isystem /usr/local/include  -Imodules -Jprivate_modules -Iprivate_modules -std=legacy -I/usr/local/include -Wl,-rpath=/usr/local/lib/gcc10 -c -o src/elpa2/libelpa_private_la-mod_redist_band.lo `test -f 'src/elpa2/mod_redist_band.F90' || echo './'`src/elpa2/mod_redist_band.F90
/bin/sh ./libtool  --tag=FC   --mode=compile gfortran10 -DHAVE_CONFIG_H -I.   -isystem /usr/local/include  -Imodules -Jprivate_modules -Iprivate_modules -std=legacy -I/usr/local/include -Wl,-rpath=/usr/local/lib/gcc10 -c -o src/elpa2/libelpa_private_la-mod_pack_unpack_cpu.lo `test -f 'src/elpa2/mod_pack_unpack_cpu.F90' || echo './'`src/elpa2/mod_pack_unpack_cpu.F90
libtool: compile:  gfortran10 -DHAVE_CONFIG_H -I. -isystem /usr/local/include -Imodules -Jprivate_modules -Iprivate_modules -std=legacy -I/usr/local/include -Wl,-rpath=/usr/local/lib/gcc10 -c src/elpa2/mod_redist_band.F90  -fPIC -o src/elpa2/.libs/libelpa_private_la-mod_redist_band.o
libtool: compile:  gfortran10 -DHAVE_CONFIG_H -I. -isystem /usr/local/include -Imodules -Jprivate_modules -Iprivate_modules -std=legacy -I/usr/local/include -Wl,-rpath=/usr/local/lib/gcc10 -c src/elpa2/mod_pack_unpack_cpu.F90  -fPIC -o src/elpa2/.libs/libelpa_private_la-mod_pack_unpack_cpu.o
src/elpa2/pack_unpack_cpu.F90:60:15:

   60 |           use elpa_abstract_impl
      |               1
Fatal Error: Cannot open module file 'elpa_abstract_impl.mod' for reading at (1): No such file or directory
compilation terminated.
src/elpa2/redist_band.F90:56:8:

   56 |    use elpa_abstract_impl
      |        1
Fatal Error: Cannot open module file 'elpa_abstract_impl.mod' for reading at (1): No such file or directory
compilation terminated.
gmake[2]: *** [Makefile:16499: src/elpa2/libelpa_private_la-mod_pack_unpack_cpu.lo] Error 1
gmake[2]: *** Waiting for unfinished jobs....
gmake[2]: *** [Makefile:16496: src/elpa2/libelpa_private_la-mod_redist_band.lo] Error 1
gmake[2]: Leaving directory '/wrkdirs/usr/ports/math/elpa/work/elpa-2019.05.002'
gmake[1]: *** [Makefile:12928: all] Error 2
gmake[1]: Leaving directory '/wrkdirs/usr/ports/math/elpa/work/elpa-2019.05.002'
===> Compilation failed unexpectedly.
Try to set MAKE_JOBS_UNSAFE=yes and rebuild before reporting the failure to
the maintainer.
*** Error code 1

Stop.
make: stopped in /usr/ports/math/elpa
Received on Thu Jul 29 2021 - 19:36:48 UTC

Original text of this message