[package - main-riscv64-default][databases/libpg_query] Failed for libpg_query-10.1.0.4 in build

From: <pkg-fallout_at_FreeBSD.org>
Date: Thu, 29 Jul 2021 17:39:44 GMT
You are receiving this mail as a port that you maintain
is failing to build on the FreeBSD package build server.
Please investigate the failure and submit a PR to fix
build.

Maintainer:     mfechner_at_FreeBSD.org
Log URL:        http://beefy7.nyi.freebsd.org/data/main-riscv64-default/pd69639d824b8_s7685f8344d/logs/libpg_query-10.1.0.4.log
Build URL:      http://beefy7.nyi.freebsd.org/build.html?mastername=main-riscv64-default&build=pd69639d824b8_s7685f8344d
Log:

=>> Building databases/libpg_query
build started at Thu Jul 29 17:39:19 UTC 2021
port directory: /usr/ports/databases/libpg_query
package name: libpg_query-10.1.0.4
building for: FreeBSD main-riscv64-default-job-16 14.0-CURRENT FreeBSD 14.0-CURRENT 1400026 riscv
maintained by: mfechner_at_FreeBSD.org
Makefile ident: 
Poudriere version: 3.2.8-20-g137a4a48
Host OSVERSION: 1400008
Jail OSVERSION: 1400026
Job Id: 16




!!! Jail is newer than host. (Jail: 1400026, Host: 1400008) !!!
!!! This is not supported. !!!
!!! Host kernel must be same or newer than jail. !!!
!!! Expect build failures. !!!



---Begin Environment---
SHELL=/bin/csh
UNAME_p=riscv64
UNAME_m=riscv
ABI_FILE=/usr/lib/crt1.o
OSVERSION=1400026
UNAME_v=FreeBSD 14.0-CURRENT 1400026
UNAME_r=14.0-CURRENT
BLOCKSIZE=K
MAIL=/var/mail/root
MM_CHARSET=UTF-8
LANG=C.UTF-8
STATUS=1
HOME=/root
PATH=/sbin:/bin:/usr/sbin:/usr/bin:/usr/local/sbin:/usr/local/bin:/root/bin
LOCALBASE=/usr/local
QEMU_EMULATING=1
USER=root
LIBEXECPREFIX=/usr/local/libexec/poudriere
POUDRIERE_VERSION=3.2.8-20-g137a4a48
MASTERMNT=/usr/local/poudriere/data/.m/main-riscv64-default/ref
POUDRIERE_BUILD_TYPE=bulk
PACKAGE_BUILDING=yes
SAVED_TERM=
PWD=/usr/local/poudriere/data/.m/main-riscv64-default/ref/.p/pool
P_PORTS_FEATURES=FLAVORS SELECTED_OPTIONS
MASTERNAME=main-riscv64-default
SCRIPTPREFIX=/usr/local/share/poudriere
OLDPWD=/usr/local/poudriere/data/.m/main-riscv64-default/ref/.p
SCRIPTPATH=/usr/local/share/poudriere/bulk.sh
POUDRIEREPATH=/usr/local/bin/poudriere
---End Environment---

---Begin Poudriere Port Flags/Env---
PORT_FLAGS=
PKGENV=
FLAVOR=
DEPENDS_ARGS=
MAKE_ARGS=
---End Poudriere Port Flags/Env---

---Begin OPTIONS List---
---End OPTIONS List---

--MAINTAINER--
mfechner_at_FreeBSD.org
--End MAINTAINER--

--CONFIGURE_ARGS--

--End CONFIGURE_ARGS--

--CONFIGURE_ENV--
MAKE=gmake XDG_DATA_HOME=/wrkdirs/usr/ports/databases/libpg_query/work  XDG_CONFIG_HOME=/wrkdirs/usr/ports/databases/libpg_query/work  HOME=/wrkdirs/usr/ports/databases/libpg_query/work TMPDIR="/tmp" PATH=/wrkdirs/usr/ports/databases/libpg_query/work/.bin:/sbin:/bin:/usr/sbin:/usr/bin:/usr/local/sbin:/usr/local/bin:/root/bin SHELL=/bin/sh CONFIG_SHELL=/bin/sh
--End CONFIGURE_ENV--

--MAKE_ENV--
XDG_DATA_HOME=/wrkdirs/usr/ports/databases/libpg_query/work  XDG_CONFIG_HOME=/wrkdirs/usr/ports/databases/libpg_query/work  HOME=/wrkdirs/usr/ports/databases/libpg_query/work TMPDIR="/tmp" PATH=/wrkdirs/usr/ports/databases/libpg_query/work/.bin:/sbin:/bin:/usr/sbin:/usr/bin:/usr/local/sbin:/usr/local/bin:/root/bin NO_PIE=yes MK_DEBUG_FILES=no MK_KERNEL_SYMBOLS=no SHELL=/bin/sh NO_LINT=YES PREFIX=/usr/local  LOCALBASE=/usr/local  CC="/nxb-bin/usr/bin/cc" CFLAGS="-O2 -pipe -march=rv64imafdc -mabi=lp64d  -fstack-protector-strong -fno-strict-aliasing "  CPP="/nxb-bin/usr/bin/cpp" CPPFLAGS="-I/usr/local/include"  LDFLAGS=" -L/usr/local/lib -fstack-protector-strong " LIBS=""  CXX="/nxb-bin/usr/bin/c++" CXXFLAGS="-O2 -pipe -march=rv64imafdc -mabi=lp64d -fstack-protector-strong -fno-strict-aliasing  "  MANPREFIX="/usr/local" BSD_INSTALL_PROGRAM="install  -s -m 555"  BSD_INSTALL_LIB="install  -s -m 0644"  BSD_INSTALL_SCRIPT="install  -m 555"  BSD_INSTALL_DATA="install  -m 0644"  BSD_INSTALL_M
 AN="install  -m 444"
--End MAKE_ENV--

--PLIST_SUB--
OSREL=14.0 PREFIX=%D LOCALBASE=/usr/local  RESETPREFIX=/usr/local LIB32DIR=lib DOCSDIR="share/doc/libpg_query"  EXAMPLESDIR="share/examples/libpg_query"  DATADIR="share/libpg_query"  WWWDIR="www/libpg_query"  ETCDIR="etc/libpg_query"
--End PLIST_SUB--

--SUB_LIST--
PREFIX=/usr/local LOCALBASE=/usr/local  DATADIR=/usr/local/share/libpg_query DOCSDIR=/usr/local/share/doc/libpg_query EXAMPLESDIR=/usr/local/share/examples/libpg_query  WWWDIR=/usr/local/www/libpg_query ETCDIR=/usr/local/etc/libpg_query
--End SUB_LIST--

---Begin make.conf---
.sinclude "/etc/make.nxb.conf"
USE_PACKAGE_DEPENDS=yes
BATCH=yes
WRKDIRPREFIX=/wrkdirs
PORTSDIR=/usr/ports
PACKAGES=/packages
DISTDIR=/distfiles
PACKAGE_BUILDING=yes
PACKAGE_BUILDING_FLAVORS=yes
MACHINE=riscv
MACHINE_ARCH=riscv64
ARCH=${MACHINE_ARCH}
#### /usr/local/etc/poudriere.d/make.conf ####
# XXX: We really need this but cannot use it while 'make checksum' does not
# try the next mirror on checksum failure.  It currently retries the same
# failed mirror and then fails rather then trying another.  It *does*
# try the next if the size is mismatched though.
#MASTER_SITE_FREEBSD=yes
# Build ALLOW_MAKE_JOBS_PACKAGES with 2 jobs
MAKE_JOBS_NUMBER=2
#### /usr/ports/Mk/Scripts/ports_env.sh ####
_CCVERSION_9d218390=FreeBSD clang version 12.0.1 (git_at_github.com:llvm/llvm-project.git llvmorg-12.0.1-0-gfed41342a82f) Target: riscv64-unknown-freebsd14.0 Thread model: posix InstalledDir: /nxb-bin/usr/bin
_ALTCCVERSION_9d218390=none
_CXXINTERNAL_9c45a5b1=FreeBSD clang version 12.0.1 (git_at_github.com:llvm/llvm-project.git llvmorg-12.0.1-0-gfed41342a82f) Target: riscv64-unknown-freebsd14.0 Thread model: posix InstalledDir: /nxb-bin/usr/bin "/nxb-bin/usr/bin/ld" "--eh-frame-hdr" "-dynamic-linker" "/libexec/ld-elf.so.1" "--enable-new-dtags" "-m" "elf64lriscv" "-o" "a.out" "/usr/lib/crt1.o" "/usr/lib/crti.o" "/usr/lib/crtbegin.o" "-L/usr/lib" "/dev/null" "-lc++" "-lm" "-lgcc" "--as-needed" "-lgcc_s" "--no-as-needed" "-lc" "-lgcc" "--as-needed" "-lgcc_s" "--no-as-needed" "/usr/lib/crtend.o" "/usr/lib/crtn.o"
CC_OUTPUT_9d218390_58173849=yes
CC_OUTPUT_9d218390_9bdba57c=yes
CC_OUTPUT_9d218390_6a4fe7f5=yes
CC_OUTPUT_9d218390_6bcac02b=yes
CC_OUTPUT_9d218390_67d20829=yes
CC_OUTPUT_9d218390_bfa62e83=yes
CC_OUTPUT_9d218390_f0b4d593=yes
CC_OUTPUT_9d218390_308abb44=yes
CC_OUTPUT_9d218390_f00456e5=yes
CC_OUTPUT_9d218390_65ad290d=yes
CC_OUTPUT_9d218390_f2776b26=yes
CC_OUTPUT_9d218390_b2657cc3=yes
CC_OUTPUT_9d218390_380987f7=yes
CC_OUTPUT_9d218390_160933ec=yes
CC_OUTPUT_9d218390_fb62803b=yes
_OBJC_CCVERSION_9d218390=FreeBSD clang version 12.0.1 (git_at_github.com:llvm/llvm-project.git llvmorg-12.0.1-0-gfed41342a82f) Target: riscv64-unknown-freebsd14.0 Thread model: posix InstalledDir: /nxb-bin/usr/bin
_OBJC_ALTCCVERSION_9d218390=none
ARCH=riscv64
OPSYS=FreeBSD
_OSRELEASE=14.0-CURRENT
OSREL=14.0
OSVERSION=1400026
PYTHONBASE=/usr/local
CONFIGURE_MAX_CMD_LEN=524288
HAVE_PORTS_ENV=1
#### Misc Poudriere ####
GID=0
UID=0
DISABLE_MAKE_JOBS=poudriere
---End make.conf---
---Begin make.nxb.conf---
CC=/nxb-bin/usr/bin/cc
CPP=/nxb-bin/usr/bin/cpp
CXX=/nxb-bin/usr/bin/c++
NM=/nxb-bin/usr/bin/nm
LD=/nxb-bin/usr/bin/ld
OBJCOPY=/nxb-bin/usr/bin/objcopy
SIZE=/nxb-bin/usr/bin/size
STRIPBIN=/nxb-bin/usr/bin/strip
SED=/nxb-bin/usr/bin/sed
RANLIB=/nxb-bin/usr/bin/ranlib
YACC=/nxb-bin/usr/bin/yacc
MAKE=/nxb-bin/usr/bin/make
STRINGS=/nxb-bin/usr/bin/strings
AWK=/nxb-bin/usr/bin/awk
FLEX=/nxb-bin/usr/bin/flex
---End make.nxb.conf---
--Resource limits--
cpu time               (seconds, -t)  unlimited
file size           (512-blocks, -f)  unlimited
data seg size           (kbytes, -d)  33554432
stack size              (kbytes, -s)  524288
core file size      (512-blocks, -c)  unlimited
max memory size         (kbytes, -m)  unlimited
locked memory           (kbytes, -l)  unlimited
max user processes              (-u)  89999
open files                      (-n)  1024
virtual mem size        (kbytes, -v)  unlimited
swap limit              (kbytes, -w)  unlimited
socket buffer size       (bytes, -b)  unlimited
pseudo-terminals                (-p)  unlimited
kqueues                         (-k)  unlimited
umtx shared locks               (-o)  unlimited
--End resource limits--
=======================<phase: check-sanity   >============================
===>  License BSD3CLAUSE accepted by the user
===========================================================================
=======================<phase: pkg-depends    >============================
===>   libpg_query-10.1.0.4 depends on file: /usr/local/sbin/pkg - not found
===>   Installing existing package /packages/All/pkg-1.17.1.pkg
[main-riscv64-default-job-16] Installing pkg-1.17.1...
[main-riscv64-default-job-16] Extracting pkg-1.17.1: .......... done
===>   libpg_query-10.1.0.4 depends on file: /usr/local/sbin/pkg - found
===>   Returning to build of libpg_query-10.1.0.4
===========================================================================
=======================<phase: fetch-depends  >============================
===========================================================================
=======================<phase: fetch          >============================
===>  License BSD3CLAUSE accepted by the user
===> Fetching all distfiles required by libpg_query-10.1.0.4 for building
===========================================================================
=======================<phase: checksum       >============================
===>  License BSD3CLAUSE accepted by the user
===> Fetching all distfiles required by libpg_query-10.1.0.4 for building
=> SHA256 Checksum OK for lfittl-libpg_query-10-1.0.4_GH0.tar.gz.
=> SHA256 Checksum OK for 820f5294f92927d6c4f61722bb28cf380942b83c.patch.
===========================================================================
=======================<phase: extract-depends>============================
===========================================================================
=======================<phase: extract        >============================
===>  License BSD3CLAUSE accepted by the user
===> Fetching all distfiles required by libpg_query-10.1.0.4 for building
===>  Extracting for libpg_query-10.1.0.4
=> SHA256 Checksum OK for lfittl-libpg_query-10-1.0.4_GH0.tar.gz.
=> SHA256 Checksum OK for 820f5294f92927d6c4f61722bb28cf380942b83c.patch.
===========================================================================
=======================<phase: patch-depends  >============================
===========================================================================
=======================<phase: patch          >============================
===>  Patching for libpg_query-10.1.0.4
===>  Applying distribution patches for libpg_query-10.1.0.4
===========================================================================
=======================<phase: build-depends  >============================
===>   libpg_query-10.1.0.4 depends on package: gmake>=4.3 - not found
===>   Installing existing package /packages/All/gmake-4.3_2.pkg
[main-riscv64-default-job-16] Installing gmake-4.3_2...
[main-riscv64-default-job-16] `-- Installing gettext-runtime-0.21...
[main-riscv64-default-job-16] |   `-- Installing indexinfo-0.3.1...
[main-riscv64-default-job-16] |   `-- Extracting indexinfo-0.3.1: .... done
[main-riscv64-default-job-16] `-- Extracting gettext-runtime-0.21: .......... done
[main-riscv64-default-job-16] Extracting gmake-4.3_2: .......... done
===>   libpg_query-10.1.0.4 depends on package: gmake>=4.3 - found
===>   Returning to build of libpg_query-10.1.0.4
===========================================================================
=======================<phase: lib-depends    >============================
===>   libpg_query-10.1.0.4 depends on shared library: libpq.so.5 - not found
===>   Installing existing package /packages/All/postgresql12-client-12.7.pkg
[main-riscv64-default-job-16] Installing postgresql12-client-12.7...
[main-riscv64-default-job-16] `-- Installing readline-8.1.1...
[main-riscv64-default-job-16] `-- Extracting readline-8.1.1: .......... done
[main-riscv64-default-job-16] Extracting postgresql12-client-12.7: .......... done
=====
Message from postgresql12-client-12.7:

--
The PostgreSQL port has a collection of "side orders":

postgresql-docs
  For all of the html documentation

p5-Pg
  A perl5 API for client access to PostgreSQL databases.

postgresql-tcltk 
  If you want tcl/tk client support.

postgresql-jdbc
  For Java JDBC support.

postgresql-odbc
  For client access from unix applications using ODBC as access
  method. Not needed to access unix PostgreSQL servers from Win32
  using ODBC. See below.

ruby-postgres, py-psycopg2
  For client access to PostgreSQL databases using the ruby & python
  languages.

postgresql-plperl, postgresql-pltcl & postgresql-plruby
  For using perl5, tcl & ruby as procedural languages.

postgresql-contrib
  Lots of contributed utilities, postgresql functions and
  datatypes. There you find pg_standby, pgcrypto and many other cool
  things.

etc...
===>   libpg_query-10.1.0.4 depends on shared library: libpq.so.5 - found (/usr/local/lib/libpq.so.5)
===>   Returning to build of libpg_query-10.1.0.4
===========================================================================
=======================<phase: configure      >============================
===>  Configuring for libpg_query-10.1.0.4
===========================================================================
=======================<phase: build          >============================
===>  Building for libpg_query-10.1.0.4
gmake[1]: Entering directory '/wrkdirs/usr/ports/databases/libpg_query/work/libpg_query-10-1.0.4'
compiling src/pg_query.c
compiling src/pg_query_fingerprint.c
compiling src/pg_query_json.c
compiling src/pg_query_json_plpgsql.c
In file included from src/pg_query_json_plpgsql.c:2:
In file included from src/pg_query_json_plpgsql.h:5:
In file included from ./src/postgres/include/plpgsql.h:21:
In file included from ./src/postgres/include/commands/trigger.h:17:
In file included from ./src/postgres/include/nodes/execnodes.h:31:
In file included from ./src/postgres/include/storage/condition_variable.h:25:
./src/postgres/include/storage/s_lock.h:922:2: error: PostgreSQL does not have native spinlock support on this platform.  To continue the compilation, rerun configure using --disable-spinlocks.  However, performance will be poor.  Please report this to pgsql-bugs_at_postgresql.org.
#error PostgreSQL does not have native spinlock support on this platform.  To continue the compilation, rerun configure using --disable-spinlocks.  However, performance will be poor.  Please report this to pgsql-bugs_at_postgresql.org.
 ^
./src/postgres/include/storage/s_lock.h:994:25: error: unknown type name 'slock_t'; did you mean 'clock_t'?
extern int      tas(volatile slock_t *lock);            /* in port/.../tas.s, or
                             ^~~~~~~
                             clock_t
/usr/include/sys/types.h:94:19: note: 'clock_t' declared here
typedef __clock_t       clock_t;
                        ^
In file included from src/pg_query_json_plpgsql.c:2:
In file included from src/pg_query_json_plpgsql.h:5:
In file included from ./src/postgres/include/plpgsql.h:21:
In file included from ./src/postgres/include/commands/trigger.h:17:
In file included from ./src/postgres/include/nodes/execnodes.h:31:
In file included from ./src/postgres/include/storage/condition_variable.h:25:
./src/postgres/include/storage/s_lock.h:1004:8: error: unknown type name 'slock_t'; did you mean 'clock_t'?
extern slock_t dummy_spinlock;
       ^~~~~~~
       clock_t
/usr/include/sys/types.h:94:19: note: 'clock_t' declared here
typedef __clock_t       clock_t;
                        ^
In file included from src/pg_query_json_plpgsql.c:2:
In file included from src/pg_query_json_plpgsql.h:5:
In file included from ./src/postgres/include/plpgsql.h:21:
In file included from ./src/postgres/include/commands/trigger.h:17:
In file included from ./src/postgres/include/nodes/execnodes.h:31:
In file included from ./src/postgres/include/storage/condition_variable.h:25:
./src/postgres/include/storage/s_lock.h:1009:28: error: unknown type name 'slock_t'; did you mean 'clock_t'?
extern int s_lock(volatile slock_t *lock, const char *file, int line, const char *func);
                           ^~~~~~~
                           clock_t
/usr/include/sys/types.h:94:19: note: 'clock_t' declared here
typedef __clock_t       clock_t;
                        ^
In file included from src/pg_query_json_plpgsql.c:2:
In file included from src/pg_query_json_plpgsql.h:5:
In file included from ./src/postgres/include/plpgsql.h:21:
In file included from ./src/postgres/include/commands/trigger.h:17:
In file included from ./src/postgres/include/nodes/execnodes.h:31:
./src/postgres/include/storage/condition_variable.h:30:2: error: unknown type name 'slock_t'; did you mean 'clock_t'?
        slock_t         mutex;
        ^~~~~~~
        clock_t
/usr/include/sys/types.h:94:19: note: 'clock_t' declared here
typedef __clock_t       clock_t;
                        ^
In file included from src/pg_query_json_plpgsql.c:2:
In file included from src/pg_query_json_plpgsql.h:5:
In file included from ./src/postgres/include/plpgsql.h:21:
In file included from ./src/postgres/include/commands/trigger.h:17:
./src/postgres/include/nodes/execnodes.h:1329:2: error: unknown type name 'slock_t'; did you mean 'clock_t'?
        slock_t         mutex;
        ^~~~~~~
        clock_t
/usr/include/sys/types.h:94:19: note: 'clock_t' declared here
typedef __clock_t       clock_t;
                        ^
6 errors generated.
gmake[1]: *** [Makefile:83: src/pg_query_json_plpgsql.o] Error 1
gmake[1]: Leaving directory '/wrkdirs/usr/ports/databases/libpg_query/work/libpg_query-10-1.0.4'
*** Error code 1

Stop.
make: stopped in /usr/ports/databases/libpg_query
Received on Thu Jul 29 2021 - 17:39:44 UTC

Original text of this message