[package - 130powerpc64-quarterly][emulators/frodo] Failed for frodo-4.1b_11 in build

From: <pkg-fallout_at_FreeBSD.org>
Date: Thu, 29 Jul 2021 16:59:47 GMT
You are receiving this mail as a port that you maintain
is failing to build on the FreeBSD package build server.
Please investigate the failure and submit a PR to fix
build.

Maintainer:     dinoex_at_FreeBSD.org
Log URL:        http://foul1.nyi.freebsd.org/data/130powerpc64-quarterly/03c599c1eb7a/logs/frodo-4.1b_11.log
Build URL:      http://foul1.nyi.freebsd.org/build.html?mastername=130powerpc64-quarterly&build=03c599c1eb7a
Log:

=>> Building emulators/frodo
build started at Thu Jul 29 16:58:31 UTC 2021
port directory: /usr/ports/emulators/frodo
package name: frodo-4.1b_11
building for: FreeBSD 130powerpc64-quarterly-job-08 13.0-RELEASE FreeBSD 13.0-RELEASE powerpc
maintained by: dinoex_at_FreeBSD.org
Makefile ident: 
Poudriere version: 3.2.8-20-g137a4a48
Host OSVERSION: 1400008
Jail OSVERSION: 1300139
Job Id: 08

---Begin Environment---
SHELL=/bin/csh
OSVERSION=1300139
UNAME_v=FreeBSD 13.0-RELEASE
UNAME_r=13.0-RELEASE
BLOCKSIZE=K
MAIL=/var/mail/root
MM_CHARSET=UTF-8
LANG=C.UTF-8
STATUS=1
HOME=/root
PATH=/sbin:/bin:/usr/sbin:/usr/bin:/usr/local/sbin:/usr/local/bin:/root/bin
LOCALBASE=/usr/local
USER=root
LIBEXECPREFIX=/usr/local/libexec/poudriere
POUDRIERE_VERSION=3.2.8-20-g137a4a48
MASTERMNT=/usr/local/poudriere/data/.m/130powerpc64-quarterly/ref
POUDRIERE_BUILD_TYPE=bulk
PACKAGE_BUILDING=yes
SAVED_TERM=
PWD=/usr/local/poudriere/data/.m/130powerpc64-quarterly/ref/.p/pool
P_PORTS_FEATURES=FLAVORS SELECTED_OPTIONS
MASTERNAME=130powerpc64-quarterly
SCRIPTPREFIX=/usr/local/share/poudriere
OLDPWD=/usr/local/poudriere/data/.m/130powerpc64-quarterly/ref/.p
SCRIPTPATH=/usr/local/share/poudriere/bulk.sh
POUDRIEREPATH=/usr/local/bin/poudriere
---End Environment---

---Begin Poudriere Port Flags/Env---
PORT_FLAGS=
PKGENV=
FLAVOR=
DEPENDS_ARGS=
MAKE_ARGS=
---End Poudriere Port Flags/Env---

---Begin OPTIONS List---
===> The following configuration options are available for frodo-4.1b_11:
     DOCS=on: Build and/or install documentation
     SDL=on: Simple Direct Media Layer support
===> Use 'make config' to modify these settings
---End OPTIONS List---

--MAINTAINER--
dinoex_at_FreeBSD.org
--End MAINTAINER--

--CONFIGURE_ARGS--
--x-libraries=/usr/local/lib --x-includes=/usr/local/include --prefix=/usr/local ${_LATE_CONFIGURE_ARGS}
--End CONFIGURE_ARGS--

--CONFIGURE_ENV--
CXXFLAGS='-O2 -pipe  -fstack-protector-strong -fno-strict-aliasing   -std=gnu++98 ' SDL_CONFIG=/usr/local/bin/sdl-config XDG_DATA_HOME=/wrkdirs/usr/ports/emulators/frodo/work  XDG_CONFIG_HOME=/wrkdirs/usr/ports/emulators/frodo/work  HOME=/wrkdirs/usr/ports/emulators/frodo/work TMPDIR="/tmp" PATH=/wrkdirs/usr/ports/emulators/frodo/work/.bin:/sbin:/bin:/usr/sbin:/usr/bin:/usr/local/sbin:/usr/local/bin:/root/bin SHELL=/bin/sh CONFIG_SHELL=/bin/sh CONFIG_SITE=/usr/ports/Templates/config.site lt_cv_sys_max_cmd_len=524288
--End CONFIGURE_ENV--

--MAKE_ENV--
LDFLAGS=' -fstack-protector-strong ' SDL_CONFIG=/usr/local/bin/sdl-config XDG_DATA_HOME=/wrkdirs/usr/ports/emulators/frodo/work  XDG_CONFIG_HOME=/wrkdirs/usr/ports/emulators/frodo/work  HOME=/wrkdirs/usr/ports/emulators/frodo/work TMPDIR="/tmp" PATH=/wrkdirs/usr/ports/emulators/frodo/work/.bin:/sbin:/bin:/usr/sbin:/usr/bin:/usr/local/sbin:/usr/local/bin:/root/bin NO_PIE=yes MK_DEBUG_FILES=no MK_KERNEL_SYMBOLS=no SHELL=/bin/sh NO_LINT=YES PREFIX=/usr/local  LOCALBASE=/usr/local  CC="cc" CFLAGS="-O2 -pipe  -fstack-protector-strong -fno-strict-aliasing "  CPP="cpp" CPPFLAGS=""  LDFLAGS=" -fstack-protector-strong " LIBS=""  CXX="c++" CXXFLAGS="-O2 -pipe  -fstack-protector-strong -fno-strict-aliasing   -std=gnu++98 "  MANPREFIX="/usr/local" BSD_INSTALL_PROGRAM="install  -s -m 555"  BSD_INSTALL_LIB="install  -s -m 0644"  BSD_INSTALL_SCRIPT="install  -m 555"  BSD_INSTALL_DATA="install  -m 0644"  BSD_INSTALL_MAN="install  -m 444"
--End MAKE_ENV--

--PLIST_SUB--
PORTDOCS="" OSREL=13.0 PREFIX=%D LOCALBASE=/usr/local  RESETPREFIX=/usr/local LIB32DIR=lib DOCSDIR="share/doc/frodo"  EXAMPLESDIR="share/examples/frodo"  DATADIR="share/frodo"  WWWDIR="www/frodo"  ETCDIR="etc/frodo"
--End PLIST_SUB--

--SUB_LIST--
PREFIX=/usr/local LOCALBASE=/usr/local  DATADIR=/usr/local/share/frodo DOCSDIR=/usr/local/share/doc/frodo EXAMPLESDIR=/usr/local/share/examples/frodo  WWWDIR=/usr/local/www/frodo ETCDIR=/usr/local/etc/frodo
--End SUB_LIST--

---Begin make.conf---
USE_PACKAGE_DEPENDS=yes
BATCH=yes
WRKDIRPREFIX=/wrkdirs
PORTSDIR=/usr/ports
PACKAGES=/packages
DISTDIR=/distfiles
PACKAGE_BUILDING=yes
PACKAGE_BUILDING_FLAVORS=yes
#### /usr/local/etc/poudriere.d/make.conf ####
# XXX: We really need this but cannot use it while 'make checksum' does not
# try the next mirror on checksum failure.  It currently retries the same
# failed mirror and then fails rather then trying another.  It *does*
# try the next if the size is mismatched though.
#MASTER_SITE_FREEBSD=yes
# Build ALLOW_MAKE_JOBS_PACKAGES with 2 jobs
MAKE_JOBS_NUMBER=2
#### /usr/ports/Mk/Scripts/ports_env.sh ####
_CCVERSION_921dbbb2=FreeBSD clang version 11.0.1 (git_at_github.com:llvm/llvm-project.git llvmorg-11.0.1-0-g43ff75f2c3fe) Target: powerpc64-unknown-freebsd13.0 Thread model: posix InstalledDir: /usr/bin
_ALTCCVERSION_921dbbb2=none
_CXXINTERNAL_acaad9ca=FreeBSD clang version 11.0.1 (git_at_github.com:llvm/llvm-project.git llvmorg-11.0.1-0-g43ff75f2c3fe) Target: powerpc64-unknown-freebsd13.0 Thread model: posix InstalledDir: /usr/bin "/usr/bin/ld" "--eh-frame-hdr" "-dynamic-linker" "/libexec/ld-elf.so.1" "--enable-new-dtags" "-o" "a.out" "/usr/lib/crt1.o" "/usr/lib/crti.o" "/usr/lib/crtbegin.o" "-L/usr/lib" "/dev/null" "-lc++" "-lm" "-lgcc" "--as-needed" "-lgcc_s" "--no-as-needed" "-lc" "-lgcc" "--as-needed" "-lgcc_s" "--no-as-needed" "/usr/lib/crtend.o" "/usr/lib/crtn.o"
CC_OUTPUT_921dbbb2_58173849=yes
CC_OUTPUT_921dbbb2_9bdba57c=yes
CC_OUTPUT_921dbbb2_6a4fe7f5=yes
CC_OUTPUT_921dbbb2_6bcac02b=yes
CC_OUTPUT_921dbbb2_67d20829=yes
CC_OUTPUT_921dbbb2_bfa62e83=yes
CC_OUTPUT_921dbbb2_f0b4d593=yes
CC_OUTPUT_921dbbb2_308abb44=yes
CC_OUTPUT_921dbbb2_f00456e5=yes
CC_OUTPUT_921dbbb2_65ad290d=yes
CC_OUTPUT_921dbbb2_f2776b26=yes
CC_OUTPUT_921dbbb2_b2657cc3=yes
CC_OUTPUT_921dbbb2_380987f7=yes
CC_OUTPUT_921dbbb2_160933ec=yes
CC_OUTPUT_921dbbb2_fb62803b=yes
_OBJC_CCVERSION_921dbbb2=FreeBSD clang version 11.0.1 (git_at_github.com:llvm/llvm-project.git llvmorg-11.0.1-0-g43ff75f2c3fe) Target: powerpc64-unknown-freebsd13.0 Thread model: posix InstalledDir: /usr/bin
_OBJC_ALTCCVERSION_921dbbb2=none
ARCH=powerpc64
PPC_ABI=ELFv2
OPSYS=FreeBSD
_OSRELEASE=13.0-RELEASE
OSREL=13.0
OSVERSION=1300139
PYTHONBASE=/usr/local
CONFIGURE_MAX_CMD_LEN=524288
HAVE_PORTS_ENV=1
#### Misc Poudriere ####
GID=0
UID=0
---End make.conf---
--Resource limits--
cpu time               (seconds, -t)  unlimited
file size           (512-blocks, -f)  unlimited
data seg size           (kbytes, -d)  33554432
stack size              (kbytes, -s)  524288
core file size      (512-blocks, -c)  unlimited
max memory size         (kbytes, -m)  unlimited
locked memory           (kbytes, -l)  unlimited
max user processes              (-u)  89999
open files                      (-n)  1024
virtual mem size        (kbytes, -v)  unlimited
swap limit              (kbytes, -w)  unlimited
socket buffer size       (bytes, -b)  unlimited
pseudo-terminals                (-p)  unlimited
kqueues                         (-k)  unlimited
umtx shared locks               (-o)  unlimited
--End resource limits--
=======================<phase: check-sanity   >============================
===========================================================================
=======================<phase: pkg-depends    >============================
===>   frodo-4.1b_11 depends on file: /usr/local/sbin/pkg - not found
===>   Installing existing package /packages/All/pkg-1.16.3.txz
[130powerpc64-quarterly-job-08] Installing pkg-1.16.3...
[130powerpc64-quarterly-job-08] Extracting pkg-1.16.3: .......... done
===>   frodo-4.1b_11 depends on file: /usr/local/sbin/pkg - found
===>   Returning to build of frodo-4.1b_11
===========================================================================
=======================<phase: fetch-depends  >============================
===========================================================================
=======================<phase: fetch          >============================
===> Fetching all distfiles required by frodo-4.1b_11 for building
===========================================================================
=======================<phase: checksum       >============================
===> Fetching all distfiles required by frodo-4.1b_11 for building
=> SHA256 Checksum OK for FrodoV4_1b.Src.tar.gz.
===========================================================================
=======================<phase: extract-depends>============================
===========================================================================
=======================<phase: extract        >============================
===> Fetching all distfiles required by frodo-4.1b_11 for building
===>  Extracting for frodo-4.1b_11
=> SHA256 Checksum OK for FrodoV4_1b.Src.tar.gz.
===========================================================================
=======================<phase: patch-depends  >============================
===========================================================================
=======================<phase: patch          >============================
===>  Patching for frodo-4.1b_11
===>  Applying FreeBSD patches for frodo-4.1b_11 from /usr/ports/emulators/frodo/files
===========================================================================
=======================<phase: build-depends  >============================
===>   frodo-4.1b_11 depends on file: /usr/local/bin/sdl-config - not found
===>   Installing existing package /packages/All/sdl-1.2.15_15,2.txz
[130powerpc64-quarterly-job-08] Installing sdl-1.2.15_15,2...
[130powerpc64-quarterly-job-08] `-- Installing aalib-1.4.r5_13...
[130powerpc64-quarterly-job-08] |   `-- Installing indexinfo-0.3.1...
[130powerpc64-quarterly-job-08] |   `-- Extracting indexinfo-0.3.1: .... done
[130powerpc64-quarterly-job-08] `-- Extracting aalib-1.4.r5_13: .......... done
[130powerpc64-quarterly-job-08] `-- Installing libGLU-9.0.2_1...
[130powerpc64-quarterly-job-08] |   `-- Installing libglvnd-1.3.3...
[130powerpc64-quarterly-job-08] |   | `-- Installing gcc10-10.3.0...
[130powerpc64-quarterly-job-08] |   |   `-- Installing binutils-2.33.1_4,1...
[130powerpc64-quarterly-job-08] |   |   | `-- Installing gettext-runtime-0.21...
[130powerpc64-quarterly-job-08] |   |   | `-- Extracting gettext-runtime-0.21: .......... done
[130powerpc64-quarterly-job-08] |   |   `-- Extracting binutils-2.33.1_4,1: .......... done
[130powerpc64-quarterly-job-08] |   |   `-- Installing gmp-6.2.1...
[130powerpc64-quarterly-job-08] |   |   `-- Extracting gmp-6.2.1: .......... done
[130powerpc64-quarterly-job-08] |   |   `-- Installing mpc-1.2.0...
[130powerpc64-quarterly-job-08] |   |   | `-- Installing mpfr-4.1.0...
<snip>
                         ^~~~~
SAM.cpp:1498:14: warning: conversion from string literal to 'char *' is deprecated [-Wc++11-compat-deprecated-writable-strings]
                                                        error("Branch too long");
                                                              ^
SAM.cpp:1510:25: warning: array subscript is of type 'char' [-Wchar-subscripts]
                                                switch (adr_length[mode]) {
                                                                  ^~~~~
SAM.cpp:1527:15: warning: conversion from string literal to 'char *' is deprecated [-Wc++11-compat-deprecated-writable-strings]
                                                                error("Internal error");
                                                                      ^
SAM.cpp:1532:13: warning: conversion from string literal to 'char *' is deprecated [-Wc++11-compat-deprecated-writable-strings]
                                                error("Addressing mode not supported by instruction");
                                                      ^
SAM.cpp:1535:12: warning: conversion from string literal to 'char *' is deprecated [-Wc++11-compat-deprecated-writable-strings]
                                        error("Unrecognized addressing mode");
                                              ^
SAM.cpp:1538:11: warning: conversion from string literal to 'char *' is deprecated [-Wc++11-compat-deprecated-writable-strings]
                                error("Unknown instruction");
                                      ^
SAM.cpp:1756:10: warning: conversion from string literal to 'char *' is deprecated [-Wc++11-compat-deprecated-writable-strings]
                        error("Unable to open file");
                              ^
SAM.cpp:1758:9: warning: conversion from string literal to 'char *' is deprecated [-Wc++11-compat-deprecated-writable-strings]
                error("'\"' around file name expected");
                      ^
SAM.cpp:1807:10: warning: conversion from string literal to 'char *' is deprecated [-Wc++11-compat-deprecated-writable-strings]
                        error("Unknown command");
                              ^
SAM.cpp:1824:10: warning: conversion from string literal to 'char *' is deprecated [-Wc++11-compat-deprecated-writable-strings]
                        error("Unknown command");
                              ^
SAM.cpp:2123:9: warning: conversion from string literal to 'char *' is deprecated [-Wc++11-compat-deprecated-writable-strings]
                error("Missing file name");
                      ^
SAM.cpp:2127:9: warning: conversion from string literal to 'char *' is deprecated [-Wc++11-compat-deprecated-writable-strings]
                error("'\"' around file name expected");
                      ^
SAM.cpp:2132:9: warning: conversion from string literal to 'char *' is deprecated [-Wc++11-compat-deprecated-writable-strings]
                error("Unable to open file");
                      ^
SAM.cpp:2157:9: warning: conversion from string literal to 'char *' is deprecated [-Wc++11-compat-deprecated-writable-strings]
                error("Missing file name");
                      ^
SAM.cpp:2161:9: warning: conversion from string literal to 'char *' is deprecated [-Wc++11-compat-deprecated-writable-strings]
                error("'\"' around file name expected");
                      ^
SAM.cpp:2166:9: warning: conversion from string literal to 'char *' is deprecated [-Wc++11-compat-deprecated-writable-strings]
                error("Unable to create file");
                      ^
--- 1541job.o ---
2 warnings generated.
--- CmdPipe.o ---
cc  -O2 -pipe  -fstack-protector-strong -fno-strict-aliasing   -std=gnu++98  -O2 -pipe  -fstack-protector-strong -fno-strict-aliasing  -O2 -g -fomit-frame-pointer -Wall -Wno-unused -Wno-format -I/usr/local/include/SDL -I/usr/local/include -D_REENTRANT -D_THREAD_SAFE -DHAVE_SDL -DREGPARAM= -I./ -DFRODO_HPUX_REV=0 -DKBD_LANG=0 -o CmdPipe.o -c CmdPipe.cpp
--- C64.o ---
cc  -O2 -pipe  -fstack-protector-strong -fno-strict-aliasing   -std=gnu++98  -O2 -pipe  -fstack-protector-strong -fno-strict-aliasing  -O2 -g -fomit-frame-pointer -Wall -Wno-unused -Wno-format -I/usr/local/include/SDL -I/usr/local/include -D_REENTRANT -D_THREAD_SAFE -DHAVE_SDL -DREGPARAM= -I./ -DFRODO_HPUX_REV=0 -DKBD_LANG=0 -o C64.o -c C64.cpp
In file included from C64.cpp:11:
./CPU1541.h:254:62: warning: '&' within '|' [-Wbitwise-op-parentheses]
        IECLines = (byte << 6) & ((~byte ^ TheCIA2->IECLines) << 3) & 0x80      // DATA (incl. ATN acknowledge)
                   ~~~~~~~~~~~~~~~~~~~~~~~~~~~~~~~~~~~~~~~~~~~~~~~~~^~~~~~
./CPU1541.h:254:62: note: place parentheses around the '&' expression to silence this warning
        IECLines = (byte << 6) & ((~byte ^ TheCIA2->IECLines) << 3) & 0x80      // DATA (incl. ATN acknowledge)
                                                                    ^
                   (                                                      )
./CPU1541.h:255:17: warning: '&' within '|' [-Wbitwise-op-parentheses]
                | (byte << 3) & 0x40;                                                                                   // CLK
                ~ ~~~~~~~~~~~~^~~~~~
./CPU1541.h:255:17: note: place parentheses around the '&' expression to silence this warning
                | (byte << 3) & 0x40;                                                                                   // CLK
                              ^
                  (                 )
C64.cpp:114:2: warning: delete called on non-final 'MOS6526_2' that has virtual functions but non-virtual destructor [-Wdelete-non-abstract-non-virtual-dtor]
        delete TheCIA2;
        ^
C64.cpp:115:2: warning: delete called on non-final 'MOS6526_1' that has virtual functions but non-virtual destructor [-Wdelete-non-abstract-non-virtual-dtor]
        delete TheCIA1;
        ^
C64.cpp:273:17: warning: conversion from string literal to 'char *' is deprecated [-Wc++11-compat-deprecated-writable-strings]
                ShowRequester("RAM save failed.", "OK", NULL);
                              ^
C64.cpp:273:37: warning: conversion from string literal to 'char *' is deprecated [-Wc++11-compat-deprecated-writable-strings]
                ShowRequester("RAM save failed.", "OK", NULL);
                                                  ^
C64.cpp:524:17: warning: conversion from string literal to 'char *' is deprecated [-Wc++11-compat-deprecated-writable-strings]
                ShowRequester("Unable to open snapshot file", "OK", NULL);
                              ^
C64.cpp:524:49: warning: conversion from string literal to 'char *' is deprecated [-Wc++11-compat-deprecated-writable-strings]
                ShowRequester("Unable to open snapshot file", "OK", NULL);
                                                              ^
C64.cpp:607:19: warning: conversion from string literal to 'char *' is deprecated [-Wc++11-compat-deprecated-writable-strings]
                                ShowRequester("Unknown snapshot format", "OK", NULL);
                                              ^
C64.cpp:607:46: warning: conversion from string literal to 'char *' is deprecated [-Wc++11-compat-deprecated-writable-strings]
                                ShowRequester("Unknown snapshot format", "OK", NULL);
                                                                         ^
C64.cpp:675:19: warning: conversion from string literal to 'char *' is deprecated [-Wc++11-compat-deprecated-writable-strings]
                                ShowRequester("Error reading snapshot file", "OK", NULL);
                                              ^
C64.cpp:675:50: warning: conversion from string literal to 'char *' is deprecated [-Wc++11-compat-deprecated-writable-strings]
                                ShowRequester("Error reading snapshot file", "OK", NULL);
                                                                             ^
C64.cpp:682:18: warning: conversion from string literal to 'char *' is deprecated [-Wc++11-compat-deprecated-writable-strings]
                        ShowRequester("Not a Frodo snapshot file", "OK", NULL);
                                      ^
C64.cpp:682:47: warning: conversion from string literal to 'char *' is deprecated [-Wc++11-compat-deprecated-writable-strings]
                        ShowRequester("Not a Frodo snapshot file", "OK", NULL);
                                                                   ^
C64.cpp:686:17: warning: conversion from string literal to 'char *' is deprecated [-Wc++11-compat-deprecated-writable-strings]
                ShowRequester("Can't open snapshot file", "OK", NULL);
                              ^
C64.cpp:686:45: warning: conversion from string literal to 'char *' is deprecated [-Wc++11-compat-deprecated-writable-strings]
                ShowRequester("Can't open snapshot file", "OK", NULL);
                                                          ^
--- SAM.o ---
50 warnings generated.
--- CPUC64.o ---
cc  -O2 -pipe  -fstack-protector-strong -fno-strict-aliasing   -std=gnu++98  -O2 -pipe  -fstack-protector-strong -fno-strict-aliasing  -O2 -g -fomit-frame-pointer -Wall -Wno-unused -Wno-format -I/usr/local/include/SDL -I/usr/local/include -D_REENTRANT -D_THREAD_SAFE -DHAVE_SDL -DREGPARAM= -I./ -DFRODO_HPUX_REV=0 -DKBD_LANG=0 -o CPUC64.o -c CPUC64.cpp
--- C64.o ---
16 warnings generated.
--- VIC.o ---
cc  -O2 -pipe  -fstack-protector-strong -fno-strict-aliasing   -std=gnu++98  -O2 -pipe  -fstack-protector-strong -fno-strict-aliasing  -O2 -g -fomit-frame-pointer -Wall -Wno-unused -Wno-format -I/usr/local/include/SDL -I/usr/local/include -D_REENTRANT -D_THREAD_SAFE -DHAVE_SDL -DREGPARAM= -I./ -DFRODO_HPUX_REV=0 -DKBD_LANG=0 -o VIC.o -c VIC.cpp
--- CPUC64.o ---
CPUC64.cpp:170:47: warning: '&' within '|' [-Wbitwise-op-parentheses]
                                                return color_ram[adr & 0x03ff] | rand() & 0xf0;
                                                                               ~ ~~~~~~~^~~~~~
CPUC64.cpp:170:47: note: place parentheses around the '&' expression to silence this warning
                                                return color_ram[adr & 0x03ff] | rand() & 0xf0;
                                                                                        ^
                                                                                 (            )
CPUC64.cpp:695:27: warning: conversion from string literal to 'char *' is deprecated [-Wc++11-compat-deprecated-writable-strings]
        ShowRequester(illop_msg, "Reset");
                                 ^
CPUC64.cpp:710:27: warning: conversion from string literal to 'char *' is deprecated [-Wc++11-compat-deprecated-writable-strings]
        ShowRequester(illop_msg, "Reset");
                                 ^
In file included from CPUC64.cpp:789:
./CPU_emulline.i:752:47: warning: '&' within '|' [-Wbitwise-op-parentheses]
                        jump(read_byte(adr) | (read_byte((adr + 1) & 0xff | adr & 0xff00) << 8));
                                                         ~~~~~~~~~~^~~~~~ ~
./CPU_emulline.i:752:47: note: place parentheses around the '&' expression to silence this warning
                        jump(read_byte(adr) | (read_byte((adr + 1) & 0xff | adr & 0xff00) << 8));
                                                                   ^
                                                         (               )
./CPU_emulline.i:752:60: warning: '&' within '|' [-Wbitwise-op-parentheses]
                        jump(read_byte(adr) | (read_byte((adr + 1) & 0xff | adr & 0xff00) << 8));
                                                                          ~ ~~~~^~~~~~~~
./CPU_emulline.i:752:60: note: place parentheses around the '&' expression to silence this warning
                        jump(read_byte(adr) | (read_byte((adr + 1) & 0xff | adr & 0xff00) << 8));
                                                                                ^
                                                                            (           )
./CPU_emulline.i:1311:12: warning: '&' within '|' [-Wbitwise-op-parentheses]
                                        a = a & 0xf0 | (a + 6) & 0x0f;
                                            ~~^~~~~~ ~
./CPU_emulline.i:1311:12: note: place parentheses around the '&' expression to silence this warning
                                        a = a & 0xf0 | (a + 6) & 0x0f;
                                              ^
                                            (       )
./CPU_emulline.i:1311:29: warning: '&' within '|' [-Wbitwise-op-parentheses]
                                        a = a & 0xf0 | (a + 6) & 0x0f;
                                                     ~ ~~~~~~~~^~~~~~
./CPU_emulline.i:1311:29: note: place parentheses around the '&' expression to silence this warning
                                        a = a & 0xf0 | (a + 6) & 0x0f;
                                                               ^
                                                       (             )
./CPU_emulline.i:1312:16: warning: using the result of an assignment as a condition without parentheses [-Wparentheses]
                                if (c_flag = ((tmp2 + (tmp2 & 0x10)) & 0x1f0) > 0x50)
                                    ~~~~~~~^~~~~~~~~~~~~~~~~~~~~~~~~~~~~~~~~~~~~~~~~
./CPU_emulline.i:1312:16: note: place parentheses around the assignment to silence this warning
                                if (c_flag = ((tmp2 + (tmp2 & 0x10)) & 0x1f0) > 0x50)
                                           ^
                                    (                                               )
./CPU_emulline.i:1312:16: note: use '==' to turn this assignment into an equality comparison
                                if (c_flag = ((tmp2 + (tmp2 & 0x10)) & 0x1f0) > 0x50)
                                           ^
                                           ==
--- VIC.o ---
VIC.cpp:1407:8: error: expected unqualified-id
static asm void fastcopy(register uchar *dst, register uchar *src);
       ^
VIC.cpp:1408:8: error: expected unqualified-id
static asm void fastcopy(register uchar *dst, register uchar *src)
       ^
VIC.cpp:1838:3: error: use of undeclared identifier 'fastcopy'
                fastcopy(chunky_line_start, (uint8 *)chunky_tmp);
                ^
3 errors generated.
*** [VIC.o] Error code 1

make[1]: stopped in /wrkdirs/usr/ports/emulators/frodo/work/Frodo-4.1b/Src
--- CPUC64.o ---
8 warnings generated.
1 error

make[1]: stopped in /wrkdirs/usr/ports/emulators/frodo/work/Frodo-4.1b/Src
===> Compilation failed unexpectedly.
Try to set MAKE_JOBS_UNSAFE=yes and rebuild before reporting the failure to
the maintainer.
*** Error code 1

Stop.
make: stopped in /usr/ports/emulators/frodo
Received on Thu Jul 29 2021 - 16:59:47 UTC

Original text of this message