[package - main-riscv64-default][games/libretro-snes9x] Failed for libretro-snes9x-0.20210129 in build

From: <pkg-fallout_at_FreeBSD.org>
Date: Thu, 29 Jul 2021 16:29:56 GMT
You are receiving this mail as a port that you maintain
is failing to build on the FreeBSD package build server.
Please investigate the failure and submit a PR to fix
build.

Maintainer:     menelkir_at_itroll.org
Log URL:        http://beefy7.nyi.freebsd.org/data/main-riscv64-default/pd69639d824b8_s7685f8344d/logs/libretro-snes9x-0.20210129.log
Build URL:      http://beefy7.nyi.freebsd.org/build.html?mastername=main-riscv64-default&build=pd69639d824b8_s7685f8344d
Log:

=>> Building games/libretro-snes9x
build started at Thu Jul 29 16:24:22 UTC 2021
port directory: /usr/ports/games/libretro-snes9x
package name: libretro-snes9x-0.20210129
building for: FreeBSD main-riscv64-default-job-01 14.0-CURRENT FreeBSD 14.0-CURRENT 1400026 riscv
maintained by: menelkir_at_itroll.org
Makefile ident: 
Poudriere version: 3.2.8-20-g137a4a48
Host OSVERSION: 1400008
Jail OSVERSION: 1400026
Job Id: 01




!!! Jail is newer than host. (Jail: 1400026, Host: 1400008) !!!
!!! This is not supported. !!!
!!! Host kernel must be same or newer than jail. !!!
!!! Expect build failures. !!!



---Begin Environment---
SHELL=/bin/csh
UNAME_p=riscv64
UNAME_m=riscv
ABI_FILE=/usr/lib/crt1.o
OSVERSION=1400026
UNAME_v=FreeBSD 14.0-CURRENT 1400026
UNAME_r=14.0-CURRENT
BLOCKSIZE=K
MAIL=/var/mail/root
MM_CHARSET=UTF-8
LANG=C.UTF-8
STATUS=1
HOME=/root
PATH=/sbin:/bin:/usr/sbin:/usr/bin:/usr/local/sbin:/usr/local/bin:/root/bin
LOCALBASE=/usr/local
QEMU_EMULATING=1
USER=root
LIBEXECPREFIX=/usr/local/libexec/poudriere
POUDRIERE_VERSION=3.2.8-20-g137a4a48
MASTERMNT=/usr/local/poudriere/data/.m/main-riscv64-default/ref
POUDRIERE_BUILD_TYPE=bulk
PACKAGE_BUILDING=yes
SAVED_TERM=
PWD=/usr/local/poudriere/data/.m/main-riscv64-default/ref/.p/pool
P_PORTS_FEATURES=FLAVORS SELECTED_OPTIONS
MASTERNAME=main-riscv64-default
SCRIPTPREFIX=/usr/local/share/poudriere
OLDPWD=/usr/local/poudriere/data/.m/main-riscv64-default/ref/.p
SCRIPTPATH=/usr/local/share/poudriere/bulk.sh
POUDRIEREPATH=/usr/local/bin/poudriere
---End Environment---

---Begin Poudriere Port Flags/Env---
PORT_FLAGS=
PKGENV=
FLAVOR=
DEPENDS_ARGS=
MAKE_ARGS=
---End Poudriere Port Flags/Env---

---Begin OPTIONS List---
---End OPTIONS List---

--MAINTAINER--
menelkir_at_itroll.org
--End MAINTAINER--

--CONFIGURE_ARGS--

--End CONFIGURE_ARGS--

--CONFIGURE_ENV--
MAKE=gmake XDG_DATA_HOME=/wrkdirs/usr/ports/games/libretro-snes9x/work  XDG_CONFIG_HOME=/wrkdirs/usr/ports/games/libretro-snes9x/work  HOME=/wrkdirs/usr/ports/games/libretro-snes9x/work TMPDIR="/tmp" PATH=/wrkdirs/usr/ports/games/libretro-snes9x/work/.bin:/sbin:/bin:/usr/sbin:/usr/bin:/usr/local/sbin:/usr/local/bin:/root/bin SHELL=/bin/sh CONFIG_SHELL=/bin/sh
--End CONFIGURE_ENV--

--MAKE_ENV--
XDG_DATA_HOME=/wrkdirs/usr/ports/games/libretro-snes9x/work  XDG_CONFIG_HOME=/wrkdirs/usr/ports/games/libretro-snes9x/work  HOME=/wrkdirs/usr/ports/games/libretro-snes9x/work TMPDIR="/tmp" PATH=/wrkdirs/usr/ports/games/libretro-snes9x/work/.bin:/sbin:/bin:/usr/sbin:/usr/bin:/usr/local/sbin:/usr/local/bin:/root/bin NO_PIE=yes MK_DEBUG_FILES=no MK_KERNEL_SYMBOLS=no SHELL=/bin/sh NO_LINT=YES PREFIX=/usr/local  LOCALBASE=/usr/local  CC="/nxb-bin/usr/bin/cc" CFLAGS="-O2 -pipe -march=rv64imafdc -mabi=lp64d  -fstack-protector-strong -fno-strict-aliasing "  CPP="/nxb-bin/usr/bin/cpp" CPPFLAGS=""  LDFLAGS=" -fstack-protector-strong " LIBS=""  CXX="/nxb-bin/usr/bin/c++" CXXFLAGS="-O2 -pipe -march=rv64imafdc -mabi=lp64d -fstack-protector-strong -fno-strict-aliasing  "  MANPREFIX="/usr/local" BSD_INSTALL_PROGRAM="install  -s -m 555"  BSD_INSTALL_LIB="install  -s -m 0644"  BSD_INSTALL_SCRIPT="install  -m 555"  BSD_INSTALL_DATA="install  -m 0644"  BSD_INSTALL_MAN="install  -m 444"
--End MAKE_ENV--

--PLIST_SUB--
OSREL=14.0 PREFIX=%D LOCALBASE=/usr/local  RESETPREFIX=/usr/local LIB32DIR=lib DOCSDIR="share/doc/libretro-snes9x"  EXAMPLESDIR="share/examples/libretro-snes9x"  DATADIR="share/libretro-snes9x"  WWWDIR="www/libretro-snes9x"  ETCDIR="etc/libretro-snes9x"
--End PLIST_SUB--

--SUB_LIST--
PREFIX=/usr/local LOCALBASE=/usr/local  DATADIR=/usr/local/share/libretro-snes9x DOCSDIR=/usr/local/share/doc/libretro-snes9x EXAMPLESDIR=/usr/local/share/examples/libretro-snes9x  WWWDIR=/usr/local/www/libretro-snes9x ETCDIR=/usr/local/etc/libretro-snes9x
--End SUB_LIST--

---Begin make.conf---
.sinclude "/etc/make.nxb.conf"
USE_PACKAGE_DEPENDS=yes
BATCH=yes
WRKDIRPREFIX=/wrkdirs
PORTSDIR=/usr/ports
PACKAGES=/packages
DISTDIR=/distfiles
PACKAGE_BUILDING=yes
PACKAGE_BUILDING_FLAVORS=yes
MACHINE=riscv
MACHINE_ARCH=riscv64
ARCH=${MACHINE_ARCH}
#### /usr/local/etc/poudriere.d/make.conf ####
# XXX: We really need this but cannot use it while 'make checksum' does not
# try the next mirror on checksum failure.  It currently retries the same
# failed mirror and then fails rather then trying another.  It *does*
# try the next if the size is mismatched though.
#MASTER_SITE_FREEBSD=yes
# Build ALLOW_MAKE_JOBS_PACKAGES with 2 jobs
MAKE_JOBS_NUMBER=2
#### /usr/ports/Mk/Scripts/ports_env.sh ####
_CCVERSION_9d218390=FreeBSD clang version 12.0.1 (git_at_github.com:llvm/llvm-project.git llvmorg-12.0.1-0-gfed41342a82f) Target: riscv64-unknown-freebsd14.0 Thread model: posix InstalledDir: /nxb-bin/usr/bin
_ALTCCVERSION_9d218390=none
_CXXINTERNAL_9c45a5b1=FreeBSD clang version 12.0.1 (git_at_github.com:llvm/llvm-project.git llvmorg-12.0.1-0-gfed41342a82f) Target: riscv64-unknown-freebsd14.0 Thread model: posix InstalledDir: /nxb-bin/usr/bin "/nxb-bin/usr/bin/ld" "--eh-frame-hdr" "-dynamic-linker" "/libexec/ld-elf.so.1" "--enable-new-dtags" "-m" "elf64lriscv" "-o" "a.out" "/usr/lib/crt1.o" "/usr/lib/crti.o" "/usr/lib/crtbegin.o" "-L/usr/lib" "/dev/null" "-lc++" "-lm" "-lgcc" "--as-needed" "-lgcc_s" "--no-as-needed" "-lc" "-lgcc" "--as-needed" "-lgcc_s" "--no-as-needed" "/usr/lib/crtend.o" "/usr/lib/crtn.o"
CC_OUTPUT_9d218390_58173849=yes
CC_OUTPUT_9d218390_9bdba57c=yes
CC_OUTPUT_9d218390_6a4fe7f5=yes
CC_OUTPUT_9d218390_6bcac02b=yes
CC_OUTPUT_9d218390_67d20829=yes
CC_OUTPUT_9d218390_bfa62e83=yes
CC_OUTPUT_9d218390_f0b4d593=yes
CC_OUTPUT_9d218390_308abb44=yes
CC_OUTPUT_9d218390_f00456e5=yes
CC_OUTPUT_9d218390_65ad290d=yes
CC_OUTPUT_9d218390_f2776b26=yes
CC_OUTPUT_9d218390_b2657cc3=yes
CC_OUTPUT_9d218390_380987f7=yes
CC_OUTPUT_9d218390_160933ec=yes
CC_OUTPUT_9d218390_fb62803b=yes
_OBJC_CCVERSION_9d218390=FreeBSD clang version 12.0.1 (git_at_github.com:llvm/llvm-project.git llvmorg-12.0.1-0-gfed41342a82f) Target: riscv64-unknown-freebsd14.0 Thread model: posix InstalledDir: /nxb-bin/usr/bin
_OBJC_ALTCCVERSION_9d218390=none
ARCH=riscv64
OPSYS=FreeBSD
_OSRELEASE=14.0-CURRENT
OSREL=14.0
OSVERSION=1400026
PYTHONBASE=/usr/local
CONFIGURE_MAX_CMD_LEN=524288
HAVE_PORTS_ENV=1
#### Misc Poudriere ####
GID=0
UID=0
DISABLE_MAKE_JOBS=poudriere
---End make.conf---
---Begin make.nxb.conf---
CC=/nxb-bin/usr/bin/cc
CPP=/nxb-bin/usr/bin/cpp
CXX=/nxb-bin/usr/bin/c++
NM=/nxb-bin/usr/bin/nm
LD=/nxb-bin/usr/bin/ld
OBJCOPY=/nxb-bin/usr/bin/objcopy
SIZE=/nxb-bin/usr/bin/size
STRIPBIN=/nxb-bin/usr/bin/strip
SED=/nxb-bin/usr/bin/sed
RANLIB=/nxb-bin/usr/bin/ranlib
YACC=/nxb-bin/usr/bin/yacc
MAKE=/nxb-bin/usr/bin/make
STRINGS=/nxb-bin/usr/bin/strings
AWK=/nxb-bin/usr/bin/awk
FLEX=/nxb-bin/usr/bin/flex
---End make.nxb.conf---
--Resource limits--
cpu time               (seconds, -t)  unlimited
file size           (512-blocks, -f)  unlimited
data seg size           (kbytes, -d)  33554432
stack size              (kbytes, -s)  524288
core file size      (512-blocks, -c)  unlimited
max memory size         (kbytes, -m)  unlimited
locked memory           (kbytes, -l)  unlimited
max user processes              (-u)  89999
open files                      (-n)  1024
virtual mem size        (kbytes, -v)  unlimited
swap limit              (kbytes, -w)  unlimited
socket buffer size       (bytes, -b)  unlimited
pseudo-terminals                (-p)  unlimited
kqueues                         (-k)  unlimited
umtx shared locks               (-o)  unlimited
--End resource limits--
=======================<phase: check-sanity   >============================
===>  License PS accepted by the user
===========================================================================
=======================<phase: pkg-depends    >============================
===>   libretro-snes9x-0.20210129 depends on file: /usr/local/sbin/pkg - not found
===>   Installing existing package /packages/All/pkg-1.17.1.pkg
[main-riscv64-default-job-01] Installing pkg-1.17.1...
[main-riscv64-default-job-01] Extracting pkg-1.17.1: .......... done
===>   libretro-snes9x-0.20210129 depends on file: /usr/local/sbin/pkg - found
===>   Returning to build of libretro-snes9x-0.20210129
===========================================================================
=======================<phase: fetch-depends  >============================
===========================================================================
=======================<phase: fetch          >============================
===>  License PS accepted by the user
===> Fetching all distfiles required by libretro-snes9x-0.20210129 for building
===========================================================================
=======================<phase: checksum       >============================
===>  License PS accepted by the user
===> Fetching all distfiles required by libretro-snes9x-0.20210129 for building
<snip>
                        DM7BG1 = M7M1 ? Renderers<DrawMode7MosaicBG1, Hires>::Functions : Renderers<DrawMode7BG1, Hires>::Functions;
                                                                                                                          ^
./tileimpl.h:195:17: note: forward declaration of template entity is here
                static call_t Functions[9];
                              ^
./tile.cpp:335:102: note: add an explicit instantiation declaration to suppress this warning if 'TileImpl::Renderers<DrawMode7BG1, Hires>::Functions' is explicitly instantiated in another translation unit
                        DM7BG1 = M7M1 ? Renderers<DrawMode7MosaicBG1, Hires>::Functions : Renderers<DrawMode7BG1, Hires>::Functions;
                                                                                                                          ^
./tile.cpp:336:58: warning: instantiation of variable 'TileImpl::Renderers<DrawMode7MosaicBG2, Hires>::Functions' required here, but no definition is available [-Wundefined-var-template]
                        DM7BG2 = M7M2 ? Renderers<DrawMode7MosaicBG2, Hires>::Functions : Renderers<DrawMode7BG2, Hires>::Functions;
                                                                              ^
./tileimpl.h:195:17: note: forward declaration of template entity is here
                static call_t Functions[9];
                              ^
./tile.cpp:336:58: note: add an explicit instantiation declaration to suppress this warning if 'TileImpl::Renderers<DrawMode7MosaicBG2, Hires>::Functions' is explicitly instantiated in another translation unit
                        DM7BG2 = M7M2 ? Renderers<DrawMode7MosaicBG2, Hires>::Functions : Renderers<DrawMode7BG2, Hires>::Functions;
                                                                              ^
./tile.cpp:336:102: warning: instantiation of variable 'TileImpl::Renderers<DrawMode7BG2, Hires>::Functions' required here, but no definition is available [-Wundefined-var-template]
                        DM7BG2 = M7M2 ? Renderers<DrawMode7MosaicBG2, Hires>::Functions : Renderers<DrawMode7BG2, Hires>::Functions;
                                                                                                                          ^
./tileimpl.h:195:17: note: forward declaration of template entity is here
                static call_t Functions[9];
                              ^
./tile.cpp:336:102: note: add an explicit instantiation declaration to suppress this warning if 'TileImpl::Renderers<DrawMode7BG2, Hires>::Functions' is explicitly instantiated in another translation unit
                        DM7BG2 = M7M2 ? Renderers<DrawMode7MosaicBG2, Hires>::Functions : Renderers<DrawMode7BG2, Hires>::Functions;
                                                                                                                          ^
./tile.cpp:341:43: warning: instantiation of variable 'TileImpl::Renderers<DrawTile16, Hires>::Functions' required here, but no definition is available [-Wundefined-var-template]
                        DT     = Renderers<DrawTile16, Hires>::Functions;
                                                               ^
./tileimpl.h:195:17: note: forward declaration of template entity is here
                static call_t Functions[9];
                              ^
./tile.cpp:341:43: note: add an explicit instantiation declaration to suppress this warning if 'TileImpl::Renderers<DrawTile16, Hires>::Functions' is explicitly instantiated in another translation unit
                        DT     = Renderers<DrawTile16, Hires>::Functions;
                                                               ^
./tile.cpp:342:50: warning: instantiation of variable 'TileImpl::Renderers<DrawClippedTile16, Hires>::Functions' required here, but no definition is available [-Wundefined-var-template]
                        DCT    = Renderers<DrawClippedTile16, Hires>::Functions;
                                                                      ^
./tileimpl.h:195:17: note: forward declaration of template entity is here
                static call_t Functions[9];
                              ^
./tile.cpp:342:50: note: add an explicit instantiation declaration to suppress this warning if 'TileImpl::Renderers<DrawClippedTile16, Hires>::Functions' is explicitly instantiated in another translation unit
                        DCT    = Renderers<DrawClippedTile16, Hires>::Functions;
                                                                      ^
./tile.cpp:343:50: warning: instantiation of variable 'TileImpl::Renderers<DrawMosaicPixel16, Hires>::Functions' required here, but no definition is available [-Wundefined-var-template]
                        DMP    = Renderers<DrawMosaicPixel16, Hires>::Functions;
                                                                      ^
./tileimpl.h:195:17: note: forward declaration of template entity is here
                static call_t Functions[9];
                              ^
./tile.cpp:343:50: note: add an explicit instantiation declaration to suppress this warning if 'TileImpl::Renderers<DrawMosaicPixel16, Hires>::Functions' is explicitly instantiated in another translation unit
                        DMP    = Renderers<DrawMosaicPixel16, Hires>::Functions;
                                                                      ^
./tile.cpp:354:47: warning: instantiation of variable 'TileImpl::Renderers<DrawTile16, Interlace>::Functions' required here, but no definition is available [-Wundefined-var-template]
                        DT     = Renderers<DrawTile16, Interlace>::Functions;
                                                                   ^
./tileimpl.h:195:17: note: forward declaration of template entity is here
                static call_t Functions[9];
                              ^
./tile.cpp:354:47: note: add an explicit instantiation declaration to suppress this warning if 'TileImpl::Renderers<DrawTile16, Interlace>::Functions' is explicitly instantiated in another translation unit
                        DT     = Renderers<DrawTile16, Interlace>::Functions;
                                                                   ^
./tile.cpp:355:54: warning: instantiation of variable 'TileImpl::Renderers<DrawClippedTile16, Interlace>::Functions' required here, but no definition is available [-Wundefined-var-template]
                        DCT    = Renderers<DrawClippedTile16, Interlace>::Functions;
                                                                          ^
./tileimpl.h:195:17: note: forward declaration of template entity is here
                static call_t Functions[9];
                              ^
./tile.cpp:355:54: note: add an explicit instantiation declaration to suppress this warning if 'TileImpl::Renderers<DrawClippedTile16, Interlace>::Functions' is explicitly instantiated in another translation unit
                        DCT    = Renderers<DrawClippedTile16, Interlace>::Functions;
                                                                          ^
./tile.cpp:356:54: warning: instantiation of variable 'TileImpl::Renderers<DrawMosaicPixel16, Interlace>::Functions' required here, but no definition is available [-Wundefined-var-template]
                        DMP    = Renderers<DrawMosaicPixel16, Interlace>::Functions;
                                                                          ^
./tileimpl.h:195:17: note: forward declaration of template entity is here
                static call_t Functions[9];
                              ^
./tile.cpp:356:54: note: add an explicit instantiation declaration to suppress this warning if 'TileImpl::Renderers<DrawMosaicPixel16, Interlace>::Functions' is explicitly instantiated in another translation unit
                        DMP    = Renderers<DrawMosaicPixel16, Interlace>::Functions;
                                                                          ^
./tile.cpp:357:51: warning: instantiation of variable 'TileImpl::Renderers<DrawBackdrop16, Normal2x1>::Functions' required here, but no definition is available [-Wundefined-var-template]
                        DB     = Renderers<DrawBackdrop16, Normal2x1>::Functions;
                                                                       ^
./tileimpl.h:195:17: note: forward declaration of template entity is here
                static call_t Functions[9];
                              ^
./tile.cpp:357:51: note: add an explicit instantiation declaration to suppress this warning if 'TileImpl::Renderers<DrawBackdrop16, Normal2x1>::Functions' is explicitly instantiated in another translation unit
                        DB     = Renderers<DrawBackdrop16, Normal2x1>::Functions;
                                                                       ^
./tile.cpp:358:62: warning: instantiation of variable 'TileImpl::Renderers<DrawMode7MosaicBG1, Normal2x1>::Functions' required here, but no definition is available [-Wundefined-var-template]
                        DM7BG1 = M7M1 ? Renderers<DrawMode7MosaicBG1, Normal2x1>::Functions : Renderers<DrawMode7BG1, Normal2x1>::Functions;
                                                                                  ^
./tileimpl.h:195:17: note: forward declaration of template entity is here
                static call_t Functions[9];
                              ^
./tile.cpp:358:62: note: add an explicit instantiation declaration to suppress this warning if 'TileImpl::Renderers<DrawMode7MosaicBG1, Normal2x1>::Functions' is explicitly instantiated in another translation unit
                        DM7BG1 = M7M1 ? Renderers<DrawMode7MosaicBG1, Normal2x1>::Functions : Renderers<DrawMode7BG1, Normal2x1>::Functions;
                                                                                  ^
./tile.cpp:358:110: warning: instantiation of variable 'TileImpl::Renderers<DrawMode7BG1, Normal2x1>::Functions' required here, but no definition is available [-Wundefined-var-template]
                        DM7BG1 = M7M1 ? Renderers<DrawMode7MosaicBG1, Normal2x1>::Functions : Renderers<DrawMode7BG1, Normal2x1>::Functions;
                                                                                                                                  ^
./tileimpl.h:195:17: note: forward declaration of template entity is here
                static call_t Functions[9];
                              ^
./tile.cpp:358:110: note: add an explicit instantiation declaration to suppress this warning if 'TileImpl::Renderers<DrawMode7BG1, Normal2x1>::Functions' is explicitly instantiated in another translation unit
                        DM7BG1 = M7M1 ? Renderers<DrawMode7MosaicBG1, Normal2x1>::Functions : Renderers<DrawMode7BG1, Normal2x1>::Functions;
                                                                                                                                  ^
./tile.cpp:359:62: warning: instantiation of variable 'TileImpl::Renderers<DrawMode7MosaicBG2, Normal2x1>::Functions' required here, but no definition is available [-Wundefined-var-template]
                        DM7BG2 = M7M2 ? Renderers<DrawMode7MosaicBG2, Normal2x1>::Functions : Renderers<DrawMode7BG2, Normal2x1>::Functions;
                                                                                  ^
./tileimpl.h:195:17: note: forward declaration of template entity is here
                static call_t Functions[9];
                              ^
./tile.cpp:359:62: note: add an explicit instantiation declaration to suppress this warning if 'TileImpl::Renderers<DrawMode7MosaicBG2, Normal2x1>::Functions' is explicitly instantiated in another translation unit
                        DM7BG2 = M7M2 ? Renderers<DrawMode7MosaicBG2, Normal2x1>::Functions : Renderers<DrawMode7BG2, Normal2x1>::Functions;
                                                                                  ^
./tile.cpp:359:110: warning: instantiation of variable 'TileImpl::Renderers<DrawMode7BG2, Normal2x1>::Functions' required here, but no definition is available [-Wundefined-var-template]
                        DM7BG2 = M7M2 ? Renderers<DrawMode7MosaicBG2, Normal2x1>::Functions : Renderers<DrawMode7BG2, Normal2x1>::Functions;
                                                                                                                                  ^
./tileimpl.h:195:17: note: forward declaration of template entity is here
                static call_t Functions[9];
                              ^
./tile.cpp:359:110: note: add an explicit instantiation declaration to suppress this warning if 'TileImpl::Renderers<DrawMode7BG2, Normal2x1>::Functions' is explicitly instantiated in another translation unit
                        DM7BG2 = M7M2 ? Renderers<DrawMode7MosaicBG2, Normal2x1>::Functions : Renderers<DrawMode7BG2, Normal2x1>::Functions;
                                                                                                                                  ^
./tile.cpp:364:47: warning: instantiation of variable 'TileImpl::Renderers<DrawTile16, Normal2x1>::Functions' required here, but no definition is available [-Wundefined-var-template]
                        DT     = Renderers<DrawTile16, Normal2x1>::Functions;
                                                                   ^
./tileimpl.h:195:17: note: forward declaration of template entity is here
                static call_t Functions[9];
                              ^
./tile.cpp:364:47: note: add an explicit instantiation declaration to suppress this warning if 'TileImpl::Renderers<DrawTile16, Normal2x1>::Functions' is explicitly instantiated in another translation unit
                        DT     = Renderers<DrawTile16, Normal2x1>::Functions;
                                                                   ^
./tile.cpp:365:54: warning: instantiation of variable 'TileImpl::Renderers<DrawClippedTile16, Normal2x1>::Functions' required here, but no definition is available [-Wundefined-var-template]
                        DCT    = Renderers<DrawClippedTile16, Normal2x1>::Functions;
                                                                          ^
./tileimpl.h:195:17: note: forward declaration of template entity is here
                static call_t Functions[9];
                              ^
./tile.cpp:365:54: note: add an explicit instantiation declaration to suppress this warning if 'TileImpl::Renderers<DrawClippedTile16, Normal2x1>::Functions' is explicitly instantiated in another translation unit
                        DCT    = Renderers<DrawClippedTile16, Normal2x1>::Functions;
                                                                          ^
./tile.cpp:366:54: warning: instantiation of variable 'TileImpl::Renderers<DrawMosaicPixel16, Normal2x1>::Functions' required here, but no definition is available [-Wundefined-var-template]
                        DMP    = Renderers<DrawMosaicPixel16, Normal2x1>::Functions;
                                                                          ^
./tileimpl.h:195:17: note: forward declaration of template entity is here
                static call_t Functions[9];
                              ^
./tile.cpp:366:54: note: add an explicit instantiation declaration to suppress this warning if 'TileImpl::Renderers<DrawMosaicPixel16, Normal2x1>::Functions' is explicitly instantiated in another translation unit
                        DMP    = Renderers<DrawMosaicPixel16, Normal2x1>::Functions;
                                                                          ^
30 warnings generated.
/nxb-bin/usr/bin/c++ -I../libretro -I../libretro/libretro-common/include -I.. -I../apu/ -I../apu/bapu   -O2 -pipe -march=rv64imafdc -mabi=lp64d -fstack-protector-strong -fno-strict-aliasing   -flto -O3 -DNDEBUG -fomit-frame-pointer -Wall -W -Wno-unused-parameter -Wno-missing-field-initializers -fPIC -DRIGHTSHIFT_IS_SAR -D__LIBRETRO__ -DALLOW_CPU_OVERCLOCK -DHAVE_STDINT_H -DHAVE_STRINGS_H -fno-rtti -pedantic  -fno-exceptions -c -o../tileimpl-n1x1.o ../tileimpl-n1x1.cpp
/nxb-bin/usr/bin/c++ -I../libretro -I../libretro/libretro-common/include -I.. -I../apu/ -I../apu/bapu   -O2 -pipe -march=rv64imafdc -mabi=lp64d -fstack-protector-strong -fno-strict-aliasing   -flto -O3 -DNDEBUG -fomit-frame-pointer -Wall -W -Wno-unused-parameter -Wno-missing-field-initializers -fPIC -DRIGHTSHIFT_IS_SAR -D__LIBRETRO__ -DALLOW_CPU_OVERCLOCK -DHAVE_STDINT_H -DHAVE_STRINGS_H -fno-rtti -pedantic  -fno-exceptions -c -o../tileimpl-n2x1.o ../tileimpl-n2x1.cpp
/nxb-bin/usr/bin/c++ -I../libretro -I../libretro/libretro-common/include -I.. -I../apu/ -I../apu/bapu   -O2 -pipe -march=rv64imafdc -mabi=lp64d -fstack-protector-strong -fno-strict-aliasing   -flto -O3 -DNDEBUG -fomit-frame-pointer -Wall -W -Wno-unused-parameter -Wno-missing-field-initializers -fPIC -DRIGHTSHIFT_IS_SAR -D__LIBRETRO__ -DALLOW_CPU_OVERCLOCK -DHAVE_STDINT_H -DHAVE_STRINGS_H -fno-rtti -pedantic  -fno-exceptions -c -o../tileimpl-h2x1.o ../tileimpl-h2x1.cpp
/nxb-bin/usr/bin/c++ -I../libretro -I../libretro/libretro-common/include -I.. -I../apu/ -I../apu/bapu   -O2 -pipe -march=rv64imafdc -mabi=lp64d -fstack-protector-strong -fno-strict-aliasing   -flto -O3 -DNDEBUG -fomit-frame-pointer -Wall -W -Wno-unused-parameter -Wno-missing-field-initializers -fPIC -DRIGHTSHIFT_IS_SAR -D__LIBRETRO__ -DALLOW_CPU_OVERCLOCK -DHAVE_STDINT_H -DHAVE_STRINGS_H -fno-rtti -pedantic  -fno-exceptions -c -o../sha256.o ../sha256.cpp
/nxb-bin/usr/bin/c++ -I../libretro -I../libretro/libretro-common/include -I.. -I../apu/ -I../apu/bapu   -O2 -pipe -march=rv64imafdc -mabi=lp64d -fstack-protector-strong -fno-strict-aliasing   -flto -O3 -DNDEBUG -fomit-frame-pointer -Wall -W -Wno-unused-parameter -Wno-missing-field-initializers -fPIC -DRIGHTSHIFT_IS_SAR -D__LIBRETRO__ -DALLOW_CPU_OVERCLOCK -DHAVE_STDINT_H -DHAVE_STRINGS_H -fno-rtti -pedantic  -fno-exceptions -c -o../bml.o ../bml.cpp
/nxb-bin/usr/bin/c++ -I../libretro -I../libretro/libretro-common/include -I.. -I../apu/ -I../apu/bapu   -O2 -pipe -march=rv64imafdc -mabi=lp64d -fstack-protector-strong -fno-strict-aliasing   -flto -O3 -DNDEBUG -fomit-frame-pointer -Wall -W -Wno-unused-parameter -Wno-missing-field-initializers -fPIC -DRIGHTSHIFT_IS_SAR -D__LIBRETRO__ -DALLOW_CPU_OVERCLOCK -DHAVE_STDINT_H -DHAVE_STRINGS_H -fno-rtti -pedantic  -fno-exceptions -c -o../movie.o ../movie.cpp
In file included from ../movie.cpp:15:
./controls.h:49:3: warning: anonymous types declared in an anonymous union are an extension [-Wnested-anon-types]
                union
                ^
./controls.h:101:3: warning: anonymous types declared in an anonymous union are an extension [-Wnested-anon-types]
                union
                ^
./controls.h:127:3: warning: anonymous types declared in an anonymous union are an extension [-Wnested-anon-types]
                struct                                                          // Which SNES-pointers to control with this pointer
                ^
3 warnings generated.
/nxb-bin/usr/bin/c++ -I../libretro -I../libretro/libretro-common/include -I.. -I../apu/ -I../apu/bapu   -O2 -pipe -march=rv64imafdc -mabi=lp64d -fstack-protector-strong -fno-strict-aliasing   -flto -O3 -DNDEBUG -fomit-frame-pointer -Wall -W -Wno-unused-parameter -Wno-missing-field-initializers -fPIC -DRIGHTSHIFT_IS_SAR -D__LIBRETRO__ -DALLOW_CPU_OVERCLOCK -DHAVE_STDINT_H -DHAVE_STRINGS_H -fno-rtti -pedantic  -fno-exceptions -c -o../libretro/libretro.o ../libretro/libretro.cpp
In file included from ../libretro/libretro.cpp:8:
In file included from ../apu/bapu/snes/snes.hpp:19:
./apu/bapu/snes/../smp/smp.hpp:53:7: warning: anonymous types declared in an anonymous union are an extension [-Wnested-anon-types]
      struct { uint8 a, y; } B;
      ^
In file included from ../libretro/libretro.cpp:11:
./controls.h:49:3: warning: anonymous types declared in an anonymous union are an extension [-Wnested-anon-types]
                union
                ^
./controls.h:101:3: warning: anonymous types declared in an anonymous union are an extension [-Wnested-anon-types]
                union
                ^
./controls.h:127:3: warning: anonymous types declared in an anonymous union are an extension [-Wnested-anon-types]
                struct                                                          // Which SNES-pointers to control with this pointer
                ^
4 warnings generated.
/nxb-bin/usr/bin/cc -I../libretro -I../libretro/libretro-common/include -I.. -I../apu/ -I../apu/bapu   -O2 -pipe -march=rv64imafdc -mabi=lp64d -fstack-protector-strong -fno-strict-aliasing   -flto -O3 -DNDEBUG -fomit-frame-pointer -Wall -W -Wno-unused-parameter -Wno-missing-field-initializers -fPIC -DRIGHTSHIFT_IS_SAR -D__LIBRETRO__ -DALLOW_CPU_OVERCLOCK -DHAVE_STDINT_H -c -o../filter/snes_ntsc.o ../filter/snes_ntsc.c
/nxb-bin/usr/bin/c++ -fPIC -shared -Wl,--version-script=link.T -Wl,-z,defs -osnes9x_libretro.so ../apu/apu.o ../apu/bapu/dsp/sdsp.o ../apu/bapu/smp/smp.o ../apu/bapu/smp/smp_state.o ../bsx.o ../c4.o ../c4emu.o ../cheats.o ../cheats2.o ../clip.o ../conffile.o ../controls.o ../cpu.o ../cpuexec.o ../cpuops.o ../crosshairs.o ../dma.o ../dsp.o ../dsp1.o ../dsp2.o ../dsp3.o ../dsp4.o ../fxinst.o ../fxemu.o ../gfx.o ../globals.o ../logger.o ../memmap.o ../obc1.o ../msu1.o ../ppu.o ../stream.o ../sa1.o ../sa1cpu.o ../screenshot.o ../sdd1.o ../sdd1emu.o ../seta.o ../seta010.o ../seta011.o ../seta018.o ../snapshot.o ../snes9x.o ../spc7110.o ../srtc.o ../tile.o ../tileimpl-n1x1.o ../tileimpl-n2x1.o ../tileimpl-h2x1.o ../sha256.o ../bml.o ../movie.o ../libretro/libretro.o ../filter/snes_ntsc.o  -fstack-protector-strong  -flto -lm
Hard-float 'd' ABI can't be used for a target that doesn't support the D instruction set extension (ignoring target-abi)
ld: error: lto.tmp: cannot link object files with different floating-point ABI
c++: error: linker command failed with exit code 1 (use -v to see invocation)
gmake[2]: *** [Makefile:716: snes9x_libretro.so] Error 1
gmake[2]: Leaving directory '/wrkdirs/usr/ports/games/libretro-snes9x/work/snes9x-73aa348/libretro'
gmake[1]: *** [Makefile.freebsd:2: all] Error 2
gmake[1]: Leaving directory '/wrkdirs/usr/ports/games/libretro-snes9x/work/snes9x-73aa348'
*** Error code 1

Stop.
make: stopped in /usr/ports/games/libretro-snes9x
Received on Thu Jul 29 2021 - 16:29:56 UTC

Original text of this message