[package - main-riscv64-default][databases/rubygem-pg_query] Failed for rubygem-pg_query-2.1.0 in stage

From: <pkg-fallout_at_FreeBSD.org>
Date: Thu, 29 Jul 2021 14:01:07 GMT
You are receiving this mail as a port that you maintain
is failing to build on the FreeBSD package build server.
Please investigate the failure and submit a PR to fix
build.

Maintainer:     mfechner_at_FreeBSD.org
Log URL:        http://beefy7.nyi.freebsd.org/data/main-riscv64-default/pd69639d824b8_s7685f8344d/logs/rubygem-pg_query-2.1.0.log
Build URL:      http://beefy7.nyi.freebsd.org/build.html?mastername=main-riscv64-default&build=pd69639d824b8_s7685f8344d
Log:

=>> Building databases/rubygem-pg_query
build started at Thu Jul 29 13:59:55 UTC 2021
port directory: /usr/ports/databases/rubygem-pg_query
package name: rubygem-pg_query-2.1.0
building for: FreeBSD main-riscv64-default-job-03 14.0-CURRENT FreeBSD 14.0-CURRENT 1400026 riscv
maintained by: mfechner_at_FreeBSD.org
Makefile ident: 
Poudriere version: 3.2.8-20-g137a4a48
Host OSVERSION: 1400008
Jail OSVERSION: 1400026
Job Id: 03




!!! Jail is newer than host. (Jail: 1400026, Host: 1400008) !!!
!!! This is not supported. !!!
!!! Host kernel must be same or newer than jail. !!!
!!! Expect build failures. !!!



---Begin Environment---
SHELL=/bin/csh
UNAME_p=riscv64
UNAME_m=riscv
ABI_FILE=/usr/lib/crt1.o
OSVERSION=1400026
UNAME_v=FreeBSD 14.0-CURRENT 1400026
UNAME_r=14.0-CURRENT
BLOCKSIZE=K
MAIL=/var/mail/root
MM_CHARSET=UTF-8
LANG=C.UTF-8
STATUS=1
HOME=/root
PATH=/sbin:/bin:/usr/sbin:/usr/bin:/usr/local/sbin:/usr/local/bin:/root/bin
LOCALBASE=/usr/local
QEMU_EMULATING=1
USER=root
LIBEXECPREFIX=/usr/local/libexec/poudriere
POUDRIERE_VERSION=3.2.8-20-g137a4a48
MASTERMNT=/usr/local/poudriere/data/.m/main-riscv64-default/ref
POUDRIERE_BUILD_TYPE=bulk
PACKAGE_BUILDING=yes
SAVED_TERM=
PWD=/usr/local/poudriere/data/.m/main-riscv64-default/ref/.p/pool
P_PORTS_FEATURES=FLAVORS SELECTED_OPTIONS
MASTERNAME=main-riscv64-default
SCRIPTPREFIX=/usr/local/share/poudriere
OLDPWD=/usr/local/poudriere/data/.m/main-riscv64-default/ref/.p
SCRIPTPATH=/usr/local/share/poudriere/bulk.sh
POUDRIEREPATH=/usr/local/bin/poudriere
---End Environment---

---Begin Poudriere Port Flags/Env---
PORT_FLAGS=
PKGENV=
FLAVOR=
DEPENDS_ARGS=
MAKE_ARGS=
---End Poudriere Port Flags/Env---

---Begin OPTIONS List---
---End OPTIONS List---

--MAINTAINER--
mfechner_at_FreeBSD.org
--End MAINTAINER--

--CONFIGURE_ARGS--

--End CONFIGURE_ARGS--

--CONFIGURE_ENV--
XDG_DATA_HOME=/wrkdirs/usr/ports/databases/rubygem-pg_query/work  XDG_CONFIG_HOME=/wrkdirs/usr/ports/databases/rubygem-pg_query/work  HOME=/wrkdirs/usr/ports/databases/rubygem-pg_query/work TMPDIR="/tmp" PATH=/wrkdirs/usr/ports/databases/rubygem-pg_query/work/.bin:/sbin:/bin:/usr/sbin:/usr/bin:/usr/local/sbin:/usr/local/bin:/root/bin SHELL=/bin/sh CONFIG_SHELL=/bin/sh LANG=en_US.UTF-8 LC_ALL=en_US.UTF-8
--End CONFIGURE_ENV--

--MAKE_ENV--
XDG_DATA_HOME=/wrkdirs/usr/ports/databases/rubygem-pg_query/work  XDG_CONFIG_HOME=/wrkdirs/usr/ports/databases/rubygem-pg_query/work  HOME=/wrkdirs/usr/ports/databases/rubygem-pg_query/work TMPDIR="/tmp" PATH=/wrkdirs/usr/ports/databases/rubygem-pg_query/work/.bin:/sbin:/bin:/usr/sbin:/usr/bin:/usr/local/sbin:/usr/local/bin:/root/bin NO_PIE=yes MK_DEBUG_FILES=no MK_KERNEL_SYMBOLS=no SHELL=/bin/sh NO_LINT=YES LANG=en_US.UTF-8 LC_ALL=en_US.UTF-8 PREFIX=/usr/local  LOCALBASE=/usr/local  CC="/nxb-bin/usr/bin/cc" CFLAGS="-O2 -pipe -march=rv64imafdc -mabi=lp64d  -fstack-protector-strong -fno-strict-aliasing "  CPP="/nxb-bin/usr/bin/cpp" CPPFLAGS=""  LDFLAGS=" -fstack-protector-strong " LIBS=""  CXX="/nxb-bin/usr/bin/c++" CXXFLAGS="-O2 -pipe -march=rv64imafdc -mabi=lp64d -fstack-protector-strong -fno-strict-aliasing  "  MANPREFIX="/usr/local" BSD_INSTALL_PROGRAM="install  -s -m 555"  BSD_INSTALL_LIB="install  -s -m 0644"  BSD_INSTALL_SCRIPT="install  -m 555"  BSD_INSTALL_DATA="install  -m 0
 644"  BSD_INSTALL_MAN="install  -m 444"
--End MAKE_ENV--

--PLIST_SUB--
RUBY_LIBDIR="lib/ruby/2.7" RUBY_ARCHLIBDIR="lib/ruby/2.7/riscv64-freebsd14" RUBY_SITELIBDIR="lib/ruby/site_ruby/2.7" RUBY_SITEARCHLIBDIR="lib/ruby/site_ruby/2.7/riscv64-freebsd14" RUBY_VENDORLIBDIR="lib/ruby/vendor_ruby/2.7" RUBY_VENDORARCHLIBDIR="lib/ruby/vendor_ruby/2.7/riscv64-freebsd14" RUBY_MODDOCDIR="share/doc/ruby27/pg_query" RUBY_MODEXAMPLESDIR="share/examples/ruby27/pg_query" RUBY_DOCDIR="share/doc/ruby27" RUBY_EXAMPLESDIR="share/examples/ruby27" RUBY_RIDIR="share/ri/2.7/system" RUBY_SITERIDIR="share/ri/2.7/site"  RUBY_VERSION="2.7.4"  RUBY_VER="2.7"  RUBY_SHLIBVER="27"  RUBY_ARCH="riscv64-freebsd14"  RUBY_SUFFIX="27"  RUBY_NAME="ruby27"  RUBY_DEFAULT_SUFFIX="27"  RUBY26="_at_comment "  RUBY27=""  RUBY30="_at_comment " PORTVERSION="2.1.0"  REV=""  GEMS_BASE_DIR="lib/ruby/gems/2.7"  GEMS_DIR="lib/ruby/gems/2.7/gems"  DOC_DIR="lib/ruby/gems/2.7/doc"  CACHE_DIR="lib/ruby/gems/2.7/cache"  SPEC_DIR="lib/ruby/gems/2.7/specifications"  EXT_DIR="lib/ruby/gems/2.7/extensions"  PORT="pg_que
 ry-2.1.0"  GEM_NAME="pg_query-2.1.0"  GEM_LIB_DIR="lib/ruby/gems/2.7/gems/pg_query-2.1.0"  GEM_DOC_DIR="lib/ruby/gems/2.7/doc/pg_query-2.1.0"  GEM_SPEC="lib/ruby/gems/2.7/specifications/pg_query-2.1.0.gemspec"  GEM_CACHE="lib/ruby/gems/2.7/cache/pg_query-2.1.0.gem"  EXTRACT_SUFX=".gem" OSREL=14.0 PREFIX=%D LOCALBASE=/usr/local  RESETPREFIX=/usr/local LIB32DIR=lib DOCSDIR="share/doc/pg_query"  EXAMPLESDIR="share/examples/pg_query"  DATADIR="share/pg_query"  WWWDIR="www/pg_query"  ETCDIR="etc/pg_query"
--End PLIST_SUB--

--SUB_LIST--
PREFIX=/usr/local LOCALBASE=/usr/local  DATADIR=/usr/local/share/pg_query DOCSDIR=/usr/local/share/doc/pg_query EXAMPLESDIR=/usr/local/share/examples/pg_query  WWWDIR=/usr/local/www/pg_query ETCDIR=/usr/local/etc/pg_query
--End SUB_LIST--

---Begin make.conf---
.sinclude "/etc/make.nxb.conf"
USE_PACKAGE_DEPENDS=yes
BATCH=yes
WRKDIRPREFIX=/wrkdirs
PORTSDIR=/usr/ports
PACKAGES=/packages
DISTDIR=/distfiles
PACKAGE_BUILDING=yes
PACKAGE_BUILDING_FLAVORS=yes
MACHINE=riscv
MACHINE_ARCH=riscv64
ARCH=${MACHINE_ARCH}
#### /usr/local/etc/poudriere.d/make.conf ####
# XXX: We really need this but cannot use it while 'make checksum' does not
# try the next mirror on checksum failure.  It currently retries the same
# failed mirror and then fails rather then trying another.  It *does*
# try the next if the size is mismatched though.
#MASTER_SITE_FREEBSD=yes
# Build ALLOW_MAKE_JOBS_PACKAGES with 2 jobs
MAKE_JOBS_NUMBER=2
#### /usr/ports/Mk/Scripts/ports_env.sh ####
_CCVERSION_9d218390=FreeBSD clang version 12.0.1 (git_at_github.com:llvm/llvm-project.git llvmorg-12.0.1-0-gfed41342a82f) Target: riscv64-unknown-freebsd14.0 Thread model: posix InstalledDir: /nxb-bin/usr/bin
_ALTCCVERSION_9d218390=none
_CXXINTERNAL_9c45a5b1=FreeBSD clang version 12.0.1 (git_at_github.com:llvm/llvm-project.git llvmorg-12.0.1-0-gfed41342a82f) Target: riscv64-unknown-freebsd14.0 Thread model: posix InstalledDir: /nxb-bin/usr/bin "/nxb-bin/usr/bin/ld" "--eh-frame-hdr" "-dynamic-linker" "/libexec/ld-elf.so.1" "--enable-new-dtags" "-m" "elf64lriscv" "-o" "a.out" "/usr/lib/crt1.o" "/usr/lib/crti.o" "/usr/lib/crtbegin.o" "-L/usr/lib" "/dev/null" "-lc++" "-lm" "-lgcc" "--as-needed" "-lgcc_s" "--no-as-needed" "-lc" "-lgcc" "--as-needed" "-lgcc_s" "--no-as-needed" "/usr/lib/crtend.o" "/usr/lib/crtn.o"
CC_OUTPUT_9d218390_58173849=yes
CC_OUTPUT_9d218390_9bdba57c=yes
CC_OUTPUT_9d218390_6a4fe7f5=yes
CC_OUTPUT_9d218390_6bcac02b=yes
CC_OUTPUT_9d218390_67d20829=yes
CC_OUTPUT_9d218390_bfa62e83=yes
CC_OUTPUT_9d218390_f0b4d593=yes
CC_OUTPUT_9d218390_308abb44=yes
CC_OUTPUT_9d218390_f00456e5=yes
CC_OUTPUT_9d218390_65ad290d=yes
CC_OUTPUT_9d218390_f2776b26=yes
CC_OUTPUT_9d218390_b2657cc3=yes
CC_OUTPUT_9d218390_380987f7=yes
CC_OUTPUT_9d218390_160933ec=yes
CC_OUTPUT_9d218390_fb62803b=yes
_OBJC_CCVERSION_9d218390=FreeBSD clang version 12.0.1 (git_at_github.com:llvm/llvm-project.git llvmorg-12.0.1-0-gfed41342a82f) Target: riscv64-unknown-freebsd14.0 Thread model: posix InstalledDir: /nxb-bin/usr/bin
_OBJC_ALTCCVERSION_9d218390=none
ARCH=riscv64
OPSYS=FreeBSD
_OSRELEASE=14.0-CURRENT
OSREL=14.0
OSVERSION=1400026
PYTHONBASE=/usr/local
CONFIGURE_MAX_CMD_LEN=524288
HAVE_PORTS_ENV=1
#### Misc Poudriere ####
GID=0
UID=0
DISABLE_MAKE_JOBS=poudriere
---End make.conf---
---Begin make.nxb.conf---
CC=/nxb-bin/usr/bin/cc
CPP=/nxb-bin/usr/bin/cpp
CXX=/nxb-bin/usr/bin/c++
NM=/nxb-bin/usr/bin/nm
LD=/nxb-bin/usr/bin/ld
OBJCOPY=/nxb-bin/usr/bin/objcopy
SIZE=/nxb-bin/usr/bin/size
STRIPBIN=/nxb-bin/usr/bin/strip
SED=/nxb-bin/usr/bin/sed
RANLIB=/nxb-bin/usr/bin/ranlib
YACC=/nxb-bin/usr/bin/yacc
MAKE=/nxb-bin/usr/bin/make
STRINGS=/nxb-bin/usr/bin/strings
AWK=/nxb-bin/usr/bin/awk
FLEX=/nxb-bin/usr/bin/flex
---End make.nxb.conf---
--Resource limits--
cpu time               (seconds, -t)  unlimited
file size           (512-blocks, -f)  unlimited
data seg size           (kbytes, -d)  33554432
stack size              (kbytes, -s)  524288
core file size      (512-blocks, -c)  unlimited
max memory size         (kbytes, -m)  unlimited
locked memory           (kbytes, -l)  unlimited
max user processes              (-u)  89999
open files                      (-n)  1024
virtual mem size        (kbytes, -v)  unlimited
swap limit              (kbytes, -w)  unlimited
socket buffer size       (bytes, -b)  unlimited
pseudo-terminals                (-p)  unlimited
kqueues                         (-k)  unlimited
umtx shared locks               (-o)  unlimited
--End resource limits--
=======================<phase: check-sanity   >============================
===>  License BSD3CLAUSE accepted by the user
===========================================================================
=======================<phase: pkg-depends    >============================
===>   rubygem-pg_query-2.1.0 depends on file: /usr/local/sbin/pkg - not found
===>   Installing existing package /packages/All/pkg-1.17.1.pkg
[main-riscv64-default-job-03] Installing pkg-1.17.1...
[main-riscv64-default-job-03] Extracting pkg-1.17.1: .......... done
===>   rubygem-pg_query-2.1.0 depends on file: /usr/local/sbin/pkg - found
===>   Returning to build of rubygem-pg_query-2.1.0
===========================================================================
=======================<phase: fetch-depends  >============================
===========================================================================
=======================<phase: fetch          >============================
===>  License BSD3CLAUSE accepted by the user
===> Fetching all distfiles required by rubygem-pg_query-2.1.0 for building
===========================================================================
=======================<phase: checksum       >============================
===>  License BSD3CLAUSE accepted by the user
===> Fetching all distfiles required by rubygem-pg_query-2.1.0 for building
=> SHA256 Checksum OK for rubygem/pg_query-2.1.0.gem.
===========================================================================
=======================<phase: extract-depends>============================
===>   rubygem-pg_query-2.1.0 depends on file: /usr/local/bin/ruby27 - not found
===>   Installing existing package /packages/All/ruby-2.7.4,1.pkg
[main-riscv64-default-job-03] Installing ruby-2.7.4,1...
[main-riscv64-default-job-03] `-- Installing libedit-3.1.20210216,1...
[main-riscv64-default-job-03] `-- Extracting libedit-3.1.20210216,1: .......... done
[main-riscv64-default-job-03] `-- Installing libffi-3.3_1...
[main-riscv64-default-job-03] |   `-- Installing indexinfo-0.3.1...
[main-riscv64-default-job-03] |   `-- Extracting indexinfo-0.3.1: .... done
[main-riscv64-default-job-03] `-- Extracting libffi-3.3_1: .......... done
[main-riscv64-default-job-03] `-- Installing libyaml-0.2.5...
[main-riscv64-default-job-03] `-- Extracting libyaml-0.2.5: ......... done
[main-riscv64-default-job-03] Extracting ruby-2.7.4,1: .......... done
=====
Message from ruby-2.7.4,1:

--
Some of the standard commands are provided as separate ports for ease
of upgrading:

	devel/ruby-gems:		gem - RubyGems package manager
	devel/rubygem-irb:		irb - Interactive Ruby
	devel/rubygem-rake:		rake - Ruby Make
	devel/rubygem-rdoc:		rdoc - Ruby Documentation System
	sysutils/rubygem-bundler:	bundler - Tool that manages gem dependencies for ruby applications

And some of the standard libraries are provided as separate ports
since they require extra dependencies:

	databases/rubygem-dbm:	DBM module
	databases/rubygem-gdbm:	GDBM module

Install them as occasion demands.
===>   rubygem-pg_query-2.1.0 depends on file: /usr/local/bin/ruby27 - found
===>   Returning to build of rubygem-pg_query-2.1.0
===>   rubygem-pg_query-2.1.0 depends on file: /usr/local/bin/gem27 - not found
===>   Installing existing package /packages/All/ruby27-gems-3.0.8.pkg
[main-riscv64-default-job-03] Installing ruby27-gems-3.0.8...
[main-riscv64-default-job-03] Extracting ruby27-gems-3.0.8: .......... done
===>   rubygem-pg_query-2.1.0 depends on file: /usr/local/bin/gem27 - found
===>   Returning to build of rubygem-pg_query-2.1.0
===========================================================================
=======================<phase: extract        >============================
===>  License BSD3CLAUSE accepted by the user
===> Fetching all distfiles required by rubygem-pg_query-2.1.0 for building
===>  Extracting for rubygem-pg_query-2.1.0
=> SHA256 Checksum OK for rubygem/pg_query-2.1.0.gem.
/usr/local/lib/ruby/site_ruby/2.7/rubygems/package.rb:509: warning: Using the last argument as keyword parameters is deprecated
Unpacked gem: '/wrkdirs/usr/ports/databases/rubygem-pg_query/work/pg_query-2.1.0'
/usr/local/lib/ruby/site_ruby/2.7/rubygems/package.rb:509: warning: Using the last argument as keyword parameters is deprecated
===========================================================================
=======================<phase: patch-depends  >============================
===>   rubygem-pg_query-2.1.0 depends on file: /usr/local/bin/ruby27 - found
===========================================================================
=======================<phase: patch          >============================
===>  Patching for rubygem-pg_query-2.1.0
===>  Applying FreeBSD patches for rubygem-pg_query-2.1.0 from /usr/ports/databases/rubygem-pg_query/files
===========================================================================
=======================<phase: build-depends  >============================
===>   rubygem-pg_query-2.1.0 depends on package: rubygem-pathname>0 - not found
===>   Installing existing package /packages/All/rubygem-pathname-0.1.0.pkg
[main-riscv64-default-job-03] Installing rubygem-pathname-0.1.0...
[main-riscv64-default-job-03] Extracting rubygem-pathname-0.1.0: .......... done
===>   rubygem-pg_query-2.1.0 depends on package: rubygem-pathname>0 - found
===>   Returning to build of rubygem-pg_query-2.1.0
===>   rubygem-pg_query-2.1.0 depends on file: /usr/local/bin/ruby27 - found
===>   rubygem-pg_query-2.1.0 depends on file: /usr/local/bin/gem27 - found
===========================================================================
=======================<phase: lib-depends    >============================
===========================================================================
=======================<phase: configure      >============================
===>  Configuring for rubygem-pg_query-2.1.0
===========================================================================
=======================<phase: build          >============================
===>  Building for rubygem-pg_query-2.1.0
  Successfully built RubyGem
  Name: pg_query
  Version: 2.1.0
  File: pg_query-2.1.0.gem
===========================================================================
=======================<phase: run-depends    >============================
===>   rubygem-pg_query-2.1.0 depends on package: rubygem-google-protobuf>=3.17.1 - not found
===>   Installing existing package /packages/All/rubygem-google-protobuf-3.17.3.pkg
[main-riscv64-default-job-03] Installing rubygem-google-protobuf-3.17.3...
[main-riscv64-default-job-03] Extracting rubygem-google-protobuf-3.17.3: .......... done
===>   rubygem-pg_query-2.1.0 depends on package: rubygem-google-protobuf>=3.17.1 - found
===>   Returning to build of rubygem-pg_query-2.1.0
===>   rubygem-pg_query-2.1.0 depends on file: /usr/local/bin/ruby27 - found
===>   rubygem-pg_query-2.1.0 depends on file: /usr/local/bin/gem27 - found
===========================================================================
=======================<phase: stage          >============================
===>  Staging for rubygem-pg_query-2.1.0
===>   Generating temporary packing list
(cd /wrkdirs/usr/ports/databases/rubygem-pg_query/work/pg_query-2.1.0; /usr/bin/env RB_USER_INSTALL=yes LANG=en_US.UTF-8 LC_ALL=en_US.UTF-8 /usr/local/bin/gem27 install -l --no-update-sources --install-dir /wrkdirs/usr/ports/databases/rubygem-pg_query/work/stage/usr/local/lib/ruby/gems/2.7 --ignore-dependencies --bindir=/wrkdirs/usr/ports/databases/rubygem-pg_query/work/stage/usr/local/bin --no-document pg_query-2.1.0.gem -- )
/usr/local/lib/ruby/site_ruby/2.7/rubygems/package.rb:509: warning: Using the last argument as keyword parameters is deprecated
/usr/local/lib/ruby/site_ruby/2.7/rubygems/package.rb:509: warning: Using the last argument as keyword parameters is deprecated
Building native extensions. This could take a while...
ERROR:  Error installing pg_query-2.1.0.gem:
	ERROR: Failed to build gem native extension.

    current directory: /wrkdirs/usr/ports/databases/rubygem-pg_query/work/stage/usr/local/lib/ruby/gems/2.7/gems/pg_query-2.1.0/ext/pg_query
/usr/local/bin/ruby27 -I /usr/local/lib/ruby/site_ruby/2.7 -r ./siteconf20210729-47372-1pto96g.rb extconf.rb
creating Makefile

current directory: /wrkdirs/usr/ports/databases/rubygem-pg_query/work/stage/usr/local/lib/ruby/gems/2.7/gems/pg_query-2.1.0/ext/pg_query
make "DESTDIR=" clean

current directory: /wrkdirs/usr/ports/databases/rubygem-pg_query/work/stage/usr/local/lib/ruby/gems/2.7/gems/pg_query-2.1.0/ext/pg_query
make "DESTDIR="
compiling /wrkdirs/usr/ports/databases/rubygem-pg_query/work/stage/usr/local/lib/ruby/gems/2.7/gems/pg_query-2.1.0/ext/pg_query/src_port_pg_bitutils.c
compiling /wrkdirs/usr/ports/databases/rubygem-pg_query/work/stage/usr/local/lib/ruby/gems/2.7/gems/pg_query-2.1.0/ext/pg_query/src_port_random.c
compiling /wrkdirs/usr/ports/databases/rubygem-pg_query/work/stage/usr/local/lib/ruby/gems/2.7/gems/pg_query-2.1.0/ext/pg_query/pg_query_fingerprint.c
compiling /wrkdirs/usr/ports/databases/rubygem-pg_query/work/stage/usr/local/lib/ruby/gems/2.7/gems/pg_query-2.1.0/ext/pg_query/src_common_psprintf.c
compiling /wrkdirs/usr/ports/databases/rubygem-pg_query/work/stage/usr/local/lib/ruby/gems/2.7/gems/pg_query-2.1.0/ext/pg_query/src_port_snprintf.c
compiling /wrkdirs/usr/ports/databases/rubygem-pg_query/work/stage/usr/local/lib/ruby/gems/2.7/gems/pg_query-2.1.0/ext/pg_query/src_backend_nodes_makefuncs.c
In file included from /wrkdirs/usr/ports/databases/rubygem-pg_query/work/stage/usr/local/lib/ruby/gems/2.7/gems/pg_query-2.1.0/ext/pg_query/src_backend_nodes_makefuncs.c:37:
In file included from /wrkdirs/usr/ports/databases/rubygem-pg_query/work/stage/usr/local/lib/ruby/gems/2.7/gems/pg_query-2.1.0/ext/pg_query/include/nodes/makefuncs.h:17:
In file included from /wrkdirs/usr/ports/databases/rubygem-pg_query/work/stage/usr/local/lib/ruby/gems/2.7/gems/pg_query-2.1.0/ext/pg_query/include/nodes/execnodes.h:25:
In file included from /wrkdirs/usr/ports/databases/rubygem-pg_query/work/stage/usr/local/lib/ruby/gems/2.7/gems/pg_query-2.1.0/ext/pg_query/include/storage/condition_variable.h:26:
/wrkdirs/usr/ports/databases/rubygem-pg_query/work/stage/usr/local/lib/ruby/gems/2.7/gems/pg_query-2.1.0/ext/pg_query/include/storage/s_lock.h:922:2: error: PostgreSQL does not have native spinlock support on this platform.  To continue the compilation, rerun configure using --disable-spinlocks.  However, performance will be poor.  Please report this to pgsql-bugs_at_lists.postgresql.org.
#error PostgreSQL does not have native spinlock support on this platform.  To continue the compilation, rerun configure using --disable-spinlocks.  However, performance will be poor.  Please report this to pgsql-bugs_at_lists.postgresql.org.
 ^
/wrkdirs/usr/ports/databases/rubygem-pg_query/work/stage/usr/local/lib/ruby/gems/2.7/gems/pg_query-2.1.0/ext/pg_query/include/storage/s_lock.h:994:25: error: unknown type name 'slock_t'; did you mean 'clock_t'?
extern int      tas(volatile slock_t *lock);            /* in port/.../tas.s, or
                             ^~~~~~~
                             clock_t
/usr/include/sys/types.h:94:19: note: 'clock_t' declared here
typedef __clock_t       clock_t;
                        ^
In file included from /wrkdirs/usr/ports/databases/rubygem-pg_query/work/stage/usr/local/lib/ruby/gems/2.7/gems/pg_query-2.1.0/ext/pg_query/src_backend_nodes_makefuncs.c:37:
In file included from /wrkdirs/usr/ports/databases/rubygem-pg_query/work/stage/usr/local/lib/ruby/gems/2.7/gems/pg_query-2.1.0/ext/pg_query/include/nodes/makefuncs.h:17:
In file included from /wrkdirs/usr/ports/databases/rubygem-pg_query/work/stage/usr/local/lib/ruby/gems/2.7/gems/pg_query-2.1.0/ext/pg_query/include/nodes/execnodes.h:25:
In file included from /wrkdirs/usr/ports/databases/rubygem-pg_query/work/stage/usr/local/lib/ruby/gems/2.7/gems/pg_query-2.1.0/ext/pg_query/include/storage/condition_variable.h:26:
/wrkdirs/usr/ports/databases/rubygem-pg_query/work/stage/usr/local/lib/ruby/gems/2.7/gems/pg_query-2.1.0/ext/pg_query/include/storage/s_lock.h:1004:8: error: unknown type name 'slock_t'; did you mean 'clock_t'?
extern slock_t dummy_spinlock;
       ^~~~~~~
       clock_t
/usr/include/sys/types.h:94:19: note: 'clock_t' declared here
typedef __clock_t       clock_t;
                        ^
In file included from /wrkdirs/usr/ports/databases/rubygem-pg_query/work/stage/usr/local/lib/ruby/gems/2.7/gems/pg_query-2.1.0/ext/pg_query/src_backend_nodes_makefuncs.c:37:
In file included from /wrkdirs/usr/ports/databases/rubygem-pg_query/work/stage/usr/local/lib/ruby/gems/2.7/gems/pg_query-2.1.0/ext/pg_query/include/nodes/makefuncs.h:17:
In file included from /wrkdirs/usr/ports/databases/rubygem-pg_query/work/stage/usr/local/lib/ruby/gems/2.7/gems/pg_query-2.1.0/ext/pg_query/include/nodes/execnodes.h:25:
In file included from /wrkdirs/usr/ports/databases/rubygem-pg_query/work/stage/usr/local/lib/ruby/gems/2.7/gems/pg_query-2.1.0/ext/pg_query/include/storage/condition_variable.h:26:
/wrkdirs/usr/ports/databases/rubygem-pg_query/work/stage/usr/local/lib/ruby/gems/2.7/gems/pg_query-2.1.0/ext/pg_query/include/storage/s_lock.h:1009:28: error: unknown type name 'slock_t'; did you mean 'clock_t'?
extern int s_lock(volatile slock_t *lock, const char *file, int line, const char *func);
                           ^~~~~~~
                           clock_t
/usr/include/sys/types.h:94:19: note: 'clock_t' declared here
typedef __clock_t       clock_t;
                        ^
In file included from /wrkdirs/usr/ports/databases/rubygem-pg_query/work/stage/usr/local/lib/ruby/gems/2.7/gems/pg_query-2.1.0/ext/pg_query/src_backend_nodes_makefuncs.c:37:
In file included from /wrkdirs/usr/ports/databases/rubygem-pg_query/work/stage/usr/local/lib/ruby/gems/2.7/gems/pg_query-2.1.0/ext/pg_query/include/nodes/makefuncs.h:17:
In file included from /wrkdirs/usr/ports/databases/rubygem-pg_query/work/stage/usr/local/lib/ruby/gems/2.7/gems/pg_query-2.1.0/ext/pg_query/include/nodes/execnodes.h:25:
/wrkdirs/usr/ports/databases/rubygem-pg_query/work/stage/usr/local/lib/ruby/gems/2.7/gems/pg_query-2.1.0/ext/pg_query/include/storage/condition_variable.h:30:2: error: unknown type name 'slock_t'; did you mean 'clock_t'?
        slock_t         mutex;                  /* spinlock protecting the wakeup list */
        ^~~~~~~
        clock_t
/usr/include/sys/types.h:94:19: note: 'clock_t' declared here
typedef __clock_t       clock_t;
                        ^
In file included from /wrkdirs/usr/ports/databases/rubygem-pg_query/work/stage/usr/local/lib/ruby/gems/2.7/gems/pg_query-2.1.0/ext/pg_query/src_backend_nodes_makefuncs.c:37:
In file included from /wrkdirs/usr/ports/databases/rubygem-pg_query/work/stage/usr/local/lib/ruby/gems/2.7/gems/pg_query-2.1.0/ext/pg_query/include/nodes/makefuncs.h:17:
In file included from /wrkdirs/usr/ports/databases/rubygem-pg_query/work/stage/usr/local/lib/ruby/gems/2.7/gems/pg_query-2.1.0/ext/pg_query/include/nodes/execnodes.h:29:
In file included from /wrkdirs/usr/ports/databases/rubygem-pg_query/work/stage/usr/local/lib/ruby/gems/2.7/gems/pg_query-2.1.0/ext/pg_query/include/utils/sharedtuplestore.h:18:
/wrkdirs/usr/ports/databases/rubygem-pg_query/work/stage/usr/local/lib/ruby/gems/2.7/gems/pg_query-2.1.0/ext/pg_query/include/storage/sharedfileset.h:29:2: error: unknown type name 'slock_t'; did you mean 'clock_t'?
        slock_t         mutex;                  /* mutex protecting the reference count */
        ^~~~~~~
        clock_t
/usr/include/sys/types.h:94:19: note: 'clock_t' declared here
typedef __clock_t       clock_t;
                        ^
In file included from /wrkdirs/usr/ports/databases/rubygem-pg_query/work/stage/usr/local/lib/ruby/gems/2.7/gems/pg_query-2.1.0/ext/pg_query/src_backend_nodes_makefuncs.c:37:
In file included from /wrkdirs/usr/ports/databases/rubygem-pg_query/work/stage/usr/local/lib/ruby/gems/2.7/gems/pg_query-2.1.0/ext/pg_query/include/nodes/makefuncs.h:17:
/wrkdirs/usr/ports/databases/rubygem-pg_query/work/stage/usr/local/lib/ruby/gems/2.7/gems/pg_query-2.1.0/ext/pg_query/include/nodes/execnodes.h:1561:2: error: unknown type name 'slock_t'; did you mean 'clock_t'?
        slock_t         mutex;
        ^~~~~~~
        clock_t
/usr/include/sys/types.h:94:19: note: 'clock_t' declared here
typedef __clock_t       clock_t;
                        ^
7 errors generated.
*** Error code 1

Stop.
make[1]: stopped in /wrkdirs/usr/ports/databases/rubygem-pg_query/work/stage/usr/local/lib/ruby/gems/2.7/gems/pg_query-2.1.0/ext/pg_query

make failed, exit code 1

Gem files will remain installed in /wrkdirs/usr/ports/databases/rubygem-pg_query/work/stage/usr/local/lib/ruby/gems/2.7/gems/pg_query-2.1.0 for inspection.
Results logged to /wrkdirs/usr/ports/databases/rubygem-pg_query/work/stage/usr/local/lib/ruby/gems/2.7/extensions/riscv64-freebsd-14/2.7/pg_query-2.1.0/gem_make.out
*** Error code 1

Stop.
make: stopped in /usr/ports/databases/rubygem-pg_query
Received on Thu Jul 29 2021 - 14:01:07 UTC

Original text of this message