[package - 114amd64-default][sysutils/ddpt] Failed for ddpt-0.97 in build

From: <pkg-fallout_at_FreeBSD.org>
Date: Thu, 29 Jul 2021 11:41:15 GMT
You are receiving this mail as a port that you maintain
is failing to build on the FreeBSD package build server.
Please investigate the failure and submit a PR to fix
build.

Maintainer:     delphij_at_FreeBSD.org
Log URL:        http://beefy9.nyi.freebsd.org/data/114amd64-default/d69639d824b8/logs/ddpt-0.97.log
Build URL:      http://beefy9.nyi.freebsd.org/build.html?mastername=114amd64-default&build=d69639d824b8
Log:

=>> Building sysutils/ddpt
build started at Thu Jul 29 11:41:04 UTC 2021
port directory: /usr/ports/sysutils/ddpt
package name: ddpt-0.97
building for: FreeBSD 114amd64-default-job-07 11.4-RELEASE-p12 FreeBSD 11.4-RELEASE-p12 amd64
maintained by: delphij_at_FreeBSD.org
Makefile ident: 
Poudriere version: 3.2.8-20-g137a4a48
Host OSVERSION: 1400008
Jail OSVERSION: 1104001
Job Id: 07

---Begin Environment---
SHELL=/bin/csh
OSVERSION=1104001
UNAME_v=FreeBSD 11.4-RELEASE-p12
UNAME_r=11.4-RELEASE-p12
BLOCKSIZE=K
MAIL=/var/mail/root
STATUS=1
HOME=/root
PATH=/sbin:/bin:/usr/sbin:/usr/bin:/usr/local/sbin:/usr/local/bin:/root/bin
LOCALBASE=/usr/local
USER=root
LIBEXECPREFIX=/usr/local/libexec/poudriere
POUDRIERE_VERSION=3.2.8-20-g137a4a48
MASTERMNT=/usr/local/poudriere/data/.m/114amd64-default/ref
POUDRIERE_BUILD_TYPE=bulk
PACKAGE_BUILDING=yes
SAVED_TERM=
PWD=/usr/local/poudriere/data/.m/114amd64-default/ref/.p/pool
P_PORTS_FEATURES=FLAVORS SELECTED_OPTIONS
MASTERNAME=114amd64-default
SCRIPTPREFIX=/usr/local/share/poudriere
OLDPWD=/usr/local/poudriere/data/.m/114amd64-default/ref/.p
SCRIPTPATH=/usr/local/share/poudriere/bulk.sh
POUDRIEREPATH=/usr/local/bin/poudriere
---End Environment---

---Begin Poudriere Port Flags/Env---
PORT_FLAGS=
PKGENV=
FLAVOR=
DEPENDS_ARGS=
MAKE_ARGS=
---End Poudriere Port Flags/Env---

---Begin OPTIONS List---
---End OPTIONS List---

--MAINTAINER--
delphij_at_FreeBSD.org
--End MAINTAINER--

--CONFIGURE_ARGS--
--prefix=/usr/local ${_LATE_CONFIGURE_ARGS}
--End CONFIGURE_ARGS--

--CONFIGURE_ENV--
MAKE=gmake XDG_DATA_HOME=/wrkdirs/usr/ports/sysutils/ddpt/work  XDG_CONFIG_HOME=/wrkdirs/usr/ports/sysutils/ddpt/work  HOME=/wrkdirs/usr/ports/sysutils/ddpt/work TMPDIR="/tmp" PATH=/wrkdirs/usr/ports/sysutils/ddpt/work/.bin:/sbin:/bin:/usr/sbin:/usr/bin:/usr/local/sbin:/usr/local/bin:/root/bin SHELL=/bin/sh CONFIG_SHELL=/bin/sh CONFIG_SITE=/usr/ports/Templates/config.site lt_cv_sys_max_cmd_len=524288
--End CONFIGURE_ENV--

--MAKE_ENV--
XDG_DATA_HOME=/wrkdirs/usr/ports/sysutils/ddpt/work  XDG_CONFIG_HOME=/wrkdirs/usr/ports/sysutils/ddpt/work  HOME=/wrkdirs/usr/ports/sysutils/ddpt/work TMPDIR="/tmp" PATH=/wrkdirs/usr/ports/sysutils/ddpt/work/.bin:/sbin:/bin:/usr/sbin:/usr/bin:/usr/local/sbin:/usr/local/bin:/root/bin NO_PIE=yes MK_DEBUG_FILES=no MK_KERNEL_SYMBOLS=no SHELL=/bin/sh NO_LINT=YES PREFIX=/usr/local  LOCALBASE=/usr/local  CC="cc" CFLAGS="-O2 -pipe  -fstack-protector-strong -fno-strict-aliasing "  CPP="cpp" CPPFLAGS=""  LDFLAGS=" -fstack-protector-strong " LIBS=""  CXX="c++" CXXFLAGS="-O2 -pipe -fstack-protector-strong -fno-strict-aliasing  "  MANPREFIX="/usr/local" BSD_INSTALL_PROGRAM="install  -s -m 555"  BSD_INSTALL_LIB="install  -s -m 0644"  BSD_INSTALL_SCRIPT="install  -m 555"  BSD_INSTALL_DATA="install  -m 0644"  BSD_INSTALL_MAN="install  -m 444"
--End MAKE_ENV--

--PLIST_SUB--
OSREL=11.4 PREFIX=%D LOCALBASE=/usr/local  RESETPREFIX=/usr/local LIB32DIR=lib DOCSDIR="share/doc/ddpt"  EXAMPLESDIR="share/examples/ddpt"  DATADIR="share/ddpt"  WWWDIR="www/ddpt"  ETCDIR="etc/ddpt"
--End PLIST_SUB--

--SUB_LIST--
PREFIX=/usr/local LOCALBASE=/usr/local  DATADIR=/usr/local/share/ddpt DOCSDIR=/usr/local/share/doc/ddpt EXAMPLESDIR=/usr/local/share/examples/ddpt  WWWDIR=/usr/local/www/ddpt ETCDIR=/usr/local/etc/ddpt
--End SUB_LIST--

---Begin make.conf---
USE_PACKAGE_DEPENDS=yes
BATCH=yes
WRKDIRPREFIX=/wrkdirs
PORTSDIR=/usr/ports
PACKAGES=/packages
DISTDIR=/distfiles
PACKAGE_BUILDING=yes
PACKAGE_BUILDING_FLAVORS=yes
#### /usr/local/etc/poudriere.d/make.conf ####
# XXX: We really need this but cannot use it while 'make checksum' does not
# try the next mirror on checksum failure.  It currently retries the same
# failed mirror and then fails rather then trying another.  It *does*
# try the next if the size is mismatched though.
#MASTER_SITE_FREEBSD=yes
# Build ALLOW_MAKE_JOBS_PACKAGES with 2 jobs
MAKE_JOBS_NUMBER=2
#### /usr/ports/Mk/Scripts/ports_env.sh ####
_CCVERSION_921dbbb2=FreeBSD clang version 10.0.0 (git_at_github.com:llvm/llvm-project.git llvmorg-10.0.0-0-gd32170dbd5b) Target: x86_64-unknown-freebsd11.4 Thread model: posix InstalledDir: /usr/bin
_ALTCCVERSION_921dbbb2=none
_CXXINTERNAL_acaad9ca=FreeBSD clang version 10.0.0 (git_at_github.com:llvm/llvm-project.git llvmorg-10.0.0-0-gd32170dbd5b) Target: x86_64-unknown-freebsd11.4 Thread model: posix InstalledDir: /usr/bin "/usr/bin/ld" "--eh-frame-hdr" "-dynamic-linker" "/libexec/ld-elf.so.1" "--hash-style=both" "--enable-new-dtags" "-o" "a.out" "/usr/lib/crt1.o" "/usr/lib/crti.o" "/usr/lib/crtbegin.o" "-L/usr/lib" "/dev/null" "-lc++" "-lm" "-lgcc" "--as-needed" "-lgcc_s" "--no-as-needed" "-lc" "-lgcc" "--as-needed" "-lgcc_s" "--no-as-needed" "/usr/lib/crtend.o" "/usr/lib/crtn.o"
CC_OUTPUT_921dbbb2_58173849=yes
CC_OUTPUT_921dbbb2_9bdba57c=yes
CC_OUTPUT_921dbbb2_6a4fe7f5=yes
CC_OUTPUT_921dbbb2_6bcac02b=yes
CC_OUTPUT_921dbbb2_67d20829=yes
CC_OUTPUT_921dbbb2_bfa62e83=yes
CC_OUTPUT_921dbbb2_f0b4d593=yes
CC_OUTPUT_921dbbb2_308abb44=yes
CC_OUTPUT_921dbbb2_f00456e5=yes
CC_OUTPUT_921dbbb2_65ad290d=yes
CC_OUTPUT_921dbbb2_f2776b26=yes
CC_OUTPUT_921dbbb2_b2657cc3=yes
CC_OUTPUT_921dbbb2_380987f7=yes
CC_OUTPUT_921dbbb2_160933ec=yes
CC_OUTPUT_921dbbb2_fb62803b=yes
_OBJC_CCVERSION_921dbbb2=FreeBSD clang version 10.0.0 (git_at_github.com:llvm/llvm-project.git llvmorg-10.0.0-0-gd32170dbd5b) Target: x86_64-unknown-freebsd11.4 Thread model: posix InstalledDir: /usr/bin
_OBJC_ALTCCVERSION_921dbbb2=none
ARCH=amd64
OPSYS=FreeBSD
_OSRELEASE=11.4-RELEASE-p12
OSREL=11.4
OSVERSION=1104001
PYTHONBASE=/usr/local
HAVE_COMPAT_IA32_KERN=YES
CONFIGURE_MAX_CMD_LEN=524288
HAVE_PORTS_ENV=1
#### Misc Poudriere ####
GID=0
UID=0
DISABLE_MAKE_JOBS=poudriere
---End make.conf---
--Resource limits--
cpu time               (seconds, -t)  unlimited
file size           (512-blocks, -f)  unlimited
data seg size           (kbytes, -d)  33554432
stack size              (kbytes, -s)  524288
core file size      (512-blocks, -c)  unlimited
max memory size         (kbytes, -m)  unlimited
locked memory           (kbytes, -l)  unlimited
max user processes              (-u)  89999
open files                      (-n)  1024
virtual mem size        (kbytes, -v)  unlimited
swap limit              (kbytes, -w)  unlimited
socket buffer size       (bytes, -b)  unlimited
pseudo-terminals                (-p)  unlimited
kqueues                         (-k)  unlimited
umtx shared locks               (-o)  unlimited
--End resource limits--
=======================<phase: check-sanity   >============================
===>  License BSD3CLAUSE accepted by the user
===========================================================================
=======================<phase: pkg-depends    >============================
===>   ddpt-0.97 depends on file: /usr/local/sbin/pkg - not found
===>   Installing existing package /packages/All/pkg-1.17.1.pkg
[114amd64-default-job-07] Installing pkg-1.17.1...
[114amd64-default-job-07] Extracting pkg-1.17.1: .......... done
===>   ddpt-0.97 depends on file: /usr/local/sbin/pkg - found
===>   Returning to build of ddpt-0.97
===========================================================================
=======================<phase: fetch-depends  >============================
===========================================================================
=======================<phase: fetch          >============================
===>  License BSD3CLAUSE accepted by the user
===> Fetching all distfiles required by ddpt-0.97 for building
===========================================================================
=======================<phase: checksum       >============================
===>  License BSD3CLAUSE accepted by the user
===> Fetching all distfiles required by ddpt-0.97 for building
=> SHA256 Checksum OK for ddpt-0.97.tgz.
===========================================================================
=======================<phase: extract-depends>============================
===========================================================================
=======================<phase: extract        >============================
===>  License BSD3CLAUSE accepted by the user
===> Fetching all distfiles required by ddpt-0.97 for building
===>  Extracting for ddpt-0.97
=> SHA256 Checksum OK for ddpt-0.97.tgz.
===========================================================================
=======================<phase: patch-depends  >============================
===========================================================================
=======================<phase: patch          >============================
===>  Patching for ddpt-0.97
===========================================================================
=======================<phase: build-depends  >============================
===>   ddpt-0.97 depends on package: gmake>=4.3 - not found
===>   Installing existing package /packages/All/gmake-4.3_2.pkg
[114amd64-default-job-07] Installing gmake-4.3_2...
[114amd64-default-job-07] `-- Installing gettext-runtime-0.21...
[114amd64-default-job-07] |   `-- Installing indexinfo-0.3.1...
[114amd64-default-job-07] |   `-- Extracting indexinfo-0.3.1: .... done
[114amd64-default-job-07] `-- Extracting gettext-runtime-0.21: .......... done
[114amd64-default-job-07] Extracting gmake-4.3_2: .......... done
===>   ddpt-0.97 depends on package: gmake>=4.3 - found
===>   Returning to build of ddpt-0.97
===========================================================================
=======================<phase: lib-depends    >============================
===========================================================================
=======================<phase: configure      >============================
===>  Configuring for ddpt-0.97
configure: loading site script /usr/ports/Templates/config.site
checking for a BSD-compatible install... /usr/bin/install -c
checking whether build environment is sane... yes
checking for a race-free mkdir -p... (cached) /bin/mkdir -p
checking for gawk... (cached) /usr/bin/awk
checking whether gmake sets $(MAKE)... yes
checking whether gmake supports nested variables... yes
checking whether to enable maintainer-specific portions of Makefiles... no
checking for gcc... cc
checking whether the C compiler works... yes
checking for C compiler default output file name... a.out
checking for suffix of executables... 
checking whether we are cross compiling... no
checking for suffix of object files... o
checking whether the compiler supports GNU C... yes
checking whether cc accepts -g... yes
checking for cc option to enable C11 features... none needed
checking whether cc understands -c and -o together... yes
checking whether gmake supports the include directive... yes (GNU style)
checking dependency style of cc... gcc3
checking whether the compiler supports GNU C++... yes
checking whether c++ accepts -g... yes
checking for c++ option to enable C++11 features... none needed
checking dependency style of c++... gcc3
checking for ar... ar
checking the archiver (ar) interface... ar
checking for stdio.h... (cached) yes
checking for stdlib.h... (cached) yes
checking for string.h... (cached) yes
checking for inttypes.h... (cached) yes
checking for stdint.h... (cached) yes
checking for strings.h... (cached) yes
checking for sys/stat.h... (cached) yes
checking for sys/types.h... (cached) yes
checking for unistd.h... (cached) yes
checking for grep that handles long lines and -e... (cached) /usr/bin/grep
checking for egrep... (cached) /usr/bin/egrep
checking for byteswap.h... (cached) no
checking for posix_fadvise... yes
checking for fsync... (cached) yes
checking for fdatasync... yes
checking for clock_gettime in -lrt... yes
checking for clock_gettime... (cached) yes
checking for gettimeofday... (cached) yes
checking for nanosleep... yes
checking for siginterrupt... (cached) yes
checking for fallocate... no
checking for posix_fallocate... yes
checking for posix_memalign... yes
checking for sysconf... (cached) yes
checking build system type... amd64-portbld-freebsd11.4
checking host system type... amd64-portbld-freebsd11.4
checking for sg_ll_inquiry in -lsgutils2... no
checking that generated files are newer than configure... done
configure: creating ./config.status
config.status: creating Makefile
config.status: creating src/Makefile
config.status: creating doc/Makefile
config.status: creating config.h
config.status: executing depfiles commands
===========================================================================
=======================<phase: build          >============================
===>  Building for ddpt-0.97
gmake[1]: Entering directory '/wrkdirs/usr/ports/sysutils/ddpt/work/ddpt-0.97'
gmake  all-recursive
gmake[2]: Entering directory '/wrkdirs/usr/ports/sysutils/ddpt/work/ddpt-0.97'
Making all in src
gmake[3]: Entering directory '/wrkdirs/usr/ports/sysutils/ddpt/work/ddpt-0.97/src'
cc -DHAVE_CONFIG_H -I. -I.. -I../include -iquote ../include -D_LARGEFILE64_SOURCE -D_FILE_OFFSET_BITS=64   -Wall -W  -O2 -pipe  -fstack-protector-strong -fno-strict-aliasing  -MT ddpt.o -MD -MP -MF .deps/ddpt.Tpo -c -o ddpt.o ddpt.c
mv -f .deps/ddpt.Tpo .deps/ddpt.Po
cc -DHAVE_CONFIG_H -I. -I.. -I../include -iquote ../include -D_LARGEFILE64_SOURCE -D_FILE_OFFSET_BITS=64   -Wall -W  -O2 -pipe  -fstack-protector-strong -fno-strict-aliasing  -MT ddpt_cl.o -MD -MP -MF .deps/ddpt_cl.Tpo -c -o ddpt_cl.o ddpt_cl.c
mv -f .deps/ddpt_cl.Tpo .deps/ddpt_cl.Po
cc -DHAVE_CONFIG_H -I. -I.. -I../include -iquote ../include -D_LARGEFILE64_SOURCE -D_FILE_OFFSET_BITS=64   -Wall -W  -O2 -pipe  -fstack-protector-strong -fno-strict-aliasing  -MT ddpt_com.o -MD -MP -MF .deps/ddpt_com.Tpo -c -o ddpt_com.o ddpt_com.c
mv -f .deps/ddpt_com.Tpo .deps/ddpt_com.Po
cc -DHAVE_CONFIG_H -I. -I.. -I../include -iquote ../include -D_LARGEFILE64_SOURCE -D_FILE_OFFSET_BITS=64   -Wall -W  -O2 -pipe  -fstack-protector-strong -fno-strict-aliasing  -MT ddpt_pt.o -MD -MP -MF .deps/ddpt_pt.Tpo -c -o ddpt_pt.o ddpt_pt.c
mv -f .deps/ddpt_pt.Tpo .deps/ddpt_pt.Po
cc -DHAVE_CONFIG_H -I. -I.. -I../include -iquote ../include -D_LARGEFILE64_SOURCE -D_FILE_OFFSET_BITS=64   -Wall -W  -O2 -pipe  -fstack-protector-strong -fno-strict-aliasing  -MT ddpt_xcopy.o -MD -MP -MF .deps/ddpt_xcopy.Tpo -c -o ddpt_xcopy.o ddpt_xcopy.c
mv -f .deps/ddpt_xcopy.Tpo .deps/ddpt_xcopy.Po
cc -DHAVE_CONFIG_H -I. -I.. -I../include -iquote ../include -D_LARGEFILE64_SOURCE -D_FILE_OFFSET_BITS=64   -Wall -W  -O2 -pipe  -fstack-protector-strong -fno-strict-aliasing  -MT sg_lib.o -MD -MP -MF .deps/sg_lib.Tpo -c -o sg_lib.o `test -f '../lib/sg_lib.c' || echo './'`../lib/sg_lib.c
mv -f .deps/sg_lib.Tpo .deps/sg_lib.Po
cc -DHAVE_CONFIG_H -I. -I.. -I../include -iquote ../include -D_LARGEFILE64_SOURCE -D_FILE_OFFSET_BITS=64   -Wall -W  -O2 -pipe  -fstack-protector-strong -fno-strict-aliasing  -MT sg_lib_data.o -MD -MP -MF .deps/sg_lib_data.Tpo -c -o sg_lib_data.o `test -f '../lib/sg_lib_data.c' || echo './'`../lib/sg_lib_data.c
mv -f .deps/sg_lib_data.Tpo .deps/sg_lib_data.Po
cc -DHAVE_CONFIG_H -I. -I.. -I../include -iquote ../include -D_LARGEFILE64_SOURCE -D_FILE_OFFSET_BITS=64   -Wall -W  -O2 -pipe  -fstack-protector-strong -fno-strict-aliasing  -MT sg_cmds_basic.o -MD -MP -MF .deps/sg_cmds_basic.Tpo -c -o sg_cmds_basic.o `test -f '../lib/sg_cmds_basic.c' || echo './'`../lib/sg_cmds_basic.c
mv -f .deps/sg_cmds_basic.Tpo .deps/sg_cmds_basic.Po
cc -DHAVE_CONFIG_H -I. -I.. -I../include -iquote ../include -D_LARGEFILE64_SOURCE -D_FILE_OFFSET_BITS=64   -Wall -W  -O2 -pipe  -fstack-protector-strong -fno-strict-aliasing  -MT sg_cmds_basic2.o -MD -MP -MF .deps/sg_cmds_basic2.Tpo -c -o sg_cmds_basic2.o `test -f '../lib/sg_cmds_basic2.c' || echo './'`../lib/sg_cmds_basic2.c
mv -f .deps/sg_cmds_basic2.Tpo .deps/sg_cmds_basic2.Po
cc -DHAVE_CONFIG_H -I. -I.. -I../include -iquote ../include -D_LARGEFILE64_SOURCE -D_FILE_OFFSET_BITS=64   -Wall -W  -O2 -pipe  -fstack-protector-strong -fno-strict-aliasing  -MT sg_cmds_extra.o -MD -MP -MF .deps/sg_cmds_extra.Tpo -c -o sg_cmds_extra.o `test -f '../lib/sg_cmds_extra.c' || echo './'`../lib/sg_cmds_extra.c
mv -f .deps/sg_cmds_extra.Tpo .deps/sg_cmds_extra.Po
cc -DHAVE_CONFIG_H -I. -I.. -I../include -iquote ../include -D_LARGEFILE64_SOURCE -D_FILE_OFFSET_BITS=64   -Wall -W  -O2 -pipe  -fstack-protector-strong -fno-strict-aliasing  -MT sg_pt_common.o -MD -MP -MF .deps/sg_pt_common.Tpo -c -o sg_pt_common.o `test -f '../lib/sg_pt_common.c' || echo './'`../lib/sg_pt_common.c
mv -f .deps/sg_pt_common.Tpo .deps/sg_pt_common.Po
cc -DHAVE_CONFIG_H -I. -I.. -I../include -iquote ../include -D_LARGEFILE64_SOURCE -D_FILE_OFFSET_BITS=64   -Wall -W  -O2 -pipe  -fstack-protector-strong -fno-strict-aliasing  -MT sg_pt_freebsd.o -MD -MP -MF .deps/sg_pt_freebsd.Tpo -c -o sg_pt_freebsd.o `test -f '../lib/sg_pt_freebsd.c' || echo './'`../lib/sg_pt_freebsd.c
./lib/sg_pt_freebsd.c:1238:15: warning: implicit declaration of function 'NVME_STATUS_GET_SCT' is invalid in C99 [-Wimplicit-function-declaration]
    sct_sc = (NVME_STATUS_GET_SCT(npcp->cpl.status) << 8) |
              ^
./lib/sg_pt_freebsd.c:1239:14: warning: implicit declaration of function 'NVME_STATUS_GET_SC' is invalid in C99 [-Wimplicit-function-declaration]
             NVME_STATUS_GET_SC(npcp->cpl.status);
             ^
2 warnings generated.
mv -f .deps/sg_pt_freebsd.Tpo .deps/sg_pt_freebsd.Po
cc -Wall -W  -O2 -pipe  -fstack-protector-strong -fno-strict-aliasing   -fstack-protector-strong  -o ddpt ddpt.o ddpt_cl.o ddpt_com.o ddpt_pt.o ddpt_xcopy.o   sg_lib.o sg_lib_data.o sg_cmds_basic.o sg_cmds_basic2.o sg_cmds_extra.o sg_pt_common.o sg_pt_freebsd.o  -lrt -lcam
sg_pt_freebsd.o: In function `nvme_pt_low':
sg_pt_freebsd.c:(.text+0x30d0): undefined reference to `NVME_STATUS_GET_SCT'
sg_pt_freebsd.c:(.text+0x30e2): undefined reference to `NVME_STATUS_GET_SC'
cc: error: linker command failed with exit code 1 (use -v to see invocation)
gmake[3]: *** [Makefile:520: ddpt] Error 1
gmake[3]: Leaving directory '/wrkdirs/usr/ports/sysutils/ddpt/work/ddpt-0.97/src'
gmake[2]: *** [Makefile:371: all-recursive] Error 1
gmake[2]: Leaving directory '/wrkdirs/usr/ports/sysutils/ddpt/work/ddpt-0.97'
gmake[1]: *** [Makefile:312: all] Error 2
gmake[1]: Leaving directory '/wrkdirs/usr/ports/sysutils/ddpt/work/ddpt-0.97'
*** Error code 1

Stop.
make: stopped in /usr/ports/sysutils/ddpt
Received on Thu Jul 29 2021 - 11:41:15 UTC

Original text of this message