[package - 130powerpc64-quarterly][mail/usendmail] Failed for usendmail-0.1.6_2 in build

From: <pkg-fallout_at_FreeBSD.org>
Date: Thu, 29 Jul 2021 11:23:17 GMT
You are receiving this mail as a port that you maintain
is failing to build on the FreeBSD package build server.
Please investigate the failure and submit a PR to fix
build.

Maintainer:     ports_at_FreeBSD.org
Log URL:        http://foul1.nyi.freebsd.org/data/130powerpc64-quarterly/03c599c1eb7a/logs/usendmail-0.1.6_2.log
Build URL:      http://foul1.nyi.freebsd.org/build.html?mastername=130powerpc64-quarterly&build=03c599c1eb7a
Log:

=>> Building mail/usendmail
build started at Thu Jul 29 11:22:49 UTC 2021
port directory: /usr/ports/mail/usendmail
package name: usendmail-0.1.6_2
building for: FreeBSD 130powerpc64-quarterly-job-01 13.0-RELEASE FreeBSD 13.0-RELEASE powerpc
maintained by: ports_at_FreeBSD.org
Makefile ident: 
Poudriere version: 3.2.8-20-g137a4a48
Host OSVERSION: 1400008
Jail OSVERSION: 1300139
Job Id: 01

---Begin Environment---
SHELL=/bin/csh
OSVERSION=1300139
UNAME_v=FreeBSD 13.0-RELEASE
UNAME_r=13.0-RELEASE
BLOCKSIZE=K
MAIL=/var/mail/root
MM_CHARSET=UTF-8
LANG=C.UTF-8
STATUS=1
HOME=/root
PATH=/sbin:/bin:/usr/sbin:/usr/bin:/usr/local/sbin:/usr/local/bin:/root/bin
LOCALBASE=/usr/local
USER=root
LIBEXECPREFIX=/usr/local/libexec/poudriere
POUDRIERE_VERSION=3.2.8-20-g137a4a48
MASTERMNT=/usr/local/poudriere/data/.m/130powerpc64-quarterly/ref
POUDRIERE_BUILD_TYPE=bulk
PACKAGE_BUILDING=yes
SAVED_TERM=
PWD=/usr/local/poudriere/data/.m/130powerpc64-quarterly/ref/.p/pool
P_PORTS_FEATURES=FLAVORS SELECTED_OPTIONS
MASTERNAME=130powerpc64-quarterly
SCRIPTPREFIX=/usr/local/share/poudriere
OLDPWD=/usr/local/poudriere/data/.m/130powerpc64-quarterly/ref/.p
SCRIPTPATH=/usr/local/share/poudriere/bulk.sh
POUDRIEREPATH=/usr/local/bin/poudriere
---End Environment---

---Begin Poudriere Port Flags/Env---
PORT_FLAGS=
PKGENV=
FLAVOR=
DEPENDS_ARGS=
MAKE_ARGS=
---End Poudriere Port Flags/Env---

---Begin OPTIONS List---
===> The following configuration options are available for usendmail-0.1.6_2:
     DOCS=on: Build and/or install documentation
===> Use 'make config' to modify these settings
---End OPTIONS List---

--MAINTAINER--
ports_at_FreeBSD.org
--End MAINTAINER--

--CONFIGURE_ARGS--

--End CONFIGURE_ARGS--

--CONFIGURE_ENV--
XDG_DATA_HOME=/wrkdirs/usr/ports/mail/usendmail/work  XDG_CONFIG_HOME=/wrkdirs/usr/ports/mail/usendmail/work  HOME=/wrkdirs/usr/ports/mail/usendmail/work TMPDIR="/tmp" PATH=/wrkdirs/usr/ports/mail/usendmail/work/.bin:/sbin:/bin:/usr/sbin:/usr/bin:/usr/local/sbin:/usr/local/bin:/root/bin SHELL=/bin/sh CONFIG_SHELL=/bin/sh
--End CONFIGURE_ENV--

--MAKE_ENV--
XDG_DATA_HOME=/wrkdirs/usr/ports/mail/usendmail/work  XDG_CONFIG_HOME=/wrkdirs/usr/ports/mail/usendmail/work  HOME=/wrkdirs/usr/ports/mail/usendmail/work TMPDIR="/tmp" PATH=/wrkdirs/usr/ports/mail/usendmail/work/.bin:/sbin:/bin:/usr/sbin:/usr/bin:/usr/local/sbin:/usr/local/bin:/root/bin NO_PIE=yes MK_DEBUG_FILES=no MK_KERNEL_SYMBOLS=no SHELL=/bin/sh NO_LINT=YES PREFIX=/usr/local  LOCALBASE=/usr/local  CC="cc" CFLAGS="-O2 -pipe  -fstack-protector-strong -fno-strict-aliasing "  CPP="cpp" CPPFLAGS=""  LDFLAGS=" -fstack-protector-strong " LIBS=""  CXX="c++" CXXFLAGS="-O2 -pipe -fstack-protector-strong -fno-strict-aliasing  "  MANPREFIX="/usr/local" BSD_INSTALL_PROGRAM="install  -s -m 555"  BSD_INSTALL_LIB="install  -s -m 0644"  BSD_INSTALL_SCRIPT="install  -m 555"  BSD_INSTALL_DATA="install  -m 0644"  BSD_INSTALL_MAN="install  -m 444"
--End MAKE_ENV--

--PLIST_SUB--
PORTDOCS="" OSREL=13.0 PREFIX=%D LOCALBASE=/usr/local  RESETPREFIX=/usr/local LIB32DIR=lib DOCSDIR="share/doc/usendmail"  EXAMPLESDIR="share/examples/usendmail"  DATADIR="share/usendmail"  WWWDIR="www/usendmail"  ETCDIR="etc/usendmail"
--End PLIST_SUB--

--SUB_LIST--
QMAIL_PREFIX=/var/qmail PREFIX=/usr/local LOCALBASE=/usr/local  DATADIR=/usr/local/share/usendmail DOCSDIR=/usr/local/share/doc/usendmail EXAMPLESDIR=/usr/local/share/examples/usendmail  WWWDIR=/usr/local/www/usendmail ETCDIR=/usr/local/etc/usendmail
--End SUB_LIST--

---Begin make.conf---
USE_PACKAGE_DEPENDS=yes
BATCH=yes
WRKDIRPREFIX=/wrkdirs
PORTSDIR=/usr/ports
PACKAGES=/packages
DISTDIR=/distfiles
PACKAGE_BUILDING=yes
PACKAGE_BUILDING_FLAVORS=yes
#### /usr/local/etc/poudriere.d/make.conf ####
# XXX: We really need this but cannot use it while 'make checksum' does not
# try the next mirror on checksum failure.  It currently retries the same
# failed mirror and then fails rather then trying another.  It *does*
# try the next if the size is mismatched though.
#MASTER_SITE_FREEBSD=yes
# Build ALLOW_MAKE_JOBS_PACKAGES with 2 jobs
MAKE_JOBS_NUMBER=2
#### /usr/ports/Mk/Scripts/ports_env.sh ####
_CCVERSION_921dbbb2=FreeBSD clang version 11.0.1 (git_at_github.com:llvm/llvm-project.git llvmorg-11.0.1-0-g43ff75f2c3fe) Target: powerpc64-unknown-freebsd13.0 Thread model: posix InstalledDir: /usr/bin
_ALTCCVERSION_921dbbb2=none
_CXXINTERNAL_acaad9ca=FreeBSD clang version 11.0.1 (git_at_github.com:llvm/llvm-project.git llvmorg-11.0.1-0-g43ff75f2c3fe) Target: powerpc64-unknown-freebsd13.0 Thread model: posix InstalledDir: /usr/bin "/usr/bin/ld" "--eh-frame-hdr" "-dynamic-linker" "/libexec/ld-elf.so.1" "--enable-new-dtags" "-o" "a.out" "/usr/lib/crt1.o" "/usr/lib/crti.o" "/usr/lib/crtbegin.o" "-L/usr/lib" "/dev/null" "-lc++" "-lm" "-lgcc" "--as-needed" "-lgcc_s" "--no-as-needed" "-lc" "-lgcc" "--as-needed" "-lgcc_s" "--no-as-needed" "/usr/lib/crtend.o" "/usr/lib/crtn.o"
CC_OUTPUT_921dbbb2_58173849=yes
CC_OUTPUT_921dbbb2_9bdba57c=yes
CC_OUTPUT_921dbbb2_6a4fe7f5=yes
CC_OUTPUT_921dbbb2_6bcac02b=yes
CC_OUTPUT_921dbbb2_67d20829=yes
CC_OUTPUT_921dbbb2_bfa62e83=yes
CC_OUTPUT_921dbbb2_f0b4d593=yes
CC_OUTPUT_921dbbb2_308abb44=yes
CC_OUTPUT_921dbbb2_f00456e5=yes
CC_OUTPUT_921dbbb2_65ad290d=yes
CC_OUTPUT_921dbbb2_f2776b26=yes
CC_OUTPUT_921dbbb2_b2657cc3=yes
CC_OUTPUT_921dbbb2_380987f7=yes
CC_OUTPUT_921dbbb2_160933ec=yes
CC_OUTPUT_921dbbb2_fb62803b=yes
_OBJC_CCVERSION_921dbbb2=FreeBSD clang version 11.0.1 (git_at_github.com:llvm/llvm-project.git llvmorg-11.0.1-0-g43ff75f2c3fe) Target: powerpc64-unknown-freebsd13.0 Thread model: posix InstalledDir: /usr/bin
_OBJC_ALTCCVERSION_921dbbb2=none
ARCH=powerpc64
PPC_ABI=ELFv2
OPSYS=FreeBSD
_OSRELEASE=13.0-RELEASE
OSREL=13.0
OSVERSION=1300139
PYTHONBASE=/usr/local
CONFIGURE_MAX_CMD_LEN=524288
HAVE_PORTS_ENV=1
#### Misc Poudriere ####
GID=0
UID=0
---End make.conf---
--Resource limits--
cpu time               (seconds, -t)  unlimited
file size           (512-blocks, -f)  unlimited
data seg size           (kbytes, -d)  33554432
stack size              (kbytes, -s)  524288
core file size      (512-blocks, -c)  unlimited
max memory size         (kbytes, -m)  unlimited
locked memory           (kbytes, -l)  unlimited
max user processes              (-u)  89999
open files                      (-n)  1024
virtual mem size        (kbytes, -v)  unlimited
swap limit              (kbytes, -w)  unlimited
socket buffer size       (bytes, -b)  unlimited
pseudo-terminals                (-p)  unlimited
kqueues                         (-k)  unlimited
umtx shared locks               (-o)  unlimited
--End resource limits--
=======================<phase: check-sanity   >============================
===>   NOTICE:

The usendmail port currently does not have a maintainer. As a result, it is
more likely to have unresolved issues, not be up-to-date, or even be removed in
the future. To volunteer to maintain this port, please create an issue at:

https://bugs.freebsd.org/bugzilla

More information about port maintainership is available at:

https://docs.freebsd.org/en/articles/contributing/#ports-contributing

===========================================================================
=======================<phase: pkg-depends    >============================
===>   usendmail-0.1.6_2 depends on file: /usr/local/sbin/pkg - not found
===>   Installing existing package /packages/All/pkg-1.16.3.txz
[130powerpc64-quarterly-job-01] Installing pkg-1.16.3...
[130powerpc64-quarterly-job-01] Extracting pkg-1.16.3: .......... done
===>   usendmail-0.1.6_2 depends on file: /usr/local/sbin/pkg - found
===>   Returning to build of usendmail-0.1.6_2
===========================================================================
=======================<phase: fetch-depends  >============================
===========================================================================
=======================<phase: fetch          >============================
===>   NOTICE:

The usendmail port currently does not have a maintainer. As a result, it is
more likely to have unresolved issues, not be up-to-date, or even be removed in
the future. To volunteer to maintain this port, please create an issue at:

https://bugs.freebsd.org/bugzilla

More information about port maintainership is available at:

https://docs.freebsd.org/en/articles/contributing/#ports-contributing

===> Fetching all distfiles required by usendmail-0.1.6_2 for building
===========================================================================
=======================<phase: checksum       >============================
===>   NOTICE:

The usendmail port currently does not have a maintainer. As a result, it is
more likely to have unresolved issues, not be up-to-date, or even be removed in
the future. To volunteer to maintain this port, please create an issue at:

https://bugs.freebsd.org/bugzilla

More information about port maintainership is available at:

https://docs.freebsd.org/en/articles/contributing/#ports-contributing

<snip>
--- fd_copy.o ---
./auto-compile.sh  -c fd_copy.c
fd_copy.c:12:3: warning: implicit declaration of function 'close' is invalid in C99 [-Wimplicit-function-declaration]
  close(to);
  ^
1 warning generated.
--- buffer_2.o ---
./auto-compile.sh  -c buffer_2.c
--- alloc.o ---
./auto-compilew.sh  -c alloc.c
--- alloc_re.o ---
./auto-compilew.sh  -c alloc_re.c
--- bailout.o ---
./auto-compilew.sh  -c bailout.c
--- bailout_name.o ---
./auto-compilew.sh  -c bailout_name.c
--- byte_chr.o ---
./auto-compilew.sh  -c byte_chr.c
--- byte_copy.o ---
./auto-compilew.sh  -c byte_copy.c
--- byte_cr.o ---
--- typesize.stamp ---
rm -f typesize.t
--- byte_cr.o ---
./auto-compilew.sh  -c byte_cr.c
--- typesize.stamp ---
touch typesize.stamp
--- byte_diff.o ---
./auto-compilew.sh  -c byte_diff.c
--- byte_zero.o ---
--- case_lowerb.o ---
--- byte_zero.o ---
./auto-compilew.sh  -c byte_zero.c
--- case_lowerb.o ---
./auto-compilew.sh  -c case_lowerb.c
--- case_lwrtab.o ---
--- coe.o ---
--- case_lwrtab.o ---
./auto-compilew.sh  -c case_lwrtab.c
--- coe.o ---
./auto-compilew.sh  -c coe.c
--- env_get.o ---
--- error.o ---
./auto-compilew.sh  -c error.c
--- env_get.o ---
./auto-compilew.sh  -c env_get.c
--- error_str.o ---
./auto-compilew.sh  -c error_str.c
--- fmt_ulong.o ---
./auto-compilew.sh  -c fmt_ulong.c
--- gen_alloc_ady.o ---
./auto-compilew.sh  -c gen_alloc_ady.c
--- gen_alloc_end.o ---
./auto-compilew.sh  -c gen_alloc_end.c
--- gen_alloc_lus.o ---
--- getln.o ---
--- gen_alloc_lus.o ---
./auto-compilew.sh  -c gen_alloc_lus.c
--- getln.o ---
./auto-compilew.sh  -c getln.c
--- pathexec_argv.o ---
./auto-compilew.sh  -c pathexec_argv.c
--- pathexec_env.o ---
./auto-compilew.sh  -c pathexec_env.c
--- pathexec_run.o ---
./auto-compilew.sh  -c pathexec_run.c
--- scan_long.o ---
./auto-compilew.sh  -c scan_long.c
--- scan_sign.o ---
./auto-compilew.sh  -c scan_sign.c
--- scan_ulong.o ---
./auto-compilew.sh  -c scan_ulong.c
--- seek.o ---
./auto-compilew.sh  -c seek.c
--- str_chr.o ---
./auto-compilew.sh  -c str_chr.c
--- str_diff.o ---
--- str_len.o ---
--- str_diff.o ---
./auto-compilew.sh  -c str_diff.c
--- str_len.o ---
./auto-compilew.sh  -c str_len.c
--- str_rchr.o ---
--- str_start.o ---
--- str_rchr.o ---
./auto-compilew.sh  -c str_rchr.c
--- str_start.o ---
./auto-compilew.sh  -c str_start.c
--- stralloc_cat.o ---
--- stralloc_catb.o ---
--- stralloc_cat.o ---
./auto-compilew.sh  -c stralloc_cat.c
--- stralloc_catb.o ---
./auto-compilew.sh  -c stralloc_catb.c
--- stralloc_cats.o ---
--- stralloc_copy.o ---
--- stralloc_cats.o ---
./auto-compilew.sh  -c stralloc_cats.c
--- stralloc_copy.o ---
./auto-compilew.sh  -c stralloc_copy.c
--- stralloc_eady.o ---
./auto-compilew.sh  -c stralloc_eady.c
--- stralloc_free.o ---
./auto-compilew.sh  -c stralloc_free.c
--- stralloc_num.o ---
./auto-compilew.sh  -c stralloc_num.c
--- stralloc_opyb.o ---
./auto-compilew.sh  -c stralloc_opyb.c
--- stralloc_opys.o ---
./auto-compilew.sh  -c stralloc_opys.c
--- stralloc_pend.o ---
./auto-compilew.sh  -c stralloc_pend.c
--- stralloc_plus.o ---
./auto-compilew.sh  -c stralloc_plus.c
--- uogetopt.o ---
./auto-compilew.sh  -c uogetopt.c
uogetopt.c:50:2: error: 'regparm' is not valid on this platform
        attribute_regparm(2);
        ^~~~~~~~~~~~~~~~~~~~
./attributes.h:75:46: note: expanded from macro 'attribute_regparm'
# define attribute_regparm(x) __attribute__((__regparm__((x))))
                                             ^           ~~~
uogetopt.c:52:2: error: 'regparm' is not valid on this platform
        attribute_regparm(3);
        ^~~~~~~~~~~~~~~~~~~~
./attributes.h:75:46: note: expanded from macro 'attribute_regparm'
# define attribute_regparm(x) __attribute__((__regparm__((x))))
                                             ^           ~~~
uogetopt.c:54:2: error: 'regparm' is not valid on this platform
        attribute_regparm(2);
        ^~~~~~~~~~~~~~~~~~~~
./attributes.h:75:46: note: expanded from macro 'attribute_regparm'
# define attribute_regparm(x) __attribute__((__regparm__((x))))
                                             ^           ~~~
uogetopt.c:56:17: error: 'regparm' is not valid on this platform
        const char *s) attribute_regparm(2);
                       ^~~~~~~~~~~~~~~~~~~~
./attributes.h:75:46: note: expanded from macro 'attribute_regparm'
# define attribute_regparm(x) __attribute__((__regparm__((x))))
                                             ^           ~~~
uogetopt.c:58:2: error: 'regparm' is not valid on this platform
        attribute_regparm(2);
        ^~~~~~~~~~~~~~~~~~~~
./attributes.h:75:46: note: expanded from macro 'attribute_regparm'
# define attribute_regparm(x) __attribute__((__regparm__((x))))
                                             ^           ~~~
uogetopt.c:119:8: error: 'regparm' is not valid on this platform
static attribute_regparm(2) void
       ^~~~~~~~~~~~~~~~~~~~
./attributes.h:75:46: note: expanded from macro 'attribute_regparm'
# define attribute_regparm(x) __attribute__((__regparm__((x))))
                                             ^           ~~~
uogetopt.c:144:8: error: 'regparm' is not valid on this platform
static attribute_regparm(2) unsigned int 
       ^~~~~~~~~~~~~~~~~~~~
./attributes.h:75:46: note: expanded from macro 'attribute_regparm'
# define attribute_regparm(x) __attribute__((__regparm__((x))))
                                             ^           ~~~
uogetopt.c:235:8: error: 'regparm' is not valid on this platform
static attribute_regparm(2) void        
       ^~~~~~~~~~~~~~~~~~~~
./attributes.h:75:46: note: expanded from macro 'attribute_regparm'
# define attribute_regparm(x) __attribute__((__regparm__((x))))
                                             ^           ~~~
uogetopt.c:253:8: error: 'regparm' is not valid on this platform
static attribute_regparm(3) void 
       ^~~~~~~~~~~~~~~~~~~~
./attributes.h:75:46: note: expanded from macro 'attribute_regparm'
# define attribute_regparm(x) __attribute__((__regparm__((x))))
                                             ^           ~~~
uogetopt.c:278:8: error: 'regparm' is not valid on this platform
static attribute_regparm(2) void 
       ^~~~~~~~~~~~~~~~~~~~
./attributes.h:75:46: note: expanded from macro 'attribute_regparm'
# define attribute_regparm(x) __attribute__((__regparm__((x))))
                                             ^           ~~~
10 errors generated.
--- wait_pid.o ---
--- uogetopt.o ---
*** [uogetopt.o] Error code 1

make[2]: stopped in /wrkdirs/usr/ports/mail/usendmail/work/mail/usendmail-0.1.6/compile
--- wait_pid.o ---
./auto-compilew.sh  -c wait_pid.c
1 error

make[2]: stopped in /wrkdirs/usr/ports/mail/usendmail/work/mail/usendmail-0.1.6/compile
*** [all] Error code 2

make[1]: stopped in /wrkdirs/usr/ports/mail/usendmail/work/mail/usendmail-0.1.6
1 error

make[1]: stopped in /wrkdirs/usr/ports/mail/usendmail/work/mail/usendmail-0.1.6
===> Compilation failed unexpectedly.
Try to set MAKE_JOBS_UNSAFE=yes and rebuild before reporting the failure to
the maintainer.
*** Error code 1

Stop.
make: stopped in /usr/ports/mail/usendmail
Received on Thu Jul 29 2021 - 11:23:17 UTC

Original text of this message