[package - 114i386-default][devel/rabs] Failed for rabs-2.18.5 in build

From: <pkg-fallout_at_FreeBSD.org>
Date: Thu, 29 Jul 2021 08:55:51 GMT
You are receiving this mail as a port that you maintain
is failing to build on the FreeBSD package build server.
Please investigate the failure and submit a PR to fix
build.

Maintainer:     yuri_at_FreeBSD.org
Log URL:        http://beefy10.nyi.freebsd.org/data/114i386-default/d69639d824b8/logs/rabs-2.18.5.log
Build URL:      http://beefy10.nyi.freebsd.org/build.html?mastername=114i386-default&build=d69639d824b8
Log:

=>> Building devel/rabs
build started at Thu Jul 29 08:55:39 UTC 2021
port directory: /usr/ports/devel/rabs
package name: rabs-2.18.5
building for: FreeBSD 114i386-default-job-13 11.4-RELEASE-p12 FreeBSD 11.4-RELEASE-p12 i386
maintained by: yuri_at_FreeBSD.org
Makefile ident: 
Poudriere version: 3.2.8-20-g137a4a48
Host OSVERSION: 1400008
Jail OSVERSION: 1104001
Job Id: 13

---Begin Environment---
SHELL=/bin/csh
UNAME_p=i386
UNAME_m=i386
OSVERSION=1104001
UNAME_v=FreeBSD 11.4-RELEASE-p12
UNAME_r=11.4-RELEASE-p12
BLOCKSIZE=K
MAIL=/var/mail/root
STATUS=1
HOME=/root
PATH=/sbin:/bin:/usr/sbin:/usr/bin:/usr/local/sbin:/usr/local/bin:/root/bin
LOCALBASE=/usr/local
USER=root
LIBEXECPREFIX=/usr/local/libexec/poudriere
POUDRIERE_VERSION=3.2.8-20-g137a4a48
MASTERMNT=/usr/local/poudriere/data/.m/114i386-default/ref
POUDRIERE_BUILD_TYPE=bulk
PACKAGE_BUILDING=yes
SAVED_TERM=
PWD=/usr/local/poudriere/data/.m/114i386-default/ref/.p/pool
P_PORTS_FEATURES=FLAVORS SELECTED_OPTIONS
MASTERNAME=114i386-default
SCRIPTPREFIX=/usr/local/share/poudriere
OLDPWD=/usr/local/poudriere/data/.m/114i386-default/ref/.p
SCRIPTPATH=/usr/local/share/poudriere/bulk.sh
POUDRIEREPATH=/usr/local/bin/poudriere
---End Environment---

---Begin Poudriere Port Flags/Env---
PORT_FLAGS=
PKGENV=
FLAVOR=
DEPENDS_ARGS=
MAKE_ARGS=
---End Poudriere Port Flags/Env---

---Begin OPTIONS List---
---End OPTIONS List---

--MAINTAINER--
yuri_at_FreeBSD.org
--End MAINTAINER--

--CONFIGURE_ARGS--

--End CONFIGURE_ARGS--

--CONFIGURE_ENV--
MAKE=gmake XDG_DATA_HOME=/wrkdirs/usr/ports/devel/rabs/work  XDG_CONFIG_HOME=/wrkdirs/usr/ports/devel/rabs/work  HOME=/wrkdirs/usr/ports/devel/rabs/work TMPDIR="/tmp" PATH=/wrkdirs/usr/ports/devel/rabs/work/.bin:/sbin:/bin:/usr/sbin:/usr/bin:/usr/local/sbin:/usr/local/bin:/root/bin SHELL=/bin/sh CONFIG_SHELL=/bin/sh CMAKE_PREFIX_PATH="/usr/local"
--End CONFIGURE_ENV--

--MAKE_ENV--
XDG_DATA_HOME=/wrkdirs/usr/ports/devel/rabs/work  XDG_CONFIG_HOME=/wrkdirs/usr/ports/devel/rabs/work  HOME=/wrkdirs/usr/ports/devel/rabs/work TMPDIR="/tmp" PATH=/wrkdirs/usr/ports/devel/rabs/work/.bin:/sbin:/bin:/usr/sbin:/usr/bin:/usr/local/sbin:/usr/local/bin:/root/bin NO_PIE=yes MK_DEBUG_FILES=no MK_KERNEL_SYMBOLS=no SHELL=/bin/sh NO_LINT=YES PREFIX=/usr/local  LOCALBASE=/usr/local  CC="cc" CFLAGS="-O2 -pipe  -fstack-protector-strong -isystem /usr/local/include -fno-strict-aliasing "  CPP="cpp" CPPFLAGS="-isystem /usr/local/include"  LDFLAGS=" -fstack-protector-strong -L/usr/local/lib " LIBS=""  CXX="c++" CXXFLAGS="-O2 -pipe -fstack-protector-strong -isystem /usr/local/include -fno-strict-aliasing  -isystem /usr/local/include "  MANPREFIX="/usr/local" BSD_INSTALL_PROGRAM="install  -s -m 555"  BSD_INSTALL_LIB="install  -s -m 0644"  BSD_INSTALL_SCRIPT="install  -m 555"  BSD_INSTALL_DATA="install  -m 0644"  BSD_INSTALL_MAN="install  -m 444"
--End MAKE_ENV--

--PLIST_SUB--
OSREL=11.4 PREFIX=%D LOCALBASE=/usr/local  RESETPREFIX=/usr/local LIB32DIR=lib DOCSDIR="share/doc/rabs"  EXAMPLESDIR="share/examples/rabs"  DATADIR="share/rabs"  WWWDIR="www/rabs"  ETCDIR="etc/rabs"
--End PLIST_SUB--

--SUB_LIST--
PREFIX=/usr/local LOCALBASE=/usr/local  DATADIR=/usr/local/share/rabs DOCSDIR=/usr/local/share/doc/rabs EXAMPLESDIR=/usr/local/share/examples/rabs  WWWDIR=/usr/local/www/rabs ETCDIR=/usr/local/etc/rabs
--End SUB_LIST--

---Begin make.conf---
USE_PACKAGE_DEPENDS=yes
BATCH=yes
WRKDIRPREFIX=/wrkdirs
PORTSDIR=/usr/ports
PACKAGES=/packages
DISTDIR=/distfiles
PACKAGE_BUILDING=yes
PACKAGE_BUILDING_FLAVORS=yes
MACHINE=i386
MACHINE_ARCH=i386
ARCH=${MACHINE_ARCH}
#### /usr/local/etc/poudriere.d/make.conf ####
# XXX: We really need this but cannot use it while 'make checksum' does not
# try the next mirror on checksum failure.  It currently retries the same
# failed mirror and then fails rather then trying another.  It *does*
# try the next if the size is mismatched though.
#MASTER_SITE_FREEBSD=yes
# Build ALLOW_MAKE_JOBS_PACKAGES with 2 jobs
MAKE_JOBS_NUMBER=2
#### /usr/ports/Mk/Scripts/ports_env.sh ####
_CCVERSION_921dbbb2=FreeBSD clang version 10.0.0 (git_at_github.com:llvm/llvm-project.git llvmorg-10.0.0-0-gd32170dbd5b) Target: i386-unknown-freebsd11.4 Thread model: posix InstalledDir: /usr/bin
_ALTCCVERSION_921dbbb2=none
_CXXINTERNAL_acaad9ca=FreeBSD clang version 10.0.0 (git_at_github.com:llvm/llvm-project.git llvmorg-10.0.0-0-gd32170dbd5b) Target: i386-unknown-freebsd11.4 Thread model: posix InstalledDir: /usr/bin "/usr/bin/ld" "--eh-frame-hdr" "-dynamic-linker" "/libexec/ld-elf.so.1" "--hash-style=both" "--enable-new-dtags" "-m" "elf_i386_fbsd" "-o" "a.out" "/usr/lib/crt1.o" "/usr/lib/crti.o" "/usr/lib/crtbegin.o" "-L/usr/lib" "/dev/null" "-lc++" "-lm" "-lgcc" "--as-needed" "-lgcc_s" "--no-as-needed" "-lc" "-lgcc" "--as-needed" "-lgcc_s" "--no-as-needed" "/usr/lib/crtend.o" "/usr/lib/crtn.o"
CC_OUTPUT_921dbbb2_58173849=yes
CC_OUTPUT_921dbbb2_9bdba57c=yes
CC_OUTPUT_921dbbb2_6a4fe7f5=yes
CC_OUTPUT_921dbbb2_6bcac02b=yes
CC_OUTPUT_921dbbb2_67d20829=yes
CC_OUTPUT_921dbbb2_bfa62e83=yes
CC_OUTPUT_921dbbb2_f0b4d593=yes
CC_OUTPUT_921dbbb2_308abb44=yes
CC_OUTPUT_921dbbb2_f00456e5=yes
CC_OUTPUT_921dbbb2_65ad290d=yes
CC_OUTPUT_921dbbb2_f2776b26=yes
CC_OUTPUT_921dbbb2_b2657cc3=yes
CC_OUTPUT_921dbbb2_380987f7=yes
CC_OUTPUT_921dbbb2_160933ec=yes
CC_OUTPUT_921dbbb2_fb62803b=yes
_OBJC_CCVERSION_921dbbb2=FreeBSD clang version 10.0.0 (git_at_github.com:llvm/llvm-project.git llvmorg-10.0.0-0-gd32170dbd5b) Target: i386-unknown-freebsd11.4 Thread model: posix InstalledDir: /usr/bin
_OBJC_ALTCCVERSION_921dbbb2=none
ARCH=i386
OPSYS=FreeBSD
_OSRELEASE=11.4-RELEASE-p12
OSREL=11.4
OSVERSION=1104001
PYTHONBASE=/usr/local
CONFIGURE_MAX_CMD_LEN=524288
HAVE_PORTS_ENV=1
#### Misc Poudriere ####
GID=0
UID=0
DISABLE_MAKE_JOBS=poudriere
---End make.conf---
--Resource limits--
cpu time               (seconds, -t)  unlimited
file size           (512-blocks, -f)  unlimited
data seg size           (kbytes, -d)  524288
stack size              (kbytes, -s)  65536
core file size      (512-blocks, -c)  unlimited
max memory size         (kbytes, -m)  unlimited
locked memory           (kbytes, -l)  unlimited
max user processes              (-u)  89999
open files                      (-n)  1024
virtual mem size        (kbytes, -v)  unlimited
swap limit              (kbytes, -w)  unlimited
socket buffer size       (bytes, -b)  unlimited
pseudo-terminals                (-p)  unlimited
kqueues                         (-k)  unlimited
umtx shared locks               (-o)  unlimited
--End resource limits--
=======================<phase: check-sanity   >============================
===>  License MIT accepted by the user
===========================================================================
=======================<phase: pkg-depends    >============================
===>   rabs-2.18.5 depends on file: /usr/local/sbin/pkg - not found
===>   Installing existing package /packages/All/pkg-1.17.1.pkg
[114i386-default-job-13] Installing pkg-1.17.1...
[114i386-default-job-13] Extracting pkg-1.17.1: .......... done
===>   rabs-2.18.5 depends on file: /usr/local/sbin/pkg - found
===>   Returning to build of rabs-2.18.5
===========================================================================
=======================<phase: fetch-depends  >============================
===========================================================================
=======================<phase: fetch          >============================
===>  License MIT accepted by the user
===> Fetching all distfiles required by rabs-2.18.5 for building
===========================================================================
=======================<phase: checksum       >============================
===>  License MIT accepted by the user
===> Fetching all distfiles required by rabs-2.18.5 for building
=> SHA256 Checksum OK for wrapl-rabs-v2.18.5_GH0.tar.gz.
=> SHA256 Checksum OK for wrapl-minilang-9f1ead0_GH0.tar.gz.
=> SHA256 Checksum OK for rajamukherji-radb-0666cfc_GH0.tar.gz.
===========================================================================
=======================<phase: extract-depends>============================
===========================================================================
=======================<phase: extract        >============================
===>  License MIT accepted by the user
===> Fetching all distfiles required by rabs-2.18.5 for building
===>  Extracting for rabs-2.18.5
=> SHA256 Checksum OK for wrapl-rabs-v2.18.5_GH0.tar.gz.
=> SHA256 Checksum OK for wrapl-minilang-9f1ead0_GH0.tar.gz.
=> SHA256 Checksum OK for rajamukherji-radb-0666cfc_GH0.tar.gz.
===========================================================================
=======================<phase: patch-depends  >============================
===========================================================================
=======================<phase: patch          >============================
===>  Patching for rabs-2.18.5
===========================================================================
=======================<phase: build-depends  >============================
===>   rabs-2.18.5 depends on package: gmake>=4.3 - not found
===>   Installing existing package /packages/All/gmake-4.3_2.pkg
[114i386-default-job-13] Installing gmake-4.3_2...
[114i386-default-job-13] `-- Installing gettext-runtime-0.21...
[114i386-default-job-13] |   `-- Installing indexinfo-0.3.1...
[114i386-default-job-13] |   `-- Extracting indexinfo-0.3.1: .... done
[114i386-default-job-13] `-- Extracting gettext-runtime-0.21: .......... done
[114i386-default-job-13] Extracting gmake-4.3_2: .......... done
===>   rabs-2.18.5 depends on package: gmake>=4.3 - found
===>   Returning to build of rabs-2.18.5
===========================================================================
=======================<phase: lib-depends    >============================
<snip>
        .Constructor = (ml_value_t *)MLTypeOf
                       ^~~~~~~~~~~~~~~~~~~~~~
src/ml_types.h:85:2: note: expanded from macro 'ML_TYPE'
        __VA_ARGS__ \
        ^~~~~~~~~~~
src/ml_types.c:77:1: note: previous initialization is here
ML_TYPE(MLTypeT, (MLFunctionT), "type",
^~~~~~~~~~~~~~~~~~~~~~~~~~~~~~~~~~~~~~~
src/ml_types.h:80:17: note: expanded from macro 'ML_TYPE'
        .Constructor = (ml_value_t *)CONCAT2(TYPE, Of), \
                       ^~~~~~~~~~~~~~~~~~~~~~~~~~~~~~~
src/ml_types.c:381:12: warning: initializer overrides prior initialization of this subobject [-Winitializer-overrides]
        .assign = ml_blank_assign
                  ^~~~~~~~~~~~~~~
src/ml_types.h:85:2: note: expanded from macro 'ML_TYPE'
        __VA_ARGS__ \
        ^~~~~~~~~~~
src/ml_types.c:379:1: note: previous initialization is here
ML_TYPE(MLBlankT, (), "blank",
^~~~~~~~~~~~~~~~~~~~~~~~~~~~~~
src/ml_types.h:79:12: note: expanded from macro 'ML_TYPE'
        .assign = ml_default_assign, \
                  ^~~~~~~~~~~~~~~~~
src/ml_types.c:853:10: warning: initializer overrides prior initialization of this subobject [-Winitializer-overrides]
        .call = (void *)ml_cfunction_call
                ^~~~~~~~~~~~~~~~~~~~~~~~~
src/ml_types.h:85:2: note: expanded from macro 'ML_TYPE'
        __VA_ARGS__ \
        ^~~~~~~~~~~
src/ml_types.c:851:1: note: previous initialization is here
ML_TYPE(MLCFunctionT, (MLFunctionT), "c-function",
^~~~~~~~~~~~~~~~~~~~~~~~~~~~~~~~~~~~~~~~~~~~~~~~~~
src/ml_types.h:77:10: note: expanded from macro 'ML_TYPE'
        .call = ml_default_call, \
                ^~~~~~~~~~~~~~~
src/ml_types.c:871:10: warning: initializer overrides prior initialization of this subobject [-Winitializer-overrides]
        .call = (void *)ml_cfunction_noderef_call
                ^~~~~~~~~~~~~~~~~~~~~~~~~~~~~~~~~
src/ml_types.h:85:2: note: expanded from macro 'ML_TYPE'
        __VA_ARGS__ \
        ^~~~~~~~~~~
src/ml_types.c:869:1: note: previous initialization is here
ML_TYPE(MLCFunctionNoDerefT, (MLFunctionT), "c-function",
^~~~~~~~~~~~~~~~~~~~~~~~~~~~~~~~~~~~~~~~~~~~~~~~~~~~~~~~~
src/ml_types.h:77:10: note: expanded from macro 'ML_TYPE'
        .call = ml_default_call, \
                ^~~~~~~~~~~~~~~
src/ml_types.c:893:10: warning: initializer overrides prior initialization of this subobject [-Winitializer-overrides]
        .call = (void *)ml_cfunctionx_call
                ^~~~~~~~~~~~~~~~~~~~~~~~~~
src/ml_types.h:85:2: note: expanded from macro 'ML_TYPE'
        __VA_ARGS__ \
        ^~~~~~~~~~~
src/ml_types.c:891:1: note: previous initialization is here
ML_TYPE(MLCFunctionXT, (MLFunctionT), "c-functionx",
^~~~~~~~~~~~~~~~~~~~~~~~~~~~~~~~~~~~~~~~~~~~~~~~~~~~
src/ml_types.h:77:10: note: expanded from macro 'ML_TYPE'
        .call = ml_default_call, \
                ^~~~~~~~~~~~~~~
src/ml_types.c:910:10: warning: initializer overrides prior initialization of this subobject [-Winitializer-overrides]
        .call = (void *)ml_cfunctionz_call
                ^~~~~~~~~~~~~~~~~~~~~~~~~~
src/ml_types.h:85:2: note: expanded from macro 'ML_TYPE'
        __VA_ARGS__ \
        ^~~~~~~~~~~
src/ml_types.c:908:1: note: previous initialization is here
ML_TYPE(MLCFunctionZT, (MLFunctionT), "c-functionx",
^~~~~~~~~~~~~~~~~~~~~~~~~~~~~~~~~~~~~~~~~~~~~~~~~~~~
src/ml_types.h:77:10: note: expanded from macro 'ML_TYPE'
        .call = ml_default_call, \
                ^~~~~~~~~~~~~~~
src/ml_types.c:953:10: warning: initializer overrides prior initialization of this subobject [-Winitializer-overrides]
        .call = (void *)ml_partial_function_call
                ^~~~~~~~~~~~~~~~~~~~~~~~~~~~~~~~
src/ml_types.h:85:2: note: expanded from macro 'ML_TYPE'
        __VA_ARGS__ \
        ^~~~~~~~~~~
src/ml_types.c:951:1: note: previous initialization is here
ML_TYPE(MLPartialFunctionT, (MLFunctionT, MLIteratableT), "partial-function",
^~~~~~~~~~~~~~~~~~~~~~~~~~~~~~~~~~~~~~~~~~~~~~~~~~~~~~~~~~~~~~~~~~~~~~~~~~~~~
src/ml_types.h:77:10: note: expanded from macro 'ML_TYPE'
        .call = ml_default_call, \
                ^~~~~~~~~~~~~~~
src/ml_types.c:1077:10: warning: initializer overrides prior initialization of this subobject [-Winitializer-overrides]
        .hash = (void *)ml_tuple_hash,
                ^~~~~~~~~~~~~~~~~~~~~
src/ml_types.h:85:2: note: expanded from macro 'ML_TYPE'
        __VA_ARGS__ \
        ^~~~~~~~~~~
src/ml_types.c:1074:1: note: previous initialization is here
ML_TYPE(MLTupleT, (), "tuple",
^~~~~~~~~~~~~~~~~~~~~~~~~~~~~~
src/ml_types.h:76:10: note: expanded from macro 'ML_TYPE'
        .hash = ml_default_hash, \
                ^~~~~~~~~~~~~~~
src/ml_types.c:1078:11: warning: initializer overrides prior initialization of this subobject [-Winitializer-overrides]
        .deref = (void *)ml_tuple_deref,
                 ^~~~~~~~~~~~~~~~~~~~~~
src/ml_types.h:85:2: note: expanded from macro 'ML_TYPE'
        __VA_ARGS__ \
        ^~~~~~~~~~~
src/ml_types.c:1074:1: note: previous initialization is here
ML_TYPE(MLTupleT, (), "tuple",
^~~~~~~~~~~~~~~~~~~~~~~~~~~~~~
src/ml_types.h:78:11: note: expanded from macro 'ML_TYPE'
        .deref = ml_default_deref, \
                 ^~~~~~~~~~~~~~~~
src/ml_types.c:1079:12: warning: initializer overrides prior initialization of this subobject [-Winitializer-overrides]
        .assign = (void *)ml_tuple_assign,
                  ^~~~~~~~~~~~~~~~~~~~~~~
src/ml_types.h:85:2: note: expanded from macro 'ML_TYPE'
        __VA_ARGS__ \
        ^~~~~~~~~~~
src/ml_types.c:1074:1: note: previous initialization is here
ML_TYPE(MLTupleT, (), "tuple",
^~~~~~~~~~~~~~~~~~~~~~~~~~~~~~
src/ml_types.h:79:12: note: expanded from macro 'ML_TYPE'
        .assign = ml_default_assign, \
                  ^~~~~~~~~~~~~~~~~
src/ml_types.c:1080:17: warning: initializer overrides prior initialization of this subobject [-Winitializer-overrides]
        .Constructor = (ml_value_t *)MLTuple
                       ^~~~~~~~~~~~~~~~~~~~~
src/ml_types.h:85:2: note: expanded from macro 'ML_TYPE'
        __VA_ARGS__ \
        ^~~~~~~~~~~
src/ml_types.c:1074:1: note: previous initialization is here
ML_TYPE(MLTupleT, (), "tuple",
^~~~~~~~~~~~~~~~~~~~~~~~~~~~~~
src/ml_types.h:80:17: note: expanded from macro 'ML_TYPE'
        .Constructor = (ml_value_t *)CONCAT2(TYPE, Of), \
                       ^~~~~~~~~~~~~~~~~~~~~~~~~~~~~~~
src/ml_types.c:1253:10: warning: initializer overrides prior initialization of this subobject [-Winitializer-overrides]
        .hash = (void *)ml_boolean_hash
                ^~~~~~~~~~~~~~~~~~~~~~~
src/ml_types.h:85:2: note: expanded from macro 'ML_TYPE'
        __VA_ARGS__ \
        ^~~~~~~~~~~
src/ml_types.c:1251:1: note: previous initialization is here
ML_TYPE(MLBooleanT, (MLFunctionT), "boolean",
^~~~~~~~~~~~~~~~~~~~~~~~~~~~~~~~~~~~~~~~~~~~~
src/ml_types.h:76:10: note: expanded from macro 'ML_TYPE'
        .hash = ml_default_hash, \
                ^~~~~~~~~~~~~~~
src/ml_types.c:1423:10: warning: initializer overrides prior initialization of this subobject [-Winitializer-overrides]
        .hash = (void *)ml_integer_hash,
                ^~~~~~~~~~~~~~~~~~~~~~~
src/ml_types.h:85:2: note: expanded from macro 'ML_TYPE'
        __VA_ARGS__ \
        ^~~~~~~~~~~
src/ml_types.c:1421:1: note: previous initialization is here
ML_TYPE(MLIntegerT, (MLNumberT), "integer",
^~~~~~~~~~~~~~~~~~~~~~~~~~~~~~~~~~~~~~~~~~~
src/ml_types.h:76:10: note: expanded from macro 'ML_TYPE'
        .hash = ml_default_hash, \
                ^~~~~~~~~~~~~~~
src/ml_types.c:1424:10: warning: initializer overrides prior initialization of this subobject [-Winitializer-overrides]
        .call = (void *)ml_integer_call
                ^~~~~~~~~~~~~~~~~~~~~~~
src/ml_types.h:85:2: note: expanded from macro 'ML_TYPE'
        __VA_ARGS__ \
        ^~~~~~~~~~~
src/ml_types.c:1421:1: note: previous initialization is here
ML_TYPE(MLIntegerT, (MLNumberT), "integer",
^~~~~~~~~~~~~~~~~~~~~~~~~~~~~~~~~~~~~~~~~~~
src/ml_types.h:77:10: note: expanded from macro 'ML_TYPE'
        .call = ml_default_call, \
                ^~~~~~~~~~~~~~~
src/ml_types.c:1427:13: error: conflicting types for 'ml_integer'
ml_value_t *ml_integer(long Value) {
            ^
src/ml_types.h:476:13: note: previous declaration is here
ml_value_t *ml_integer(const int64_t Value) __attribute__((malloc));
            ^
src/ml_types.c:1434:13: error: conflicting types for 'ml_integer_value_fast'
extern long ml_integer_value_fast(const ml_value_t *Value);
            ^
src/ml_types.h:484:16: note: previous definition is here
inline int64_t ml_integer_value_fast(const ml_value_t *Value) {
               ^
src/ml_types.c:1510:10: warning: initializer overrides prior initialization of this subobject [-Winitializer-overrides]
        .hash = (void *)ml_real_hash
                ^~~~~~~~~~~~~~~~~~~~
src/ml_types.h:85:2: note: expanded from macro 'ML_TYPE'
        __VA_ARGS__ \
        ^~~~~~~~~~~
src/ml_types.c:1508:1: note: previous initialization is here
ML_TYPE(MLRealT, (MLNumberT), "real",
^~~~~~~~~~~~~~~~~~~~~~~~~~~~~~~~~~~~~
src/ml_types.h:76:10: note: expanded from macro 'ML_TYPE'
        .hash = ml_default_hash, \
                ^~~~~~~~~~~~~~~
24 warnings and 2 errors generated.
gmake[2]: *** [Makefile:35: obj/ml_types.o] Error 1
gmake[2]: Leaving directory '/wrkdirs/usr/ports/devel/rabs/work/rabs-2.18.5/minilang'
gmake[1]: *** [Makefile:20: minilang/lib/libminilang.a] Error 2
gmake[1]: Leaving directory '/wrkdirs/usr/ports/devel/rabs/work/rabs-2.18.5'
*** Error code 1

Stop.
make: stopped in /usr/ports/devel/rabs
Received on Thu Jul 29 2021 - 08:55:51 UTC

Original text of this message