[package - 130releng-riscv64-quarterly][databases/kyototycoon] Failed for kyototycoon-0.9.56_6 in build

From: <pkg-fallout_at_FreeBSD.org>
Date: Thu, 29 Jul 2021 04:19:54 GMT
You are receiving this mail as a port that you maintain
is failing to build on the FreeBSD package build server.
Please investigate the failure and submit a PR to fix
build.

Maintainer:     sunpoet_at_FreeBSD.org
Log URL:        http://beefy7.nyi.freebsd.org/data/130releng-riscv64-quarterly/03c599c1eb7a/logs/kyototycoon-0.9.56_6.log
Build URL:      http://beefy7.nyi.freebsd.org/build.html?mastername=130releng-riscv64-quarterly&build=03c599c1eb7a
Log:

=>> Building databases/kyototycoon
build started at Thu Jul 29 04:18:06 UTC 2021
port directory: /usr/ports/databases/kyototycoon
package name: kyototycoon-0.9.56_6
building for: FreeBSD 130releng-riscv64-quarterly-job-03 13.0-RELEASE-p3 FreeBSD 13.0-RELEASE-p3 1300139 riscv
maintained by: sunpoet_at_FreeBSD.org
Makefile ident: 
Poudriere version: 3.2.8-20-g137a4a48
Host OSVERSION: 1400008
Jail OSVERSION: 1300139
Job Id: 03

---Begin Environment---
SHELL=/bin/csh
UNAME_p=riscv64
UNAME_m=riscv
ABI_FILE=/usr/lib/crt1.o
OSVERSION=1300139
UNAME_v=FreeBSD 13.0-RELEASE-p3 1300139
UNAME_r=13.0-RELEASE-p3
BLOCKSIZE=K
MAIL=/var/mail/root
MM_CHARSET=UTF-8
LANG=C.UTF-8
STATUS=1
HOME=/root
PATH=/sbin:/bin:/usr/sbin:/usr/bin:/usr/local/sbin:/usr/local/bin:/root/bin
LOCALBASE=/usr/local
QEMU_EMULATING=1
USER=root
LIBEXECPREFIX=/usr/local/libexec/poudriere
POUDRIERE_VERSION=3.2.8-20-g137a4a48
MASTERMNT=/usr/local/poudriere/data/.m/130releng-riscv64-quarterly/ref
POUDRIERE_BUILD_TYPE=bulk
PACKAGE_BUILDING=yes
SAVED_TERM=
PWD=/usr/local/poudriere/data/.m/130releng-riscv64-quarterly/ref/.p/pool
P_PORTS_FEATURES=FLAVORS SELECTED_OPTIONS
MASTERNAME=130releng-riscv64-quarterly
SCRIPTPREFIX=/usr/local/share/poudriere
OLDPWD=/usr/local/poudriere/data/.m/130releng-riscv64-quarterly/ref/.p
SCRIPTPATH=/usr/local/share/poudriere/bulk.sh
POUDRIEREPATH=/usr/local/bin/poudriere
---End Environment---

---Begin Poudriere Port Flags/Env---
PORT_FLAGS=
PKGENV=
FLAVOR=
DEPENDS_ARGS=
MAKE_ARGS=
---End Poudriere Port Flags/Env---

---Begin OPTIONS List---
===> The following configuration options are available for kyototycoon-0.9.56_6:
     DOCS=on: Build and/or install documentation
     LZO=off: LZO compression support
===> Use 'make config' to modify these settings
---End OPTIONS List---

--MAINTAINER--
sunpoet_at_FreeBSD.org
--End MAINTAINER--

--CONFIGURE_ARGS--
--enable-uyield ac_cv_lib_lzo2_main=no --prefix=/usr/local ${_LATE_CONFIGURE_ARGS}
--End CONFIGURE_ARGS--

--CONFIGURE_ENV--
MAKE=gmake PKG_CONFIG=pkgconf XDG_DATA_HOME=/wrkdirs/usr/ports/databases/kyototycoon/work  XDG_CONFIG_HOME=/wrkdirs/usr/ports/databases/kyototycoon/work  HOME=/wrkdirs/usr/ports/databases/kyototycoon/work TMPDIR="/tmp" PATH=/wrkdirs/usr/ports/databases/kyototycoon/work/.bin:/sbin:/bin:/usr/sbin:/usr/bin:/usr/local/sbin:/usr/local/bin:/root/bin SHELL=/bin/sh CONFIG_SHELL=/bin/sh CONFIG_SITE=/usr/ports/Templates/config.site lt_cv_sys_max_cmd_len=524288
--End CONFIGURE_ENV--

--MAKE_ENV--
XDG_DATA_HOME=/wrkdirs/usr/ports/databases/kyototycoon/work  XDG_CONFIG_HOME=/wrkdirs/usr/ports/databases/kyototycoon/work  HOME=/wrkdirs/usr/ports/databases/kyototycoon/work TMPDIR="/tmp" PATH=/wrkdirs/usr/ports/databases/kyototycoon/work/.bin:/sbin:/bin:/usr/sbin:/usr/bin:/usr/local/sbin:/usr/local/bin:/root/bin NO_PIE=yes MK_DEBUG_FILES=no MK_KERNEL_SYMBOLS=no SHELL=/bin/sh NO_LINT=YES PREFIX=/usr/local  LOCALBASE=/usr/local  CC="/nxb-bin/usr/bin/cc" CFLAGS="-O2 -pipe -march=rv64imafdc -mabi=lp64d  -fstack-protector-strong -fno-strict-aliasing "  CPP="/nxb-bin/usr/bin/cpp" CPPFLAGS="-fPIC"  LDFLAGS=" -fstack-protector-strong " LIBS=""  CXX="/nxb-bin/usr/bin/c++" CXXFLAGS="-O2 -pipe -march=rv64imafdc -mabi=lp64d  -fstack-protector-strong -fno-strict-aliasing   -std=gnu++98 "  MANPREFIX="/usr/local" BSD_INSTALL_PROGRAM="install  -s -m 555"  BSD_INSTALL_LIB="install  -s -m 0644"  BSD_INSTALL_SCRIPT="install  -m 555"  BSD_INSTALL_DATA="install  -m 0644"  BSD_INSTALL_MAN="install  -m 4
 44"
--End MAKE_ENV--

--PLIST_SUB--
KYOTOTYCOON_USER=kyototycoon  KYOTOTYCOON_GROUP=kyototycoon  KYOTOTYCOON_DBDIR=/var/db/kyototycoon  KYOTOTYCOON_LOGDIR=/var/log/kyototycoon  KYOTOTYCOON_PIDFILE=/var/run/kyototycoon.pid PORTDOCS="" OSREL=13.0 PREFIX=%D LOCALBASE=/usr/local  RESETPREFIX=/usr/local LIB32DIR=lib DOCSDIR="share/doc/kyototycoon"  EXAMPLESDIR="share/examples/kyototycoon"  DATADIR="share/kyototycoon"  WWWDIR="www/kyototycoon"  ETCDIR="etc/kyototycoon"
--End PLIST_SUB--

--SUB_LIST--
KYOTOTYCOON_USER=kyototycoon  KYOTOTYCOON_GROUP=kyototycoon  KYOTOTYCOON_DBDIR=/var/db/kyototycoon  KYOTOTYCOON_LOGDIR=/var/log/kyototycoon  KYOTOTYCOON_PIDFILE=/var/run/kyototycoon.pid PREFIX=/usr/local LOCALBASE=/usr/local  DATADIR=/usr/local/share/kyototycoon DOCSDIR=/usr/local/share/doc/kyototycoon EXAMPLESDIR=/usr/local/share/examples/kyototycoon  WWWDIR=/usr/local/www/kyototycoon ETCDIR=/usr/local/etc/kyototycoon
--End SUB_LIST--

---Begin make.conf---
.sinclude "/etc/make.nxb.conf"
USE_PACKAGE_DEPENDS=yes
BATCH=yes
WRKDIRPREFIX=/wrkdirs
PORTSDIR=/usr/ports
PACKAGES=/packages
DISTDIR=/distfiles
PACKAGE_BUILDING=yes
PACKAGE_BUILDING_FLAVORS=yes
MACHINE=riscv
MACHINE_ARCH=riscv64
ARCH=${MACHINE_ARCH}
#### /usr/local/etc/poudriere.d/make.conf ####
# XXX: We really need this but cannot use it while 'make checksum' does not
# try the next mirror on checksum failure.  It currently retries the same
# failed mirror and then fails rather then trying another.  It *does*
# try the next if the size is mismatched though.
#MASTER_SITE_FREEBSD=yes
# Build ALLOW_MAKE_JOBS_PACKAGES with 2 jobs
MAKE_JOBS_NUMBER=2
#### /usr/ports/Mk/Scripts/ports_env.sh ####
_CCVERSION_9d218390=FreeBSD clang version 11.0.1 (git_at_github.com:llvm/llvm-project.git llvmorg-11.0.1-0-g43ff75f2c3fe) Target: riscv64-unknown-freebsd13.0 Thread model: posix InstalledDir: /nxb-bin/usr/bin
_ALTCCVERSION_9d218390=none
_CXXINTERNAL_9c45a5b1=FreeBSD clang version 11.0.1 (git_at_github.com:llvm/llvm-project.git llvmorg-11.0.1-0-g43ff75f2c3fe) Target: riscv64-unknown-freebsd13.0 Thread model: posix InstalledDir: /nxb-bin/usr/bin "/nxb-bin/usr/bin/ld" "--eh-frame-hdr" "-dynamic-linker" "/libexec/ld-elf.so.1" "--enable-new-dtags" "-m" "elf64lriscv" "-o" "a.out" "/usr/lib/crt1.o" "/usr/lib/crti.o" "/usr/lib/crtbegin.o" "-L/usr/lib" "/dev/null" "-lc++" "-lm" "-lgcc" "--as-needed" "-lgcc_s" "--no-as-needed" "-lc" "-lgcc" "--as-needed" "-lgcc_s" "--no-as-needed" "/usr/lib/crtend.o" "/usr/lib/crtn.o"
CC_OUTPUT_9d218390_58173849=yes
CC_OUTPUT_9d218390_9bdba57c=yes
CC_OUTPUT_9d218390_6a4fe7f5=yes
CC_OUTPUT_9d218390_6bcac02b=yes
CC_OUTPUT_9d218390_67d20829=yes
CC_OUTPUT_9d218390_bfa62e83=yes
CC_OUTPUT_9d218390_f0b4d593=yes
CC_OUTPUT_9d218390_308abb44=yes
CC_OUTPUT_9d218390_f00456e5=yes
CC_OUTPUT_9d218390_65ad290d=yes
CC_OUTPUT_9d218390_f2776b26=yes
CC_OUTPUT_9d218390_b2657cc3=yes
CC_OUTPUT_9d218390_380987f7=yes
CC_OUTPUT_9d218390_160933ec=yes
CC_OUTPUT_9d218390_fb62803b=yes
_OBJC_CCVERSION_9d218390=FreeBSD clang version 11.0.1 (git_at_github.com:llvm/llvm-project.git llvmorg-11.0.1-0-g43ff75f2c3fe) Target: riscv64-unknown-freebsd13.0 Thread model: posix InstalledDir: /nxb-bin/usr/bin
_OBJC_ALTCCVERSION_9d218390=none
ARCH=riscv64
OPSYS=FreeBSD
_OSRELEASE=13.0-RELEASE-p3
OSREL=13.0
OSVERSION=1300139
PYTHONBASE=/usr/local
CONFIGURE_MAX_CMD_LEN=524288
HAVE_PORTS_ENV=1
#### Misc Poudriere ####
GID=0
UID=0
DISABLE_MAKE_JOBS=poudriere
---End make.conf---
---Begin make.nxb.conf---
CC=/nxb-bin/usr/bin/cc
CPP=/nxb-bin/usr/bin/cpp
CXX=/nxb-bin/usr/bin/c++
NM=/nxb-bin/usr/bin/nm
LD=/nxb-bin/usr/bin/ld
OBJCOPY=/nxb-bin/usr/bin/objcopy
SIZE=/nxb-bin/usr/bin/size
STRIPBIN=/nxb-bin/usr/bin/strip
SED=/nxb-bin/usr/bin/sed
RANLIB=/nxb-bin/usr/bin/ranlib
YACC=/nxb-bin/usr/bin/yacc
MAKE=/nxb-bin/usr/bin/make
STRINGS=/nxb-bin/usr/bin/strings
AWK=/nxb-bin/usr/bin/awk
FLEX=/nxb-bin/usr/bin/flex
---End make.nxb.conf---
--Resource limits--
cpu time               (seconds, -t)  unlimited
file size           (512-blocks, -f)  unlimited
data seg size           (kbytes, -d)  33554432
stack size              (kbytes, -s)  524288
core file size      (512-blocks, -c)  unlimited
max memory size         (kbytes, -m)  unlimited
locked memory           (kbytes, -l)  unlimited
max user processes              (-u)  89999
open files                      (-n)  1024
virtual mem size        (kbytes, -v)  unlimited
swap limit              (kbytes, -w)  unlimited
socket buffer size       (bytes, -b)  unlimited
pseudo-terminals                (-p)  unlimited
kqueues                         (-k)  unlimited
umtx shared locks               (-o)  unlimited
--End resource limits--
=======================<phase: check-sanity   >============================
===>  License GPLv3 accepted by the user
===========================================================================
=======================<phase: pkg-depends    >============================
===>   kyototycoon-0.9.56_6 depends on file: /usr/local/sbin/pkg - not found
===>   Installing existing package /packages/All/pkg-1.16.3.txz
[130releng-riscv64-quarterly-job-03] Installing pkg-1.16.3...
[130releng-riscv64-quarterly-job-03] Extracting pkg-1.16.3: .......... done
===>   kyototycoon-0.9.56_6 depends on file: /usr/local/sbin/pkg - found
===>   Returning to build of kyototycoon-0.9.56_6
===========================================================================
=======================<phase: fetch-depends  >============================
===========================================================================
=======================<phase: fetch          >============================
===>  License GPLv3 accepted by the user
===> Fetching all distfiles required by kyototycoon-0.9.56_6 for building
===========================================================================
=======================<phase: checksum       >============================
===>  License GPLv3 accepted by the user
===> Fetching all distfiles required by kyototycoon-0.9.56_6 for building
=> SHA256 Checksum OK for kyototycoon-0.9.56.tar.gz.
===========================================================================
=======================<phase: extract-depends>============================
===========================================================================
=======================<phase: extract        >============================
===>  License GPLv3 accepted by the user
<snip>
./ktremotedb.h:414:16: warning: initialization of pointer of type 'char *' to null from a constant boolean expression [-Wbool-conversion]
        return false;
               ^~~~~
./ktremotedb.h:484:16: warning: initialization of pointer of type 'char *' to null from a constant boolean expression [-Wbool-conversion]
        return false;
               ^~~~~
In file included from ktplugdbvoid.cc:16:
In file included from ./ktplugdb.h:27:
./kttimeddb.h:1798:13: warning: private field 'vbuf_' is not used [-Wunused-private-field]
      char* vbuf_;
            ^
8 warnings generated.
/nxb-bin/usr/bin/c++ -O3 -m64 -O2 -pipe -march=rv64imafdc -mabi=lp64d  -fstack-protector-strong -fno-strict-aliasing   -std=gnu++98  -Wall -fPIC -fsigned-char -g0 -O2 -Wno-unused-but-set-variable -Wno-unused-but-set-parameter -shared -o ktplugdbvoid.so ktplugdbvoid.o -fstack-protector-strong  -L. -L/usr/local/lib -L/usr/local/lib -lkyototycoon -llzma -lz -lregex -ldl -lrt -lpthread -lm -lc 
/nxb-bin/usr/bin/c++ -c -fPIC -I. -I/usr/local/include -I/usr/local/include -DNDEBUG -D_GNU_SOURCE=1 -D_FILE_OFFSET_BITS=64 -D_REENTRANT -D__EXTENSIONS__ -UNDEBUG -D_KCUYIELD -D_KT_PREFIX="\"/usr/local\"" -D_KT_INCLUDEDIR="\"/usr/local/include\"" -D_KT_LIBDIR="\"/usr/local/lib\"" -D_KT_BINDIR="\"/usr/local/bin\"" -D_KT_LIBEXECDIR="\"/usr/local/libexec\"" -D_KT_APPINC="\"-I/usr/local/include\"" -D_KT_APPLIBS="\"-L/usr/local/lib -lkyototycoon -llzma -lz -lregex -ldl -lrt -lpthread -lm -lc \"" -O3 -m64 -O2 -pipe -march=rv64imafdc -mabi=lp64d  -fstack-protector-strong -fno-strict-aliasing   -std=gnu++98  -Wall -fPIC -fsigned-char -g0 -O2 -Wno-unused-but-set-variable -Wno-unused-but-set-parameter ktutiltest.cc
warning: unknown warning option '-Wno-unused-but-set-variable'; did you mean '-Wno-unused-const-variable'? [-Wunknown-warning-option]
warning: unknown warning option '-Wno-unused-but-set-parameter'; did you mean '-Wno-unused-parameter'? [-Wunknown-warning-option]
In file included from ktutiltest.cc:16:
In file included from ./cmdcommon.h:24:
./ktulog.h:51:23: warning: in-class initializer for static data member of type 'const double' is a GNU extension [-Wgnu-static-float-init]
  static const double FLUSHWAIT = 0.1;
                      ^           ~~~
In file included from ktutiltest.cc:16:
In file included from ./cmdcommon.h:28:
./ktremotedb.h:301:16: warning: initialization of pointer of type 'char *' to null from a constant boolean expression [-Wbool-conversion]
        return false;
               ^~~~~
./ktremotedb.h:353:16: warning: initialization of pointer of type 'char *' to null from a constant boolean expression [-Wbool-conversion]
        return false;
               ^~~~~
./ktremotedb.h:414:16: warning: initialization of pointer of type 'char *' to null from a constant boolean expression [-Wbool-conversion]
        return false;
               ^~~~~
./ktremotedb.h:484:16: warning: initialization of pointer of type 'char *' to null from a constant boolean expression [-Wbool-conversion]
        return false;
               ^~~~~
In file included from ktutiltest.cc:16:
In file included from ./cmdcommon.h:26:
./kttimeddb.h:1798:13: warning: private field 'vbuf_' is not used [-Wunused-private-field]
      char* vbuf_;
            ^
In file included from ktutiltest.cc:16:
./cmdcommon.h:102:17: warning: private field 'strm_' is not used [-Wunused-private-field]
  std::ostream* strm_;
                ^
9 warnings generated.
/nxb-bin/usr/bin/c++ -O3 -m64 -O2 -pipe -march=rv64imafdc -mabi=lp64d  -fstack-protector-strong -fno-strict-aliasing   -std=gnu++98  -Wall -fPIC -fsigned-char -g0 -O2 -Wno-unused-but-set-variable -Wno-unused-but-set-parameter -o ktutiltest ktutiltest.o -fstack-protector-strong  -L. -L/usr/local/lib -L/usr/local/lib  -lkyototycoon -llzma -lz -lregex -ldl -lrt -lpthread -lm -lc 
ld: error: undefined symbol: kyotocabinet::getenv(char const*)
>>> referenced by ktutiltest.cc
>>>               ktutiltest.o:(main)

ld: error: undefined symbol: kyotocabinet::time()
>>> referenced by ktutiltest.cc
>>>               ktutiltest.o:(main)
>>> referenced by ktutiltest.cc
>>>               ktutiltest.o:(main)
>>> referenced by ktutiltest.cc
>>>               ktutiltest.o:(main)
>>> referenced 7 more times

ld: error: undefined symbol: kyotocabinet::setstdiobin()
>>> referenced by ktutiltest.cc
>>>               ktutiltest.o:(main)

ld: error: undefined symbol: kyotocabinet::File::status(std::__1::basic_string<char, std::__1::char_traits<char>, std::__1::allocator<char> > const&, kyotocabinet::File::Status*)
>>> referenced by ktutiltest.cc
>>>               ktutiltest.o:(main)
>>> referenced by ktutiltest.cc
>>>               ktutiltest.o:(kyototycoon::UpdateLogger::open(std::__1::basic_string<char, std::__1::char_traits<char>, std::__1::allocator<char> > const&, long, double))
>>> referenced by ktutiltest.cc
>>>               ktutiltest.o:(kyototycoon::UpdateLogger::Reader::read_impl(unsigned long*, unsigned long*))

ld: error: undefined symbol: kyotocabinet::Thread::Thread()
>>> referenced by ktutiltest.cc
>>>               ktutiltest.o:(main)
>>> referenced by ktutiltest.cc
>>>               ktutiltest.o:(main)
>>> referenced by ktutiltest.cc
>>>               ktutiltest.o:(main)
>>> referenced 2 more times

ld: error: undefined symbol: kyotocabinet::SpinLock::SpinLock()
>>> referenced by ktutiltest.cc
>>>               ktutiltest.o:(main)
>>> referenced by ktutiltest.cc
>>>               ktutiltest.o:(kyototycoon::UpdateLogger::UpdateLogger())
>>> referenced by ktutiltest.cc
>>>               ktutiltest.o:(kyototycoon::UpdateLogger::UpdateLogger())

ld: error: undefined symbol: kyotocabinet::Thread::start()
>>> referenced by ktutiltest.cc
>>>               ktutiltest.o:(main)
>>> referenced by ktutiltest.cc
>>>               ktutiltest.o:(main)
>>> referenced by ktutiltest.cc
>>>               ktutiltest.o:(main)
>>> referenced 2 more times

ld: error: undefined symbol: kyotocabinet::Thread::join()
>>> referenced by ktutiltest.cc
>>>               ktutiltest.o:(main)
>>> referenced by ktutiltest.cc
>>>               ktutiltest.o:(main)
>>> referenced by ktutiltest.cc
>>>               ktutiltest.o:(main)
>>> referenced 2 more times

ld: error: undefined symbol: kyotocabinet::AtomicInt64::get() const
>>> referenced by ktutiltest.cc
>>>               ktutiltest.o:(main)
>>> referenced by ktutiltest.cc
>>>               ktutiltest.o:(main)

ld: error: undefined symbol: kyotocabinet::Thread::sleep(double)
>>> referenced by ktutiltest.cc
>>>               ktutiltest.o:(main)
>>> referenced by ktutiltest.cc
>>>               ktutiltest.o:(proculog(char const*, long, int, long)::Reader::run())
>>> referenced by ktutiltest.cc
>>>               ktutiltest.o:(kyototycoon::UpdateLogger::AutoFlusher::run())

ld: error: undefined symbol: kyotocabinet::Thread::~Thread()
>>> referenced by ktutiltest.cc
>>>               ktutiltest.o:(main)
>>> referenced by ktutiltest.cc
>>>               ktutiltest.o:(main)
>>> referenced by ktutiltest.cc
>>>               ktutiltest.o:(main)
>>> referenced 157 more times

ld: error: undefined symbol: kyotocabinet::SpinLock::~SpinLock()
>>> referenced by ktutiltest.cc
>>>               ktutiltest.o:(main)
>>> referenced by ktutiltest.cc
>>>               ktutiltest.o:(main)
>>> referenced by ktutiltest.cc
>>>               ktutiltest.o:(main)
>>> referenced 16 more times

ld: error: undefined symbol: kyotocabinet::getpid()
>>> referenced by ktutiltest.cc
>>>               ktutiltest.o:(main)

ld: error: undefined symbol: kyotocabinet::File::File()
>>> referenced by ktutiltest.cc
>>>               ktutiltest.o:(proculog(char const*, long, int, long)::Reader::run())
>>> referenced by ktutiltest.cc
>>>               ktutiltest.o:(kyototycoon::UpdateLogger::UpdateLogger())

ld: error: undefined symbol: kyotocabinet::SpinRWLock::lock_reader()
>>> referenced by ktutiltest.cc
>>>               ktutiltest.o:(proculog(char const*, long, int, long)::Reader::run())
>>> referenced by ktutiltest.cc
>>>               ktutiltest.o:(kyototycoon::UpdateLogger::Reader::open(kyototycoon::UpdateLogger*, unsigned long))
>>> referenced by ktutiltest.cc
>>>               ktutiltest.o:(kyototycoon::UpdateLogger::Reader::open(kyototycoon::UpdateLogger*, unsigned long))
>>> referenced 2 more times

ld: error: undefined symbol: kyotocabinet::SpinRWLock::unlock()
>>> referenced by ktutiltest.cc
>>>               ktutiltest.o:(proculog(char const*, long, int, long)::Reader::run())
>>> referenced by ktutiltest.cc
>>>               ktutiltest.o:(kyototycoon::UpdateLogger::flush())
>>> referenced by ktutiltest.cc
>>>               ktutiltest.o:(kyototycoon::UpdateLogger::Reader::open(kyototycoon::UpdateLogger*, unsigned long))
>>> referenced 5 more times

ld: error: undefined symbol: kyotocabinet::AtomicInt64::add(long)
>>> referenced by ktutiltest.cc
>>>               ktutiltest.o:(proculog(char const*, long, int, long)::Reader::run())

ld: error: undefined symbol: kyotocabinet::File::close()
>>> referenced by ktutiltest.cc
>>>               ktutiltest.o:(proculog(char const*, long, int, long)::Reader::run())
>>> referenced by ktutiltest.cc
>>>               ktutiltest.o:(kyototycoon::UpdateLogger::open(std::__1::basic_string<char, std::__1::char_traits<char>, std::__1::allocator<char> > const&, long, double))
>>> referenced by ktutiltest.cc
>>>               ktutiltest.o:(kyototycoon::UpdateLogger::open(std::__1::basic_string<char, std::__1::char_traits<char>, std::__1::allocator<char> > const&, long, double))
>>> referenced 6 more times

ld: error: undefined symbol: kyotocabinet::File::~File()
>>> referenced by ktutiltest.cc
>>>               ktutiltest.o:(proculog(char const*, long, int, long)::Reader::run())
>>> referenced by ktutiltest.cc
>>>               ktutiltest.o:(kyototycoon::UpdateLogger::UpdateLogger())
>>> referenced by ktutiltest.cc
>>>               ktutiltest.o:(kyototycoon::UpdateLogger::~UpdateLogger())
>>> referenced 3 more times

ld: error: undefined symbol: kyotocabinet::getsysinfo(std::__1::map<std::__1::basic_string<char, std::__1::char_traits<char>, std::__1::allocator<char> >, std::__1::basic_string<char, std::__1::char_traits<char>, std::__1::allocator<char> >, std::__1::less<std::__1::basic_string<char, std::__1::char_traits<char>, std::__1::allocator<char> > >, std::__1::allocator<std::__1::pair<std::__1::basic_string<char, std::__1::char_traits<char>, std::__1::allocator<char> > const, std::__1::basic_string<char, std::__1::char_traits<char>, std::__1::allocator<char> > > > >*)
>>> referenced by ktutiltest.cc
>>>               ktutiltest.o:(memusage())

ld: error: too many errors emitted, stopping now (use -error-limit=0 to see all errors)
c++: error: linker command failed with exit code 1 (use -v to see invocation)
gmake[1]: *** [Makefile:511: ktutiltest] Error 1
gmake[1]: Leaving directory '/wrkdirs/usr/ports/databases/kyototycoon/work/kyototycoon-0.9.56'
*** Error code 1

Stop.
make: stopped in /usr/ports/databases/kyototycoon
Received on Thu Jul 29 2021 - 04:19:54 UTC

Original text of this message