[package - 122powerpc64-quarterly][devel/robodoc] Failed for robodoc-4.99.44 in build

From: <pkg-fallout_at_FreeBSD.org>
Date: Thu, 29 Jul 2021 03:49:35 GMT
You are receiving this mail as a port that you maintain
is failing to build on the FreeBSD package build server.
Please investigate the failure and submit a PR to fix
build.

Maintainer:     krion_at_FreeBSD.org
Log URL:        http://foul1.nyi.freebsd.org/data/122powerpc64-quarterly/03c599c1eb7a/logs/robodoc-4.99.44.log
Build URL:      http://foul1.nyi.freebsd.org/build.html?mastername=122powerpc64-quarterly&build=03c599c1eb7a
Log:

=>> Building devel/robodoc
build started at Thu Jul 29 03:49:14 UTC 2021
port directory: /usr/ports/devel/robodoc
package name: robodoc-4.99.44
building for: FreeBSD 122powerpc64-quarterly-job-01 12.2-RELEASE FreeBSD 12.2-RELEASE powerpc
maintained by: krion_at_FreeBSD.org
Makefile ident: 
Poudriere version: 3.2.8-20-g137a4a48
Host OSVERSION: 1400008
Jail OSVERSION: 1202000
Job Id: 01

---Begin Environment---
SHELL=/bin/csh
OSVERSION=1202000
UNAME_v=FreeBSD 12.2-RELEASE
UNAME_r=12.2-RELEASE
BLOCKSIZE=K
MAIL=/var/mail/root
STATUS=1
HOME=/root
PATH=/sbin:/bin:/usr/sbin:/usr/bin:/usr/local/sbin:/usr/local/bin:/root/bin
LOCALBASE=/usr/local
USER=root
LIBEXECPREFIX=/usr/local/libexec/poudriere
POUDRIERE_VERSION=3.2.8-20-g137a4a48
MASTERMNT=/usr/local/poudriere/data/.m/122powerpc64-quarterly/ref
POUDRIERE_BUILD_TYPE=bulk
PACKAGE_BUILDING=yes
SAVED_TERM=
PWD=/usr/local/poudriere/data/.m/122powerpc64-quarterly/ref/.p/pool
P_PORTS_FEATURES=FLAVORS SELECTED_OPTIONS
MASTERNAME=122powerpc64-quarterly
SCRIPTPREFIX=/usr/local/share/poudriere
OLDPWD=/usr/local/poudriere/data/.m/122powerpc64-quarterly/ref/.p
SCRIPTPATH=/usr/local/share/poudriere/bulk.sh
POUDRIEREPATH=/usr/local/bin/poudriere
---End Environment---

---Begin Poudriere Port Flags/Env---
PORT_FLAGS=
PKGENV=
FLAVOR=
DEPENDS_ARGS=
MAKE_ARGS=
---End Poudriere Port Flags/Env---

---Begin OPTIONS List---
===> The following configuration options are available for robodoc-4.99.44:
     DOCS=on: Build and/or install documentation
     EXAMPLES=on: Build and/or install examples
===> Use 'make config' to modify these settings
---End OPTIONS List---

--MAINTAINER--
krion_at_FreeBSD.org
--End MAINTAINER--

--CONFIGURE_ARGS--
--prefix=/usr/local ${_LATE_CONFIGURE_ARGS}
--End CONFIGURE_ARGS--

--CONFIGURE_ENV--
XDG_DATA_HOME=/wrkdirs/usr/ports/devel/robodoc/work  XDG_CONFIG_HOME=/wrkdirs/usr/ports/devel/robodoc/work  HOME=/wrkdirs/usr/ports/devel/robodoc/work TMPDIR="/tmp" PATH=/wrkdirs/usr/ports/devel/robodoc/work/.bin:/sbin:/bin:/usr/sbin:/usr/bin:/usr/local/sbin:/usr/local/bin:/root/bin SHELL=/bin/sh CONFIG_SHELL=/bin/sh CONFIG_SITE=/usr/ports/Templates/config.site lt_cv_sys_max_cmd_len=524288
--End CONFIGURE_ENV--

--MAKE_ENV--
XDG_DATA_HOME=/wrkdirs/usr/ports/devel/robodoc/work  XDG_CONFIG_HOME=/wrkdirs/usr/ports/devel/robodoc/work  HOME=/wrkdirs/usr/ports/devel/robodoc/work TMPDIR="/tmp" PATH=/wrkdirs/usr/ports/devel/robodoc/work/.bin:/sbin:/bin:/usr/sbin:/usr/bin:/usr/local/sbin:/usr/local/bin:/root/bin NO_PIE=yes MK_DEBUG_FILES=no MK_KERNEL_SYMBOLS=no SHELL=/bin/sh NO_LINT=YES PREFIX=/usr/local  LOCALBASE=/usr/local  CC="cc" CFLAGS="-O2 -pipe  -fstack-protector-strong -fno-strict-aliasing "  CPP="cpp" CPPFLAGS=""  LDFLAGS=" -fstack-protector-strong " LIBS=""  CXX="c++" CXXFLAGS="-O2 -pipe -fstack-protector-strong -fno-strict-aliasing  "  MANPREFIX="/usr/local" BSD_INSTALL_PROGRAM="install  -s -m 555"  BSD_INSTALL_LIB="install  -s -m 0644"  BSD_INSTALL_SCRIPT="install  -m 555"  BSD_INSTALL_DATA="install  -m 0644"  BSD_INSTALL_MAN="install  -m 444"
--End MAKE_ENV--

--PLIST_SUB--
PORTDOCS="" PORTEXAMPLES="" OSREL=12.2 PREFIX=%D LOCALBASE=/usr/local  RESETPREFIX=/usr/local LIB32DIR=lib DOCSDIR="share/doc/robodoc"  EXAMPLESDIR="share/examples/robodoc"  DATADIR="share/robodoc"  WWWDIR="www/robodoc"  ETCDIR="etc/robodoc"
--End PLIST_SUB--

--SUB_LIST--
PREFIX=/usr/local LOCALBASE=/usr/local  DATADIR=/usr/local/share/robodoc DOCSDIR=/usr/local/share/doc/robodoc EXAMPLESDIR=/usr/local/share/examples/robodoc  WWWDIR=/usr/local/www/robodoc ETCDIR=/usr/local/etc/robodoc
--End SUB_LIST--

---Begin make.conf---
USE_PACKAGE_DEPENDS=yes
BATCH=yes
WRKDIRPREFIX=/wrkdirs
PORTSDIR=/usr/ports
PACKAGES=/packages
DISTDIR=/distfiles
PACKAGE_BUILDING=yes
PACKAGE_BUILDING_FLAVORS=yes
#### /usr/local/etc/poudriere.d/make.conf ####
# XXX: We really need this but cannot use it while 'make checksum' does not
# try the next mirror on checksum failure.  It currently retries the same
# failed mirror and then fails rather then trying another.  It *does*
# try the next if the size is mismatched though.
#MASTER_SITE_FREEBSD=yes
# Build ALLOW_MAKE_JOBS_PACKAGES with 2 jobs
MAKE_JOBS_NUMBER=2
#### /usr/ports/Mk/Scripts/ports_env.sh ####
_CCVERSION_921dbbb2=cc (GCC) 4.2.1 20070831 patched [FreeBSD] Copyright (C) 2007 Free Software Foundation, Inc. This is free software; see the source for copying conditions. There is NO warranty; not even for MERCHANTABILITY or FITNESS FOR A PARTICULAR PURPOSE.
_ALTCCVERSION_921dbbb2=none
_CXXINTERNAL_acaad9ca=Using built-in specs. Target: powerpc64-undermydesk-freebsd Configured with: FreeBSD/powerpc64 system compiler Thread model: posix gcc version 4.2.1 20070831 patched [FreeBSD] "/usr/bin/ld" "--eh-frame-hdr" "-Qy" "-melf64ppc_fbsd" "--enable-new-dtags" "-dynamic-linker" "/libexec/ld-elf.so.1" "/usr/lib/crt1.o" "/usr/lib/crti.o" "/usr/lib/crtbegin.o" "-L/usr/lib" "-L/usr/lib" "/dev/null" "-lstdc++" "-lm" "-lgcc_s" "-lgcc" "-lc" "-lgcc_s" "-lgcc" "/usr/lib/crtsavres.o" "/usr/lib/crtend.o" "/usr/lib/crtn.o"
CC_OUTPUT_921dbbb2_58173849=yes
CC_OUTPUT_921dbbb2_9bdba57c=yes
CC_OUTPUT_921dbbb2_6a4fe7f5=cc1: error: unrecognized command line option "-std=c11"
CC_OUTPUT_921dbbb2_6bcac02b=yes
CC_OUTPUT_921dbbb2_67d20829=yes
CC_OUTPUT_921dbbb2_bfa62e83=cc1: error: unrecognized command line option "-std=gnu11"
CC_OUTPUT_921dbbb2_f0b4d593=yes
CC_OUTPUT_921dbbb2_308abb44=cc1plus: error: unrecognized command line option "-std=c++0x"
CC_OUTPUT_921dbbb2_f00456e5=cc1plus: error: unrecognized command line option "-std=c++11"
CC_OUTPUT_921dbbb2_65ad290d=cc1plus: error: unrecognized command line option "-std=c++14"
CC_OUTPUT_921dbbb2_f2776b26=cc1plus: error: unrecognized command line option "-std=c++17"
CC_OUTPUT_921dbbb2_b2657cc3=yes
CC_OUTPUT_921dbbb2_380987f7=cc1plus: error: unrecognized command line option "-std=gnu++11"
CC_OUTPUT_921dbbb2_160933ec=cc1plus: error: unrecognized command line option "-std=gnu++14"
CC_OUTPUT_921dbbb2_fb62803b=cc1plus: error: unrecognized command line option "-std=gnu++17"
_OBJC_CCVERSION_921dbbb2=cc (GCC) 4.2.1 20070831 patched [FreeBSD] Copyright (C) 2007 Free Software Foundation, Inc. This is free software; see the source for copying conditions. There is NO warranty; not even for MERCHANTABILITY or FITNESS FOR A PARTICULAR PURPOSE.
_OBJC_ALTCCVERSION_921dbbb2=none
ARCH=powerpc64
PPC_ABI=ELFv1
OPSYS=FreeBSD
_OSRELEASE=12.2-RELEASE
OSREL=12.2
OSVERSION=1202000
PYTHONBASE=/usr/local
CONFIGURE_MAX_CMD_LEN=524288
HAVE_PORTS_ENV=1
#### Misc Poudriere ####
GID=0
UID=0
---End make.conf---
--Resource limits--
cpu time               (seconds, -t)  unlimited
file size           (512-blocks, -f)  unlimited
data seg size           (kbytes, -d)  33554432
stack size              (kbytes, -s)  524288
core file size      (512-blocks, -c)  unlimited
max memory size         (kbytes, -m)  unlimited
locked memory           (kbytes, -l)  unlimited
max user processes              (-u)  89999
open files                      (-n)  1024
virtual mem size        (kbytes, -v)  unlimited
swap limit              (kbytes, -w)  unlimited
socket buffer size       (bytes, -b)  unlimited
pseudo-terminals                (-p)  unlimited
kqueues                         (-k)  unlimited
umtx shared locks               (-o)  unlimited
--End resource limits--
=======================<phase: check-sanity   >============================
===>  License GPLv3+ accepted by the user
===========================================================================
=======================<phase: pkg-depends    >============================
===>   robodoc-4.99.44 depends on file: /usr/local/sbin/pkg - not found
===>   Installing existing package /packages/All/pkg-1.16.3.txz
[122powerpc64-quarterly-job-01] Installing pkg-1.16.3...
[122powerpc64-quarterly-job-01] Extracting pkg-1.16.3: .......... done
===>   robodoc-4.99.44 depends on file: /usr/local/sbin/pkg - found
===>   Returning to build of robodoc-4.99.44
===========================================================================
=======================<phase: fetch-depends  >============================
===========================================================================
=======================<phase: fetch          >============================
===>  License GPLv3+ accepted by the user
===> Fetching all distfiles required by robodoc-4.99.44 for building
===========================================================================
=======================<phase: checksum       >============================
===>  License GPLv3+ accepted by the user
===> Fetching all distfiles required by robodoc-4.99.44 for building
=> SHA256 Checksum OK for robodoc-4.99.44.tar.gz.
===========================================================================
=======================<phase: extract-depends>============================
===========================================================================
=======================<phase: extract        >============================
===>  License GPLv3+ accepted by the user
===> Fetching all distfiles required by robodoc-4.99.44 for building
===>  Extracting for robodoc-4.99.44
=> SHA256 Checksum OK for robodoc-4.99.44.tar.gz.
===========================================================================
=======================<phase: patch-depends  >============================
===========================================================================
=======================<phase: patch          >============================
===>  Patching for robodoc-4.99.44
===========================================================================
=======================<phase: build-depends  >============================
===========================================================================
=======================<phase: lib-depends    >============================
===========================================================================
=======================<phase: configure      >============================
===>  Configuring for robodoc-4.99.44
configure: loading site script /usr/ports/Templates/config.site
checking for a BSD-compatible install... /usr/bin/install -c
checking whether build environment is sane... yes
checking for a thread-safe mkdir -p... (cached) /bin/mkdir -p
checking for gawk... (cached) /usr/bin/awk
checking whether make sets $(MAKE)... yes
checking whether make supports nested variables... yes
checking whether make sets $(MAKE)... (cached) yes
checking for gcc... cc
checking whether the C compiler works... yes
checking for C compiler default output file name... a.out
checking for suffix of executables... 
checking whether we are cross compiling... no
checking for suffix of object files... o
checking whether we are using the GNU C compiler... yes
checking whether cc accepts -g... yes
checking for cc option to accept ISO C89... none needed
checking whether cc understands -c and -o together... yes
checking whether make supports the include directive... yes (GNU style)
checking dependency style of cc... gcc3
checking how to run the C preprocessor... cpp
checking for grep that handles long lines and -e... (cached) /usr/bin/grep
checking for egrep... (cached) /usr/bin/egrep
checking for ANSI C header files... (cached) yes
checking build system type... powerpc64-portbld-freebsd12.2
checking host system type... powerpc64-portbld-freebsd12.2
checking for an ANSI C-conforming const... yes
checking for sys/types.h... (cached) yes
checking for sys/stat.h... (cached) yes
checking for stdlib.h... (cached) yes
checking for string.h... (cached) yes
checking for memory.h... (cached) yes
checking for strings.h... (cached) yes
checking for inttypes.h... (cached) yes
checking for stdint.h... (cached) yes
checking for unistd.h... (cached) yes
checking for size_t... (cached) yes
checking for strftime... (cached) yes
checking for vprintf... (cached) yes
checking for _doprnt... no
checking for pid_t... (cached) yes
checking for vfork.h... (cached) no
checking for fork... (cached) yes
checking for vfork... (cached) yes
checking for working fork... yes
checking for working vfork... (cached) yes
checking for snprintf... (cached) yes
checking for strstr... (cached) yes
checking for symlink... (cached) yes
checking that generated files are newer than configure... done
configure: creating ./config.status
config.status: creating makefile
config.status: creating Docs/makefile
config.status: creating Docs/robodoc.1
config.status: creating Docs/robohdrs.1
config.status: creating Source/makefile
config.status: creating Source/config.h
config.status: executing depfiles commands
===========================================================================
=======================<phase: build          >============================
===>  Building for robodoc-4.99.44
--- all-recursive ---
Making all in Source
--- all ---
/usr/bin/make  all-am
--- optioncheck.o ---
--- analyser.o ---
cc -DHAVE_CONFIG_H -I.      -O2 -pipe  -fstack-protector-strong -fno-strict-aliasing -MT analyser.o -MD -MP -MF .deps/analyser.Tpo -c -o analyser.o analyser.c
--- optioncheck.o ---
cc -DHAVE_CONFIG_H -I.      -O2 -pipe  -fstack-protector-strong -fno-strict-aliasing -MT optioncheck.o -MD -MP -MF .deps/optioncheck.Tpo -c -o optioncheck.o optioncheck.c
mv -f .deps/optioncheck.Tpo .deps/optioncheck.Po
--- generator.o ---
cc -DHAVE_CONFIG_H -I.      -O2 -pipe  -fstack-protector-strong -fno-strict-aliasing -MT generator.o -MD -MP -MF .deps/generator.Tpo -c -o generator.o generator.c
--- analyser.o ---
mv -f .deps/analyser.Tpo .deps/analyser.Po
--- headers.o ---
cc -DHAVE_CONFIG_H -I.      -O2 -pipe  -fstack-protector-strong -fno-strict-aliasing -MT headers.o -MD -MP -MF .deps/headers.Tpo -c -o headers.o headers.c
--- generator.o ---
mv -f .deps/generator.Tpo .deps/generator.Po
--- headertypes.o ---
cc -DHAVE_CONFIG_H -I.      -O2 -pipe  -fstack-protector-strong -fno-strict-aliasing -MT headertypes.o -MD -MP -MF .deps/headertypes.Tpo -c -o headertypes.o headertypes.c
--- headers.o ---
mv -f .deps/headers.Tpo .deps/headers.Po
--- items.o ---
cc -DHAVE_CONFIG_H -I.      -O2 -pipe  -fstack-protector-strong -fno-strict-aliasing -MT items.o -MD -MP -MF .deps/items.Tpo -c -o items.o items.c
--- headertypes.o ---
mv -f .deps/headertypes.Tpo .deps/headertypes.Po
--- links.o ---
cc -DHAVE_CONFIG_H -I.      -O2 -pipe  -fstack-protector-strong -fno-strict-aliasing -MT links.o -MD -MP -MF .deps/links.Tpo -c -o links.o links.c
--- items.o ---
mv -f .deps/items.Tpo .deps/items.Po
--- globals.o ---
cc -DHAVE_CONFIG_H -I.      -O2 -pipe  -fstack-protector-strong -fno-strict-aliasing -MT globals.o -MD -MP -MF .deps/globals.Tpo -c -o globals.o globals.c
mv -f .deps/globals.Tpo .deps/globals.Po
--- robodoc.o ---
--- links.o ---
mv -f .deps/links.Tpo .deps/links.Po
--- robodoc.o ---
cc -DHAVE_CONFIG_H -I.      -O2 -pipe  -fstack-protector-strong -fno-strict-aliasing -MT robodoc.o -MD -MP -MF .deps/robodoc.Tpo -c -o robodoc.o robodoc.c
--- util.o ---
cc -DHAVE_CONFIG_H -I.      -O2 -pipe  -fstack-protector-strong -fno-strict-aliasing -MT util.o -MD -MP -MF .deps/util.Tpo -c -o util.o util.c
util.c: In function 'strtolower':
util.c:1431: error: 'for' loop initial declaration used outside C99 mode
*** [util.o] Error code 1

make[3]: stopped in /wrkdirs/usr/ports/devel/robodoc/work/robodoc-4.99.44/Source
--- robodoc.o ---
mv -f .deps/robodoc.Tpo .deps/robodoc.Po
1 error

make[3]: stopped in /wrkdirs/usr/ports/devel/robodoc/work/robodoc-4.99.44/Source
===> Compilation failed unexpectedly.
Try to set MAKE_JOBS_UNSAFE=yes and rebuild before reporting the failure to
the maintainer.
*** Error code 1

Stop.
make: stopped in /usr/ports/devel/robodoc
Received on Thu Jul 29 2021 - 03:49:35 UTC

Original text of this message