[package - 122powerpc64-quarterly][ftp/libfilezilla] Failed for libfilezilla-0.15.1_3 in build

From: <pkg-fallout_at_FreeBSD.org>
Date: Thu, 29 Jul 2021 02:58:45 GMT
You are receiving this mail as a port that you maintain
is failing to build on the FreeBSD package build server.
Please investigate the failure and submit a PR to fix
build.

Maintainer:     pi_at_FreeBSD.org
Log URL:        http://foul1.nyi.freebsd.org/data/122powerpc64-quarterly/03c599c1eb7a/logs/libfilezilla-0.15.1_3.log
Build URL:      http://foul1.nyi.freebsd.org/build.html?mastername=122powerpc64-quarterly&build=03c599c1eb7a
Log:

=>> Building ftp/libfilezilla
build started at Thu Jul 29 02:57:31 UTC 2021
port directory: /usr/ports/ftp/libfilezilla
package name: libfilezilla-0.15.1_3
building for: FreeBSD 122powerpc64-quarterly-job-10 12.2-RELEASE FreeBSD 12.2-RELEASE powerpc
maintained by: pi_at_FreeBSD.org
Makefile ident: 
Poudriere version: 3.2.8-20-g137a4a48
Host OSVERSION: 1400008
Jail OSVERSION: 1202000
Job Id: 10

---Begin Environment---
SHELL=/bin/csh
OSVERSION=1202000
UNAME_v=FreeBSD 12.2-RELEASE
UNAME_r=12.2-RELEASE
BLOCKSIZE=K
MAIL=/var/mail/root
STATUS=1
HOME=/root
PATH=/sbin:/bin:/usr/sbin:/usr/bin:/usr/local/sbin:/usr/local/bin:/root/bin
LOCALBASE=/usr/local
USER=root
LIBEXECPREFIX=/usr/local/libexec/poudriere
POUDRIERE_VERSION=3.2.8-20-g137a4a48
MASTERMNT=/usr/local/poudriere/data/.m/122powerpc64-quarterly/ref
POUDRIERE_BUILD_TYPE=bulk
PACKAGE_BUILDING=yes
SAVED_TERM=
PWD=/usr/local/poudriere/data/.m/122powerpc64-quarterly/ref/.p/pool
P_PORTS_FEATURES=FLAVORS SELECTED_OPTIONS
MASTERNAME=122powerpc64-quarterly
SCRIPTPREFIX=/usr/local/share/poudriere
OLDPWD=/usr/local/poudriere/data/.m/122powerpc64-quarterly/ref/.p
SCRIPTPATH=/usr/local/share/poudriere/bulk.sh
POUDRIEREPATH=/usr/local/bin/poudriere
---End Environment---

---Begin Poudriere Port Flags/Env---
PORT_FLAGS=
PKGENV=
FLAVOR=
DEPENDS_ARGS=
MAKE_ARGS=
---End Poudriere Port Flags/Env---

---Begin OPTIONS List---
---End OPTIONS List---

--MAINTAINER--
pi_at_FreeBSD.org
--End MAINTAINER--

--CONFIGURE_ARGS--
--prefix=/usr/local ${_LATE_CONFIGURE_ARGS}
--End CONFIGURE_ARGS--

--CONFIGURE_ENV--
MAKE=gmake PKG_CONFIG=pkgconf XDG_DATA_HOME=/wrkdirs/usr/ports/ftp/libfilezilla/work  XDG_CONFIG_HOME=/wrkdirs/usr/ports/ftp/libfilezilla/work  HOME=/wrkdirs/usr/ports/ftp/libfilezilla/work TMPDIR="/tmp" PATH=/wrkdirs/usr/ports/ftp/libfilezilla/work/.bin:/sbin:/bin:/usr/sbin:/usr/bin:/usr/local/sbin:/usr/local/bin:/root/bin SHELL=/bin/sh CONFIG_SHELL=/bin/sh ADDR2LINE="/usr/local/bin/addr2line" AR="/usr/local/bin/ar" AS="/usr/local/bin/as" CPPFILT="/usr/local/bin/c++filt" GPROF="/usr/local/bin/gprof" LD="/usr/local/bin/ld" NM="/usr/local/bin/nm" OBJCOPY="/usr/local/bin/objcopy" OBJDUMP="/usr/local/bin/objdump" RANLIB="/usr/local/bin/ranlib" READELF="/usr/local/bin/readelf" SIZE="/usr/local/bin/size" STRINGS="/usr/local/bin/strings" CMAKE_PREFIX_PATH="/usr/local" CONFIG_SITE=/usr/ports/Templates/config.site lt_cv_sys_max_cmd_len=524288
--End CONFIGURE_ENV--

--MAKE_ENV--
XDG_DATA_HOME=/wrkdirs/usr/ports/ftp/libfilezilla/work  XDG_CONFIG_HOME=/wrkdirs/usr/ports/ftp/libfilezilla/work  HOME=/wrkdirs/usr/ports/ftp/libfilezilla/work TMPDIR="/tmp" PATH=/wrkdirs/usr/ports/ftp/libfilezilla/work/.bin:/sbin:/bin:/usr/sbin:/usr/bin:/usr/local/sbin:/usr/local/bin:/root/bin NO_PIE=yes MK_DEBUG_FILES=no MK_KERNEL_SYMBOLS=no SHELL=/bin/sh NO_LINT=YES ADDR2LINE="/usr/local/bin/addr2line" AR="/usr/local/bin/ar" AS="/usr/local/bin/as" CPPFILT="/usr/local/bin/c++filt" GPROF="/usr/local/bin/gprof" LD="/usr/local/bin/ld" NM="/usr/local/bin/nm" OBJCOPY="/usr/local/bin/objcopy" OBJDUMP="/usr/local/bin/objdump" RANLIB="/usr/local/bin/ranlib" READELF="/usr/local/bin/readelf" SIZE="/usr/local/bin/size" STRINGS="/usr/local/bin/strings" PREFIX=/usr/local  LOCALBASE=/usr/local  CC="gcc10" CFLAGS="-O2 -pipe  -fstack-protector-strong -Wl,-rpath=/usr/local/lib/gcc10 -isystem /usr/local/include -fno-strict-aliasing "  CPP="cpp10" CPPFLAGS="-isystem /usr/local/include"  LDFLAGS=" -fs
 tack-protector-strong -Wl,-rpath=/usr/local/lib/gcc10 -L/usr/local/lib/gcc10 " LIBS="-L/usr/local/lib"  CXX="g++10" CXXFLAGS="-O2 -pipe  -fstack-protector-strong -Wl,-rpath=/usr/local/lib/gcc10  -Wl,-rpath=/usr/local/lib/gcc10 -isystem /usr/local/include "  MANPREFIX="/usr/local" BSD_INSTALL_PROGRAM="install  -s -m 555"  BSD_INSTALL_LIB="install  -s -m 0644"  BSD_INSTALL_SCRIPT="install  -m 555"  BSD_INSTALL_DATA="install  -m 0644"  BSD_INSTALL_MAN="install  -m 444"
--End MAKE_ENV--

--PLIST_SUB--
OSREL=12.2 PREFIX=%D LOCALBASE=/usr/local  RESETPREFIX=/usr/local LIB32DIR=lib DOCSDIR="share/doc/libfilezilla"  EXAMPLESDIR="share/examples/libfilezilla"  DATADIR="share/libfilezilla"  WWWDIR="www/libfilezilla"  ETCDIR="etc/libfilezilla"
--End PLIST_SUB--

--SUB_LIST--
PREFIX=/usr/local LOCALBASE=/usr/local  DATADIR=/usr/local/share/libfilezilla DOCSDIR=/usr/local/share/doc/libfilezilla EXAMPLESDIR=/usr/local/share/examples/libfilezilla  WWWDIR=/usr/local/www/libfilezilla ETCDIR=/usr/local/etc/libfilezilla
--End SUB_LIST--

---Begin make.conf---
USE_PACKAGE_DEPENDS=yes
BATCH=yes
WRKDIRPREFIX=/wrkdirs
PORTSDIR=/usr/ports
PACKAGES=/packages
DISTDIR=/distfiles
PACKAGE_BUILDING=yes
PACKAGE_BUILDING_FLAVORS=yes
#### /usr/local/etc/poudriere.d/make.conf ####
# XXX: We really need this but cannot use it while 'make checksum' does not
# try the next mirror on checksum failure.  It currently retries the same
# failed mirror and then fails rather then trying another.  It *does*
# try the next if the size is mismatched though.
#MASTER_SITE_FREEBSD=yes
# Build ALLOW_MAKE_JOBS_PACKAGES with 2 jobs
MAKE_JOBS_NUMBER=2
#### /usr/ports/Mk/Scripts/ports_env.sh ####
_CCVERSION_921dbbb2=cc (GCC) 4.2.1 20070831 patched [FreeBSD] Copyright (C) 2007 Free Software Foundation, Inc. This is free software; see the source for copying conditions. There is NO warranty; not even for MERCHANTABILITY or FITNESS FOR A PARTICULAR PURPOSE.
_ALTCCVERSION_921dbbb2=none
_CXXINTERNAL_acaad9ca=Using built-in specs. Target: powerpc64-undermydesk-freebsd Configured with: FreeBSD/powerpc64 system compiler Thread model: posix gcc version 4.2.1 20070831 patched [FreeBSD] "/usr/bin/ld" "--eh-frame-hdr" "-Qy" "-melf64ppc_fbsd" "--enable-new-dtags" "-dynamic-linker" "/libexec/ld-elf.so.1" "/usr/lib/crt1.o" "/usr/lib/crti.o" "/usr/lib/crtbegin.o" "-L/usr/lib" "-L/usr/lib" "/dev/null" "-lstdc++" "-lm" "-lgcc_s" "-lgcc" "-lc" "-lgcc_s" "-lgcc" "/usr/lib/crtsavres.o" "/usr/lib/crtend.o" "/usr/lib/crtn.o"
CC_OUTPUT_921dbbb2_58173849=yes
CC_OUTPUT_921dbbb2_9bdba57c=yes
CC_OUTPUT_921dbbb2_6a4fe7f5=cc1: error: unrecognized command line option "-std=c11"
CC_OUTPUT_921dbbb2_6bcac02b=yes
CC_OUTPUT_921dbbb2_67d20829=yes
CC_OUTPUT_921dbbb2_bfa62e83=cc1: error: unrecognized command line option "-std=gnu11"
CC_OUTPUT_921dbbb2_f0b4d593=yes
CC_OUTPUT_921dbbb2_308abb44=cc1plus: error: unrecognized command line option "-std=c++0x"
CC_OUTPUT_921dbbb2_f00456e5=cc1plus: error: unrecognized command line option "-std=c++11"
CC_OUTPUT_921dbbb2_65ad290d=cc1plus: error: unrecognized command line option "-std=c++14"
CC_OUTPUT_921dbbb2_f2776b26=cc1plus: error: unrecognized command line option "-std=c++17"
CC_OUTPUT_921dbbb2_b2657cc3=yes
CC_OUTPUT_921dbbb2_380987f7=cc1plus: error: unrecognized command line option "-std=gnu++11"
CC_OUTPUT_921dbbb2_160933ec=cc1plus: error: unrecognized command line option "-std=gnu++14"
CC_OUTPUT_921dbbb2_fb62803b=cc1plus: error: unrecognized command line option "-std=gnu++17"
_OBJC_CCVERSION_921dbbb2=cc (GCC) 4.2.1 20070831 patched [FreeBSD] Copyright (C) 2007 Free Software Foundation, Inc. This is free software; see the source for copying conditions. There is NO warranty; not even for MERCHANTABILITY or FITNESS FOR A PARTICULAR PURPOSE.
_OBJC_ALTCCVERSION_921dbbb2=none
ARCH=powerpc64
PPC_ABI=ELFv1
OPSYS=FreeBSD
_OSRELEASE=12.2-RELEASE
OSREL=12.2
OSVERSION=1202000
PYTHONBASE=/usr/local
CONFIGURE_MAX_CMD_LEN=524288
HAVE_PORTS_ENV=1
#### Misc Poudriere ####
GID=0
UID=0
---End make.conf---
--Resource limits--
cpu time               (seconds, -t)  unlimited
file size           (512-blocks, -f)  unlimited
data seg size           (kbytes, -d)  33554432
stack size              (kbytes, -s)  524288
core file size      (512-blocks, -c)  unlimited
max memory size         (kbytes, -m)  unlimited
locked memory           (kbytes, -l)  unlimited
max user processes              (-u)  89999
open files                      (-n)  1024
virtual mem size        (kbytes, -v)  unlimited
swap limit              (kbytes, -w)  unlimited
socket buffer size       (bytes, -b)  unlimited
pseudo-terminals                (-p)  unlimited
kqueues                         (-k)  unlimited
umtx shared locks               (-o)  unlimited
--End resource limits--
=======================<phase: check-sanity   >============================
===>  License GPLv2+ accepted by the user
===========================================================================
=======================<phase: pkg-depends    >============================
===>   libfilezilla-0.15.1_3 depends on file: /usr/local/sbin/pkg - not found
===>   Installing existing package /packages/All/pkg-1.16.3.txz
[122powerpc64-quarterly-job-10] Installing pkg-1.16.3...
[122powerpc64-quarterly-job-10] Extracting pkg-1.16.3: .......... done
===>   libfilezilla-0.15.1_3 depends on file: /usr/local/sbin/pkg - found
===>   Returning to build of libfilezilla-0.15.1_3
===========================================================================
=======================<phase: fetch-depends  >============================
===========================================================================
=======================<phase: fetch          >============================
===>  License GPLv2+ accepted by the user
===> Fetching all distfiles required by libfilezilla-0.15.1_3 for building
===========================================================================
=======================<phase: checksum       >============================
===>  License GPLv2+ accepted by the user
===> Fetching all distfiles required by libfilezilla-0.15.1_3 for building
=> SHA256 Checksum OK for libfilezilla-0.15.1.tar.bz2.
===========================================================================
=======================<phase: extract-depends>============================
===========================================================================
=======================<phase: extract        >============================
===>  License GPLv2+ accepted by the user
===> Fetching all distfiles required by libfilezilla-0.15.1_3 for building
===>  Extracting for libfilezilla-0.15.1_3
=> SHA256 Checksum OK for libfilezilla-0.15.1.tar.bz2.
===========================================================================
=======================<phase: patch-depends  >============================
===========================================================================
=======================<phase: patch          >============================
===>  Patching for libfilezilla-0.15.1_3
===========================================================================
=======================<phase: build-depends  >============================
===>   libfilezilla-0.15.1_3 depends on package: gmake>=4.3 - not found
===>   Installing existing package /packages/All/gmake-4.3_2.txz
[122powerpc64-quarterly-job-10] Installing gmake-4.3_2...
[122powerpc64-quarterly-job-10] `-- Installing gettext-runtime-0.21...
[122powerpc64-quarterly-job-10] |   `-- Installing indexinfo-0.3.1...
[122powerpc64-quarterly-job-10] |   `-- Extracting indexinfo-0.3.1: .... done
[122powerpc64-quarterly-job-10] `-- Extracting gettext-runtime-0.21: .......... done
[122powerpc64-quarterly-job-10] Extracting gmake-4.3_2: .......... done
===>   libfilezilla-0.15.1_3 depends on package: gmake>=4.3 - found
===>   Returning to build of libfilezilla-0.15.1_3
===>   libfilezilla-0.15.1_3 depends on package: pkgconf>=1.3.0_1 - not found
===>   Installing existing package /packages/All/pkgconf-1.7.4,1.txz
[122powerpc64-quarterly-job-10] Installing pkgconf-1.7.4,1...
[122powerpc64-quarterly-job-10] Extracting pkgconf-1.7.4,1: .......... done
===>   libfilezilla-0.15.1_3 depends on package: pkgconf>=1.3.0_1 - found
===>   Returning to build of libfilezilla-0.15.1_3
===>   libfilezilla-0.15.1_3 depends on executable: gcc10 - not found
===>   Installing existing package /packages/All/gcc10-10.3.0.txz
[122powerpc64-quarterly-job-10] Installing gcc10-10.3.0...
[122powerpc64-quarterly-job-10] `-- Installing binutils-2.33.1_4,1...
[122powerpc64-quarterly-job-10] `-- Extracting binutils-2.33.1_4,1: .......... done
<snip>
checking whether the linker accepts -Wl,-no_weak_imports... no
checking whether g++10 supports C++14 features by default... yes
checking for whether we need -stdlib=libc++... no
checking for special C compiler options needed for large files... no
checking for _FILE_OFFSET_BITS value needed for large files... no
checking whether std::chrono::steady_clock is steady... yes
checking for thread_local... yes
checking whether CLOCK_MONOTONIC is declared... yes
checking for posix_fadvise... yes
checking for d_type member in directory struct... yes
checking for localtime_r... yes
checking for gmtime_r... yes
checking for timegm... yes
checking for clock_gettime... yes
checking whether pthread_condattr_setclock is declared... yes
checking whether iconv can be used without link library... no
checking whether iconv needs -liconv... yes
checking pkg-config is at least version 0.9.0... yes
checking for nettle >= 3.1... yes
checking for hogweed >= 3.1... yes
checking whether to use windres... no
checking whether the linker accepts -Wl,--dynamicbase... no
checking whether the linker accepts -Wl,--nxcompat... no
checking pkg-config is at least version 0.9.0... yes
checking for cppunit >= 1.13.0... no
checking for doxygen... no
configure: WARNING: doxygen not found - will not generate any doxygen documentation
checking for perl... no
checking that generated files are newer than configure... done
configure: creating ./config.status
config.status: creating Makefile
config.status: creating lib/Makefile
config.status: creating lib/libfilezilla.pc
config.status: creating lib/libfilezilla/version.hpp
config.status: creating demos/Makefile
config.status: creating doc/Doxyfile
config.status: creating doc/Makefile
config.status: creating tests/Makefile
config.status: creating lib/libfilezilla/private/config.hpp
config.status: executing depfiles commands
config.status: executing libtool commands
===========================================================================
=======================<phase: build          >============================
===>  Building for libfilezilla-0.15.1_3
gmake[1]: Entering directory '/wrkdirs/usr/ports/ftp/libfilezilla/work/libfilezilla-0.15.1'
Making all in .
gmake[2]: Entering directory '/wrkdirs/usr/ports/ftp/libfilezilla/work/libfilezilla-0.15.1'
gmake[2]: Nothing to be done for 'all-am'.
gmake[2]: Leaving directory '/wrkdirs/usr/ports/ftp/libfilezilla/work/libfilezilla-0.15.1'
Making all in lib
gmake[2]: Entering directory '/wrkdirs/usr/ports/ftp/libfilezilla/work/libfilezilla-0.15.1/lib'
/bin/sh ../libtool  --tag=CXX   --mode=compile g++10 -DHAVE_CONFIG_H -I. -I../lib/libfilezilla/private   -DBUILDING_LIBFILEZILLA -I/usr/local/include  -I./libfilezilla -isystem /usr/local/include  -fvisibility=hidden -O2 -pipe  -fstack-protector-strong -Wl,-rpath=/usr/local/lib/gcc10  -Wl,-rpath=/usr/local/lib/gcc10 -isystem /usr/local/include  -Wall -g -MT libfilezilla_la-buffer.lo -MD -MP -MF .deps/libfilezilla_la-buffer.Tpo -c -o libfilezilla_la-buffer.lo `test -f 'buffer.cpp' || echo './'`buffer.cpp
/bin/sh ../libtool  --tag=CXX   --mode=compile g++10 -DHAVE_CONFIG_H -I. -I../lib/libfilezilla/private   -DBUILDING_LIBFILEZILLA -I/usr/local/include  -I./libfilezilla -isystem /usr/local/include  -fvisibility=hidden -O2 -pipe  -fstack-protector-strong -Wl,-rpath=/usr/local/lib/gcc10  -Wl,-rpath=/usr/local/lib/gcc10 -isystem /usr/local/include  -Wall -g -MT libfilezilla_la-encode.lo -MD -MP -MF .deps/libfilezilla_la-encode.Tpo -c -o libfilezilla_la-encode.lo `test -f 'encode.cpp' || echo './'`encode.cpp
libtool: compile:  g++10 -DHAVE_CONFIG_H -I. -I../lib/libfilezilla/private -DBUILDING_LIBFILEZILLA -I/usr/local/include -I./libfilezilla -isystem /usr/local/include -fvisibility=hidden -O2 -pipe -fstack-protector-strong -Wl,-rpath=/usr/local/lib/gcc10 -Wl,-rpath=/usr/local/lib/gcc10 -isystem /usr/local/include -Wall -g -MT libfilezilla_la-buffer.lo -MD -MP -MF .deps/libfilezilla_la-buffer.Tpo -c buffer.cpp  -fPIC -DPIC -o .libs/libfilezilla_la-buffer.o
libtool: compile:  g++10 -DHAVE_CONFIG_H -I. -I../lib/libfilezilla/private -DBUILDING_LIBFILEZILLA -I/usr/local/include -I./libfilezilla -isystem /usr/local/include -fvisibility=hidden -O2 -pipe -fstack-protector-strong -Wl,-rpath=/usr/local/lib/gcc10 -Wl,-rpath=/usr/local/lib/gcc10 -isystem /usr/local/include -Wall -g -MT libfilezilla_la-encode.lo -MD -MP -MF .deps/libfilezilla_la-encode.Tpo -c encode.cpp  -fPIC -DPIC -o .libs/libfilezilla_la-encode.o
libtool: compile:  g++10 -DHAVE_CONFIG_H -I. -I../lib/libfilezilla/private -DBUILDING_LIBFILEZILLA -I/usr/local/include -I./libfilezilla -isystem /usr/local/include -fvisibility=hidden -O2 -pipe -fstack-protector-strong -Wl,-rpath=/usr/local/lib/gcc10 -Wl,-rpath=/usr/local/lib/gcc10 -isystem /usr/local/include -Wall -g -MT libfilezilla_la-buffer.lo -MD -MP -MF .deps/libfilezilla_la-buffer.Tpo -c buffer.cpp -o libfilezilla_la-buffer.o >/dev/null 2>&1
libtool: compile:  g++10 -DHAVE_CONFIG_H -I. -I../lib/libfilezilla/private -DBUILDING_LIBFILEZILLA -I/usr/local/include -I./libfilezilla -isystem /usr/local/include -fvisibility=hidden -O2 -pipe -fstack-protector-strong -Wl,-rpath=/usr/local/lib/gcc10 -Wl,-rpath=/usr/local/lib/gcc10 -isystem /usr/local/include -Wall -g -MT libfilezilla_la-encode.lo -MD -MP -MF .deps/libfilezilla_la-encode.Tpo -c encode.cpp -o libfilezilla_la-encode.o >/dev/null 2>&1
mv -f .deps/libfilezilla_la-buffer.Tpo .deps/libfilezilla_la-buffer.Plo
/bin/sh ../libtool  --tag=CXX   --mode=compile g++10 -DHAVE_CONFIG_H -I. -I../lib/libfilezilla/private   -DBUILDING_LIBFILEZILLA -I/usr/local/include  -I./libfilezilla -isystem /usr/local/include  -fvisibility=hidden -O2 -pipe  -fstack-protector-strong -Wl,-rpath=/usr/local/lib/gcc10  -Wl,-rpath=/usr/local/lib/gcc10 -isystem /usr/local/include  -Wall -g -MT libfilezilla_la-encryption.lo -MD -MP -MF .deps/libfilezilla_la-encryption.Tpo -c -o libfilezilla_la-encryption.lo `test -f 'encryption.cpp' || echo './'`encryption.cpp
libtool: compile:  g++10 -DHAVE_CONFIG_H -I. -I../lib/libfilezilla/private -DBUILDING_LIBFILEZILLA -I/usr/local/include -I./libfilezilla -isystem /usr/local/include -fvisibility=hidden -O2 -pipe -fstack-protector-strong -Wl,-rpath=/usr/local/lib/gcc10 -Wl,-rpath=/usr/local/lib/gcc10 -isystem /usr/local/include -Wall -g -MT libfilezilla_la-encryption.lo -MD -MP -MF .deps/libfilezilla_la-encryption.Tpo -c encryption.cpp  -fPIC -DPIC -o .libs/libfilezilla_la-encryption.o
mv -f .deps/libfilezilla_la-encode.Tpo .deps/libfilezilla_la-encode.Plo
/bin/sh ../libtool  --tag=CXX   --mode=compile g++10 -DHAVE_CONFIG_H -I. -I../lib/libfilezilla/private   -DBUILDING_LIBFILEZILLA -I/usr/local/include  -I./libfilezilla -isystem /usr/local/include  -fvisibility=hidden -O2 -pipe  -fstack-protector-strong -Wl,-rpath=/usr/local/lib/gcc10  -Wl,-rpath=/usr/local/lib/gcc10 -isystem /usr/local/include  -Wall -g -MT libfilezilla_la-event.lo -MD -MP -MF .deps/libfilezilla_la-event.Tpo -c -o libfilezilla_la-event.lo `test -f 'event.cpp' || echo './'`event.cpp
libtool: compile:  g++10 -DHAVE_CONFIG_H -I. -I../lib/libfilezilla/private -DBUILDING_LIBFILEZILLA -I/usr/local/include -I./libfilezilla -isystem /usr/local/include -fvisibility=hidden -O2 -pipe -fstack-protector-strong -Wl,-rpath=/usr/local/lib/gcc10 -Wl,-rpath=/usr/local/lib/gcc10 -isystem /usr/local/include -Wall -g -MT libfilezilla_la-event.lo -MD -MP -MF .deps/libfilezilla_la-event.Tpo -c event.cpp  -fPIC -DPIC -o .libs/libfilezilla_la-event.o
libtool: compile:  g++10 -DHAVE_CONFIG_H -I. -I../lib/libfilezilla/private -DBUILDING_LIBFILEZILLA -I/usr/local/include -I./libfilezilla -isystem /usr/local/include -fvisibility=hidden -O2 -pipe -fstack-protector-strong -Wl,-rpath=/usr/local/lib/gcc10 -Wl,-rpath=/usr/local/lib/gcc10 -isystem /usr/local/include -Wall -g -MT libfilezilla_la-encryption.lo -MD -MP -MF .deps/libfilezilla_la-encryption.Tpo -c encryption.cpp -o libfilezilla_la-encryption.o >/dev/null 2>&1
libtool: compile:  g++10 -DHAVE_CONFIG_H -I. -I../lib/libfilezilla/private -DBUILDING_LIBFILEZILLA -I/usr/local/include -I./libfilezilla -isystem /usr/local/include -fvisibility=hidden -O2 -pipe -fstack-protector-strong -Wl,-rpath=/usr/local/lib/gcc10 -Wl,-rpath=/usr/local/lib/gcc10 -isystem /usr/local/include -Wall -g -MT libfilezilla_la-event.lo -MD -MP -MF .deps/libfilezilla_la-event.Tpo -c event.cpp -o libfilezilla_la-event.o >/dev/null 2>&1
mv -f .deps/libfilezilla_la-encryption.Tpo .deps/libfilezilla_la-encryption.Plo
/bin/sh ../libtool  --tag=CXX   --mode=compile g++10 -DHAVE_CONFIG_H -I. -I../lib/libfilezilla/private   -DBUILDING_LIBFILEZILLA -I/usr/local/include  -I./libfilezilla -isystem /usr/local/include  -fvisibility=hidden -O2 -pipe  -fstack-protector-strong -Wl,-rpath=/usr/local/lib/gcc10  -Wl,-rpath=/usr/local/lib/gcc10 -isystem /usr/local/include  -Wall -g -MT libfilezilla_la-event_handler.lo -MD -MP -MF .deps/libfilezilla_la-event_handler.Tpo -c -o libfilezilla_la-event_handler.lo `test -f 'event_handler.cpp' || echo './'`event_handler.cpp
libtool: compile:  g++10 -DHAVE_CONFIG_H -I. -I../lib/libfilezilla/private -DBUILDING_LIBFILEZILLA -I/usr/local/include -I./libfilezilla -isystem /usr/local/include -fvisibility=hidden -O2 -pipe -fstack-protector-strong -Wl,-rpath=/usr/local/lib/gcc10 -Wl,-rpath=/usr/local/lib/gcc10 -isystem /usr/local/include -Wall -g -MT libfilezilla_la-event_handler.lo -MD -MP -MF .deps/libfilezilla_la-event_handler.Tpo -c event_handler.cpp  -fPIC -DPIC -o .libs/libfilezilla_la-event_handler.o
mv -f .deps/libfilezilla_la-event.Tpo .deps/libfilezilla_la-event.Plo
/bin/sh ../libtool  --tag=CXX   --mode=compile g++10 -DHAVE_CONFIG_H -I. -I../lib/libfilezilla/private   -DBUILDING_LIBFILEZILLA -I/usr/local/include  -I./libfilezilla -isystem /usr/local/include  -fvisibility=hidden -O2 -pipe  -fstack-protector-strong -Wl,-rpath=/usr/local/lib/gcc10  -Wl,-rpath=/usr/local/lib/gcc10 -isystem /usr/local/include  -Wall -g -MT libfilezilla_la-event_loop.lo -MD -MP -MF .deps/libfilezilla_la-event_loop.Tpo -c -o libfilezilla_la-event_loop.lo `test -f 'event_loop.cpp' || echo './'`event_loop.cpp
libtool: compile:  g++10 -DHAVE_CONFIG_H -I. -I../lib/libfilezilla/private -DBUILDING_LIBFILEZILLA -I/usr/local/include -I./libfilezilla -isystem /usr/local/include -fvisibility=hidden -O2 -pipe -fstack-protector-strong -Wl,-rpath=/usr/local/lib/gcc10 -Wl,-rpath=/usr/local/lib/gcc10 -isystem /usr/local/include -Wall -g -MT libfilezilla_la-event_loop.lo -MD -MP -MF .deps/libfilezilla_la-event_loop.Tpo -c event_loop.cpp  -fPIC -DPIC -o .libs/libfilezilla_la-event_loop.o
In file included from libfilezilla/event_loop.hpp:4,
                 from libfilezilla/event_handler.hpp:4,
                 from event_handler.cpp:1:
libfilezilla/apply.hpp:21:38: error: 'size_t' has not been declared
   21 | template<typename F, typename Tuple, size_t... I>
      |                                      ^~~~~~
libfilezilla/apply.hpp:22:51: error: 'I' was not declared in this scope
   22 | auto apply_(F&& f, Tuple&& t, std::index_sequence<I...> const&) -> decltype(std::forward<F>(f)(std::get<I>(std::forward<Tuple>(t))...))
      |                                                   ^
libfilezilla/apply.hpp:22:52: error: expected parameter pack before '...'
   22 | auto apply_(F&& f, Tuple&& t, std::index_sequence<I...> const&) -> decltype(std::forward<F>(f)(std::get<I>(std::forward<Tuple>(t))...))
      |                                                    ^~~
libfilezilla/apply.hpp:22:55: error: template argument 1 is invalid
   22 | auto apply_(F&& f, Tuple&& t, std::index_sequence<I...> const&) -> decltype(std::forward<F>(f)(std::get<I>(std::forward<Tuple>(t))...))
      |                                                       ^
libfilezilla/apply.hpp:22:105: error: 'I' was not declared in this scope
   22 | auto apply_(F&& f, Tuple&& t, std::index_sequence<I...> const&) -> decltype(std::forward<F>(f)(std::get<I>(std::forward<Tuple>(t))...))
      |                                                                                                         ^
In file included from libfilezilla/event_loop.hpp:4,
                 from libfilezilla/event_handler.hpp:4,
                 from event_handler.cpp:1:
libfilezilla/apply.hpp:22:131: error: expansion pattern 'get<<expression error> >(forward<Tuple>(t))' contains no parameter packs
   22 | auto apply_(F&& f, Tuple&& t, std::index_sequence<I...> const&) -> decltype(std::forward<F>(f)(std::get<I>(std::forward<Tuple>(t))...))
      |                                                                                                                                   ^~~
libfilezilla/apply.hpp:22:131: error: expansion pattern 'get<<expression error> >(forward<Tuple>(t))' contains no parameter packs
libfilezilla/apply.hpp: In function 'decltype (forward<F>(f)(<expression error>)) fz::apply_(F&&, Tuple&&, const int&)':
libfilezilla/apply.hpp:24:37: error: 'I' was not declared in this scope
   24 |  return std::forward<F>(f)(std::get<I>(std::forward<Tuple>(t))...);
      |                                     ^
libfilezilla/apply.hpp:24:63: error: expansion pattern 'get<<expression error> >(forward<Tuple>(t))' contains no parameter packs
   24 |  return std::forward<F>(f)(std::get<I>(std::forward<Tuple>(t))...);
      |                                                               ^~~
libfilezilla/apply.hpp: At global scope:
libfilezilla/apply.hpp:51:52: error: 'size_t' has not been declared
   51 | template<typename Obj, typename F, typename Tuple, size_t... I>
      |                                                    ^~~~~~
libfilezilla/apply.hpp:52:62: error: 'I' was not declared in this scope
   52 | auto apply_(Obj&& obj, F&& f, Tuple&& t, std::index_sequence<I...> const&) -> decltype((std::forward<Obj>(obj)->*std::forward<F>(f))(std::get<I>(std::forward<Tuple>(t))...))
      |                                                              ^
libfilezilla/apply.hpp:52:63: error: expected parameter pack before '...'
   52 | auto apply_(Obj&& obj, F&& f, Tuple&& t, std::index_sequence<I...> const&) -> decltype((std::forward<Obj>(obj)->*std::forward<F>(f))(std::get<I>(std::forward<Tuple>(t))...))
      |                                                               ^~~
libfilezilla/apply.hpp:52:66: error: template argument 1 is invalid
   52 | auto apply_(Obj&& obj, F&& f, Tuple&& t, std::index_sequence<I...> const&) -> decltype((std::forward<Obj>(obj)->*std::forward<F>(f))(std::get<I>(std::forward<Tuple>(t))...))
      |                                                                  ^
libfilezilla/apply.hpp:52:143: error: 'I' was not declared in this scope
   52 | auto apply_(Obj&& obj, F&& f, Tuple&& t, std::index_sequence<I...> const&) -> decltype((std::forward<Obj>(obj)->*std::forward<F>(f))(std::get<I>(std::forward<Tuple>(t))...))
      |                                                                                                                                               ^
libfilezilla/apply.hpp:52:169: error: expansion pattern 'get<<expression error> >(forward<Tuple>(t))' contains no parameter packs
   52 | auto apply_(Obj&& obj, F&& f, Tuple&& t, std::index_sequence<I...> const&) -> decltype((std::forward<Obj>(obj)->*std::forward<F>(f))(std::get<I>(std::forward<Tuple>(t))...))
      |                                                                                                                                                                         ^~~
libfilezilla/apply.hpp:52:169: error: expansion pattern 'get<<expression error> >(forward<Tuple>(t))' contains no parameter packs
libfilezilla/apply.hpp: In function 'decltype ((forward<Obj>)(obj)->*(forward<F>)(f)(<expression error>)) fz::apply_(Obj&&, F&&, Tuple&&, const int&)':
libfilezilla/apply.hpp:54:64: error: 'I' was not declared in this scope
   54 |  return (std::forward<Obj>(obj)->*std::forward<F>(f))(std::get<I>(std::forward<Tuple>(t))...);
      |                                                                ^
libfilezilla/apply.hpp:54:90: error: expansion pattern 'get<<expression error> >(forward<Tuple>(t))' contains no parameter packs
   54 |  return (std::forward<Obj>(obj)->*std::forward<F>(f))(std::get<I>(std::forward<Tuple>(t))...);
      |                                                                                          ^~~
In file included from libfilezilla/event_loop.hpp:4,
                 from event_loop.cpp:1:
libfilezilla/apply.hpp:21:38: error: 'size_t' has not been declared
   21 | template<typename F, typename Tuple, size_t... I>
      |                                      ^~~~~~
libfilezilla/apply.hpp:22:51: error: 'I' was not declared in this scope
   22 | auto apply_(F&& f, Tuple&& t, std::index_sequence<I...> const&) -> decltype(std::forward<F>(f)(std::get<I>(std::forward<Tuple>(t))...))
      |                                                   ^
libfilezilla/apply.hpp:22:52: error: expected parameter pack before '...'
   22 | auto apply_(F&& f, Tuple&& t, std::index_sequence<I...> const&) -> decltype(std::forward<F>(f)(std::get<I>(std::forward<Tuple>(t))...))
      |                                                    ^~~
libfilezilla/apply.hpp:22:55: error: template argument 1 is invalid
   22 | auto apply_(F&& f, Tuple&& t, std::index_sequence<I...> const&) -> decltype(std::forward<F>(f)(std::get<I>(std::forward<Tuple>(t))...))
      |                                                       ^
libfilezilla/apply.hpp:22:105: error: 'I' was not declared in this scope
   22 | auto apply_(F&& f, Tuple&& t, std::index_sequence<I...> const&) -> decltype(std::forward<F>(f)(std::get<I>(std::forward<Tuple>(t))...))
      |                                                                                                         ^
In file included from libfilezilla/event_loop.hpp:4,
                 from event_loop.cpp:1:
libfilezilla/apply.hpp:22:131: error: expansion pattern 'get<<expression error> >(forward<Tuple>(t))' contains no parameter packs
   22 | auto apply_(F&& f, Tuple&& t, std::index_sequence<I...> const&) -> decltype(std::forward<F>(f)(std::get<I>(std::forward<Tuple>(t))...))
      |                                                                                                                                   ^~~
libfilezilla/apply.hpp:22:131: error: expansion pattern 'get<<expression error> >(forward<Tuple>(t))' contains no parameter packs
libfilezilla/apply.hpp: In function 'decltype (forward<F>(f)(<expression error>)) fz::apply_(F&&, Tuple&&, const int&)':
libfilezilla/apply.hpp:24:37: error: 'I' was not declared in this scope
   24 |  return std::forward<F>(f)(std::get<I>(std::forward<Tuple>(t))...);
      |                                     ^
libfilezilla/apply.hpp:24:63: error: expansion pattern 'get<<expression error> >(forward<Tuple>(t))' contains no parameter packs
   24 |  return std::forward<F>(f)(std::get<I>(std::forward<Tuple>(t))...);
      |                                                               ^~~
libfilezilla/apply.hpp: At global scope:
libfilezilla/apply.hpp:51:52: error: 'size_t' has not been declared
   51 | template<typename Obj, typename F, typename Tuple, size_t... I>
      |                                                    ^~~~~~
libfilezilla/apply.hpp:52:62: error: 'I' was not declared in this scope
   52 | auto apply_(Obj&& obj, F&& f, Tuple&& t, std::index_sequence<I...> const&) -> decltype((std::forward<Obj>(obj)->*std::forward<F>(f))(std::get<I>(std::forward<Tuple>(t))...))
      |                                                              ^
libfilezilla/apply.hpp:52:63: error: expected parameter pack before '...'
   52 | auto apply_(Obj&& obj, F&& f, Tuple&& t, std::index_sequence<I...> const&) -> decltype((std::forward<Obj>(obj)->*std::forward<F>(f))(std::get<I>(std::forward<Tuple>(t))...))
      |                                                               ^~~
libfilezilla/apply.hpp:52:66: error: template argument 1 is invalid
   52 | auto apply_(Obj&& obj, F&& f, Tuple&& t, std::index_sequence<I...> const&) -> decltype((std::forward<Obj>(obj)->*std::forward<F>(f))(std::get<I>(std::forward<Tuple>(t))...))
      |                                                                  ^
libfilezilla/apply.hpp:52:143: error: 'I' was not declared in this scope
   52 | auto apply_(Obj&& obj, F&& f, Tuple&& t, std::index_sequence<I...> const&) -> decltype((std::forward<Obj>(obj)->*std::forward<F>(f))(std::get<I>(std::forward<Tuple>(t))...))
      |                                                                                                                                               ^
libfilezilla/apply.hpp:52:169: error: expansion pattern 'get<<expression error> >(forward<Tuple>(t))' contains no parameter packs
   52 | auto apply_(Obj&& obj, F&& f, Tuple&& t, std::index_sequence<I...> const&) -> decltype((std::forward<Obj>(obj)->*std::forward<F>(f))(std::get<I>(std::forward<Tuple>(t))...))
      |                                                                                                                                                                         ^~~
libfilezilla/apply.hpp:52:169: error: expansion pattern 'get<<expression error> >(forward<Tuple>(t))' contains no parameter packs
libfilezilla/apply.hpp: In function 'decltype ((forward<Obj>)(obj)->*(forward<F>)(f)(<expression error>)) fz::apply_(Obj&&, F&&, Tuple&&, const int&)':
libfilezilla/apply.hpp:54:64: error: 'I' was not declared in this scope
   54 |  return (std::forward<Obj>(obj)->*std::forward<F>(f))(std::get<I>(std::forward<Tuple>(t))...);
      |                                                                ^
libfilezilla/apply.hpp:54:90: error: expansion pattern 'get<<expression error> >(forward<Tuple>(t))' contains no parameter packs
   54 |  return (std::forward<Obj>(obj)->*std::forward<F>(f))(std::get<I>(std::forward<Tuple>(t))...);
      |                                                                                          ^~~
gmake[2]: *** [Makefile:618: libfilezilla_la-event_handler.lo] Error 1
gmake[2]: *** Waiting for unfinished jobs....
gmake[2]: *** [Makefile:625: libfilezilla_la-event_loop.lo] Error 1
gmake[2]: Leaving directory '/wrkdirs/usr/ports/ftp/libfilezilla/work/libfilezilla-0.15.1/lib'
gmake[1]: *** [Makefile:464: all-recursive] Error 1
gmake[1]: Leaving directory '/wrkdirs/usr/ports/ftp/libfilezilla/work/libfilezilla-0.15.1'
===> Compilation failed unexpectedly.
Try to set MAKE_JOBS_UNSAFE=yes and rebuild before reporting the failure to
the maintainer.
*** Error code 1

Stop.
make: stopped in /usr/ports/ftp/libfilezilla
Received on Thu Jul 29 2021 - 02:58:45 UTC

Original text of this message