[package - main-arm64-default][audio/mixxx] Failed for mixxx-2.3.0_1 in build

From: <pkg-fallout_at_FreeBSD.org>
Date: Tue, 27 Jul 2021 15:17:18 GMT
You are receiving this mail as a port that you maintain
is failing to build on the FreeBSD package build server.
Please investigate the failure and submit a PR to fix
build.

Maintainer:     acm_at_FreeBSD.org
Log URL:        http://ampere2.nyi.freebsd.org/data/main-arm64-default/pe8cfea34d340_s47aeda7b70/logs/mixxx-2.3.0_1.log
Build URL:      http://ampere2.nyi.freebsd.org/build.html?mastername=main-arm64-default&build=pe8cfea34d340_s47aeda7b70
Log:

=>> Building audio/mixxx
build started at Tue Jul 27 15:15:45 UTC 2021
port directory: /usr/ports/audio/mixxx
package name: mixxx-2.3.0_1
building for: FreeBSD main-arm64-default-job-03 14.0-CURRENT FreeBSD 14.0-CURRENT 1400026 arm64
maintained by: acm_at_FreeBSD.org
Makefile ident: 
Poudriere version: 3.2.8-8-gaf08dbda
Host OSVERSION: 1400008
Jail OSVERSION: 1400026
Job Id: 03




!!! Jail is newer than host. (Jail: 1400026, Host: 1400008) !!!
!!! This is not supported. !!!
!!! Host kernel must be same or newer than jail. !!!
!!! Expect build failures. !!!



---Begin Environment---
SHELL=/bin/csh
OSVERSION=1400026
UNAME_v=FreeBSD 14.0-CURRENT 1400026
UNAME_r=14.0-CURRENT
BLOCKSIZE=K
MAIL=/var/mail/root
MM_CHARSET=UTF-8
LANG=C.UTF-8
STATUS=1
HOME=/root
PATH=/sbin:/bin:/usr/sbin:/usr/bin:/usr/local/sbin:/usr/local/bin:/root/bin
LOCALBASE=/usr/local
USER=root
LIBEXECPREFIX=/usr/local/libexec/poudriere
POUDRIERE_VERSION=3.2.8-8-gaf08dbda
MASTERMNT=/usr/local/poudriere/data/.m/main-arm64-default/ref
POUDRIERE_BUILD_TYPE=bulk
PACKAGE_BUILDING=yes
SAVED_TERM=
PWD=/usr/local/poudriere/data/.m/main-arm64-default/ref/.p/pool
P_PORTS_FEATURES=FLAVORS SELECTED_OPTIONS
MASTERNAME=main-arm64-default
SCRIPTPREFIX=/usr/local/share/poudriere
OLDPWD=/usr/local/poudriere/data/.m/main-arm64-default/ref/.p
SCRIPTPATH=/usr/local/share/poudriere/bulk.sh
POUDRIEREPATH=/usr/local/bin/poudriere
---End Environment---

---Begin Poudriere Port Flags/Env---
PORT_FLAGS=
PKGENV=
FLAVOR=
DEPENDS_ARGS=
MAKE_ARGS=
---End Poudriere Port Flags/Env---

---Begin OPTIONS List---
===> The following configuration options are available for mixxx-2.3.0_1:
     BROADCAST=on: Live Broadcasting (Shoutcast) support
     DOCS=on: Build and/or install documentation
     FFMPEG=on: FFmpeg support (WMA, AIFF, AC3, APE...)
     GPERFTOOLS=off: Google gperftools support
     HID=on: USB HID controllers support
     OPUS=on: Opus audio codec support
     QTKEYCHAIN=on: Secure credentials storage for Live Broadcasting profiles
     WAVPACK=on: WavPack lossless audio format support
===> Use 'make config' to modify these settings
---End OPTIONS List---

--MAINTAINER--
acm_at_FreeBSD.org
--End MAINTAINER--

--CONFIGURE_ARGS--

--End CONFIGURE_ARGS--

--CONFIGURE_ENV--
QT_SELECT=qt5 QMAKEMODULES="/wrkdirs/usr/ports/audio/mixxx/work/mixxx-2.3.0/mkspecs/modules:/usr/local/lib/qt5/mkspecs/modules" PKG_CONFIG=pkgconf XDG_DATA_HOME=/wrkdirs/usr/ports/audio/mixxx/work  XDG_CONFIG_HOME=/wrkdirs/usr/ports/audio/mixxx/work  HOME=/wrkdirs/usr/ports/audio/mixxx/work TMPDIR="/tmp" PATH=/wrkdirs/usr/ports/audio/mixxx/work/.bin:/sbin:/bin:/usr/sbin:/usr/bin:/usr/local/sbin:/usr/local/bin:/root/bin SHELL=/bin/sh CONFIG_SHELL=/bin/sh
--End CONFIGURE_ENV--

--MAKE_ENV--
NINJA_STATUS="[%p %s/%t] " QT_SELECT=qt5 QMAKEMODULES="/wrkdirs/usr/ports/audio/mixxx/work/mixxx-2.3.0/mkspecs/modules:/usr/local/lib/qt5/mkspecs/modules" OPENSSLBASE=/usr OPENSSLDIR=/etc/ssl OPENSSLINC=/usr/include OPENSSLLIB=/usr/lib XDG_DATA_HOME=/wrkdirs/usr/ports/audio/mixxx/work  XDG_CONFIG_HOME=/wrkdirs/usr/ports/audio/mixxx/work  HOME=/wrkdirs/usr/ports/audio/mixxx/work TMPDIR="/tmp" PATH=/wrkdirs/usr/ports/audio/mixxx/work/.bin:/sbin:/bin:/usr/sbin:/usr/bin:/usr/local/sbin:/usr/local/bin:/root/bin NO_PIE=yes MK_DEBUG_FILES=no MK_KERNEL_SYMBOLS=no SHELL=/bin/sh NO_LINT=YES DESTDIR=/wrkdirs/usr/ports/audio/mixxx/work/stage PREFIX=/usr/local  LOCALBASE=/usr/local  CC="cc" CFLAGS="-O2 -pipe  -DLIBICONV_PLUG -fstack-protector-strong -fno-strict-aliasing "  CPP="cpp" CPPFLAGS="-DLIBICONV_PLUG"  LDFLAGS="  -fstack-protector-strong " LIBS=""  CXX="c++" CXXFLAGS="-O2 -pipe -DLIBICONV_PLUG -fstack-protector-strong -fno-strict-aliasing  -DLIBICONV_PLUG "  MANPREFIX="/usr/local" BSD_INS
 TALL_PROGRAM="install  -s -m 555"  BSD_INSTALL_LIB="install  -s -m 0644"  BSD_INSTALL_SCRIPT="install  -m 555"  BSD_INSTALL_DATA="install  -m 0644"  BSD_INSTALL_MAN="install  -m 444"
--End MAKE_ENV--

--PLIST_SUB--
PORTDOCS="" BROADCAST="" NO_BROADCAST="_at_comment " DOCS="" NO_DOCS="_at_comment " FFMPEG="" NO_FFMPEG="_at_comment " GPERFTOOLS="_at_comment " NO_GPERFTOOLS="" HID="" NO_HID="_at_comment " OPUS="" NO_OPUS="_at_comment " QTKEYCHAIN="" NO_QTKEYCHAIN="_at_comment " WAVPACK="" NO_WAVPACK="_at_comment " CMAKE_BUILD_TYPE="release" QT_BINDIR="lib/qt5/bin" QT_INCDIR="include/qt5" QT_LIBDIR="lib/qt5" QT_ARCHDIR="lib/qt5" QT_PLUGINDIR="lib/qt5/plugins" QT_LIBEXECDIR="libexec/qt5" QT_IMPORTDIR="lib/qt5/imports" QT_QMLDIR="lib/qt5/qml" QT_DATADIR="share/qt5" QT_DOCDIR="share/doc/qt5" QT_L10NDIR="share/qt5/translations" QT_EXAMPLEDIR="share/examples/qt5" QT_TESTDIR="share/qt5/tests" QT_MKSPECDIR="lib/qt5/mkspecs" OSREL=14.0 PREFIX=%D LOCALBASE=/usr/local  RESETPREFIX=/usr/local LIB32DIR=lib DOCSDIR="share/doc/mixxx"  EXAMPLESDIR="share/examples/mixxx"  DATADIR="share/mixxx"  WWWDIR="www/mixxx"  ETCDIR="etc/mixxx"
--End PLIST_SUB--

--SUB_LIST--
BROADCAST="" NO_BROADCAST="_at_comment " DOCS="" NO_DOCS="_at_comment " FFMPEG="" NO_FFMPEG="_at_comment " GPERFTOOLS="_at_comment " NO_GPERFTOOLS="" HID="" NO_HID="_at_comment " OPUS="" NO_OPUS="_at_comment " QTKEYCHAIN="" NO_QTKEYCHAIN="_at_comment " WAVPACK="" NO_WAVPACK="_at_comment " PREFIX=/usr/local LOCALBASE=/usr/local  DATADIR=/usr/local/share/mixxx DOCSDIR=/usr/local/share/doc/mixxx EXAMPLESDIR=/usr/local/share/examples/mixxx  WWWDIR=/usr/local/www/mixxx ETCDIR=/usr/local/etc/mixxx
--End SUB_LIST--

---Begin make.conf---
USE_PACKAGE_DEPENDS=yes
BATCH=yes
WRKDIRPREFIX=/wrkdirs
PORTSDIR=/usr/ports
PACKAGES=/packages
DISTDIR=/distfiles
PACKAGE_BUILDING=yes
PACKAGE_BUILDING_FLAVORS=yes
#### /usr/local/etc/poudriere.d/make.conf ####
# XXX: We really need this but cannot use it while 'make checksum' does not
# try the next mirror on checksum failure.  It currently retries the same
# failed mirror and then fails rather then trying another.  It *does*
# try the next if the size is mismatched though.
#MASTER_SITE_FREEBSD=yes
# Build ALLOW_MAKE_JOBS_PACKAGES with 2 jobs
MAKE_JOBS_NUMBER=2
#### /usr/ports/Mk/Scripts/ports_env.sh ####
_CCVERSION_921dbbb2=FreeBSD clang version 12.0.1 (git_at_github.com:llvm/llvm-project.git llvmorg-12.0.1-0-gfed41342a82f) Target: aarch64-unknown-freebsd14.0 Thread model: posix InstalledDir: /usr/bin
_ALTCCVERSION_921dbbb2=none
_CXXINTERNAL_acaad9ca=FreeBSD clang version 12.0.1 (git_at_github.com:llvm/llvm-project.git llvmorg-12.0.1-0-gfed41342a82f) Target: aarch64-unknown-freebsd14.0 Thread model: posix InstalledDir: /usr/bin "/usr/bin/ld" "--eh-frame-hdr" "-dynamic-linker" "/libexec/ld-elf.so.1" "--enable-new-dtags" "-o" "a.out" "/usr/lib/crt1.o" "/usr/lib/crti.o" "/usr/lib/crtbegin.o" "-L/usr/lib" "/dev/null" "-lc++" "-lm" "-lgcc" "--as-needed" "-lgcc_s" "--no-as-needed" "-lc" "-lgcc" "--as-needed" "-lgcc_s" "--no-as-needed" "/usr/lib/crtend.o" "/usr/lib/crtn.o"
CC_OUTPUT_921dbbb2_58173849=yes
CC_OUTPUT_921dbbb2_9bdba57c=yes
CC_OUTPUT_921dbbb2_6a4fe7f5=yes
CC_OUTPUT_921dbbb2_6bcac02b=yes
CC_OUTPUT_921dbbb2_67d20829=yes
CC_OUTPUT_921dbbb2_bfa62e83=yes
CC_OUTPUT_921dbbb2_f0b4d593=yes
CC_OUTPUT_921dbbb2_308abb44=yes
CC_OUTPUT_921dbbb2_f00456e5=yes
CC_OUTPUT_921dbbb2_65ad290d=yes
CC_OUTPUT_921dbbb2_f2776b26=yes
CC_OUTPUT_921dbbb2_b2657cc3=yes
CC_OUTPUT_921dbbb2_380987f7=yes
CC_OUTPUT_921dbbb2_160933ec=yes
CC_OUTPUT_921dbbb2_fb62803b=yes
_OBJC_CCVERSION_921dbbb2=FreeBSD clang version 12.0.1 (git_at_github.com:llvm/llvm-project.git llvmorg-12.0.1-0-gfed41342a82f) Target: aarch64-unknown-freebsd14.0 Thread model: posix InstalledDir: /usr/bin
_OBJC_ALTCCVERSION_921dbbb2=none
ARCH=aarch64
OPSYS=FreeBSD
_OSRELEASE=14.0-CURRENT
OSREL=14.0
OSVERSION=1400026
PYTHONBASE=/usr/local
CONFIGURE_MAX_CMD_LEN=524288
HAVE_PORTS_ENV=1
#### Misc Poudriere ####
GID=0
UID=0
---End make.conf---
--Resource limits--
cpu time               (seconds, -t)  unlimited
file size           (512-blocks, -f)  unlimited
data seg size           (kbytes, -d)  1048576
stack size              (kbytes, -s)  1048576
core file size      (512-blocks, -c)  unlimited
max memory size         (kbytes, -m)  unlimited
locked memory           (kbytes, -l)  unlimited
max user processes              (-u)  89999
open files                      (-n)  1024
virtual mem size        (kbytes, -v)  unlimited
swap limit              (kbytes, -w)  unlimited
socket buffer size       (bytes, -b)  unlimited
pseudo-terminals                (-p)  unlimited
kqueues                         (-k)  unlimited
umtx shared locks               (-o)  unlimited
--End resource limits--
=======================<phase: check-sanity   >============================
===>  License GPLv2+ accepted by the user
===========================================================================
=======================<phase: pkg-depends    >============================
===>   mixxx-2.3.0_1 depends on file: /usr/local/sbin/pkg - not found
===>   Installing existing package /packages/All/pkg-1.17.0.pkg
[main-arm64-default-job-03] Installing pkg-1.17.0...
[main-arm64-default-job-03] Extracting pkg-1.17.0: .......... done
===>   mixxx-2.3.0_1 depends on file: /usr/local/sbin/pkg - found
===>   Returning to build of mixxx-2.3.0_1
===========================================================================
=======================<phase: fetch-depends  >============================
===========================================================================
=======================<phase: fetch          >============================
===>  License GPLv2+ accepted by the user
===> Fetching all distfiles required by mixxx-2.3.0_1 for building
===========================================================================
=======================<phase: checksum       >============================
===>  License GPLv2+ accepted by the user
===> Fetching all distfiles required by mixxx-2.3.0_1 for building
=> SHA256 Checksum OK for mixxxdj-mixxx-2.3.0_GH0.tar.gz.
===========================================================================
=======================<phase: extract-depends>============================
===========================================================================
=======================<phase: extract        >============================
===>  License GPLv2+ accepted by the user
===> Fetching all distfiles required by mixxx-2.3.0_1 for building
===>  Extracting for mixxx-2.3.0_1
=> SHA256 Checksum OK for mixxxdj-mixxx-2.3.0_GH0.tar.gz.
===========================================================================
=======================<phase: patch-depends  >============================
===========================================================================
=======================<phase: patch          >============================
===>  Patching for mixxx-2.3.0_1
===>  Applying FreeBSD patches for mixxx-2.3.0_1 from /usr/ports/audio/mixxx/files
===========================================================================
<snip>
-- Found Python: /usr/local/bin/python3.8 (found version "3.8.11") found components: Interpreter 
-- Looking for pthread.h
-- Looking for pthread.h - found
-- Found Threads: TRUE  
-- Could NOT find Git (missing: GIT_EXECUTABLE) 
-- git Version: v0.0.0
-- Version: 0.0.0
-- Performing Test HAVE_CXX_FLAG_STD_CXX11
-- Performing Test HAVE_CXX_FLAG_STD_CXX11 - Success
-- Performing Test HAVE_CXX_FLAG_WALL
-- Performing Test HAVE_CXX_FLAG_WALL - Success
-- Performing Test HAVE_CXX_FLAG_WEXTRA
-- Performing Test HAVE_CXX_FLAG_WEXTRA - Success
-- Performing Test HAVE_CXX_FLAG_WSHADOW
-- Performing Test HAVE_CXX_FLAG_WSHADOW - Success
-- Performing Test HAVE_CXX_FLAG_WERROR
-- Performing Test HAVE_CXX_FLAG_WERROR - Success
-- Performing Test HAVE_CXX_FLAG_WSHORTEN_64_TO_32
-- Performing Test HAVE_CXX_FLAG_WSHORTEN_64_TO_32 - Success
-- Performing Test HAVE_CXX_FLAG_FSTRICT_ALIASING
-- Performing Test HAVE_CXX_FLAG_FSTRICT_ALIASING - Success
-- Performing Test HAVE_CXX_FLAG_WNO_DEPRECATED_DECLARATIONS
-- Performing Test HAVE_CXX_FLAG_WNO_DEPRECATED_DECLARATIONS - Success
-- Performing Test HAVE_CXX_FLAG_WNO_DEPRECATED
-- Performing Test HAVE_CXX_FLAG_WNO_DEPRECATED - Success
-- Performing Test HAVE_CXX_FLAG_WSTRICT_ALIASING
-- Performing Test HAVE_CXX_FLAG_WSTRICT_ALIASING - Success
-- Performing Test HAVE_CXX_FLAG_WD654
-- Performing Test HAVE_CXX_FLAG_WD654 - Failed
-- Performing Test HAVE_CXX_FLAG_WTHREAD_SAFETY
-- Performing Test HAVE_CXX_FLAG_WTHREAD_SAFETY - Success
-- Performing Test HAVE_THREAD_SAFETY_ATTRIBUTES
-- Performing Test HAVE_THREAD_SAFETY_ATTRIBUTES
-- Performing Test HAVE_THREAD_SAFETY_ATTRIBUTES -- failed to compile
-- Performing Test HAVE_CXX_FLAG_COVERAGE
-- Performing Test HAVE_CXX_FLAG_COVERAGE - Success
-- Performing Test HAVE_STD_REGEX
-- Performing Test HAVE_STD_REGEX
-- Performing Test HAVE_STD_REGEX -- success
-- Performing Test HAVE_GNU_POSIX_REGEX
-- Performing Test HAVE_GNU_POSIX_REGEX
-- Performing Test HAVE_GNU_POSIX_REGEX -- failed to compile
-- Performing Test HAVE_POSIX_REGEX
-- Performing Test HAVE_POSIX_REGEX
-- Performing Test HAVE_POSIX_REGEX -- success
-- Performing Test HAVE_STEADY_CLOCK
-- Performing Test HAVE_STEADY_CLOCK
-- Performing Test HAVE_STEADY_CLOCK -- success
-- Found Chromaprint: /usr/local/lib/libchromaprint.so  
-- Found Ebur128: /usr/local/lib/libebur128.so  
-- Linking libebur128 dynamically
-- Found KeyFinder: /usr/local/lib/libkeyfinder.so  
-- Found FLAC: /usr/local/lib/libFLAC.so  
-- Found mp3lame: /usr/local/lib/libmp3lame.so  
-- Found OpenGL: /usr/local/lib/libOpenGL.so   
-- Found Ogg: /usr/local/include  
-- Found Vorbis: /usr/local/include  found components: vorbis vorbisenc vorbisfile 
-- Checking for module 'portaudio-2.0'
--   Found portaudio-2.0, version 19
-- Performing Test PortAudio2_FOUND
-- Performing Test PortAudio2_FOUND - Success
-- Found PortAudio: /usr/local/include  
-- Found PortMidi: /usr/local/lib/libportmidi.so  
-- Found Protobuf: /usr/local/lib/libprotobuf.so;-pthread (found version "3.17.3") 
-- Found X11: /usr/local/include   
-- Looking for XOpenDisplay in /usr/local/lib/libX11.so;/usr/local/lib/libXext.so
-- Looking for XOpenDisplay in /usr/local/lib/libX11.so;/usr/local/lib/libXext.so - found
-- Looking for gethostbyname
-- Looking for gethostbyname - found
-- Looking for connect
-- Looking for connect - found
-- Looking for remove
-- Looking for remove - found
-- Looking for shmat
-- Looking for shmat - found
-- Looking for IceConnectionNumber in ICE
-- Looking for IceConnectionNumber in ICE - found
-- Found rubberband: /usr/local/lib/librubberband.so  
-- Found SndFile: /usr/local/lib/libsndfile.so  
-- Found SoundTouch: /usr/local/lib/libSoundTouch.so  
-- Linking libSoundTouch dynamically
-- Found TagLib: /usr/local/lib/libtag.so  
-- Found GLIB: /usr/local/include/glib-2.0;/usr/local/lib/glib-2.0/include (found version "2.66.8") 
-- Found Upower: /usr/local/lib/libupower-glib.so  
-- Could NOT find MP4 (missing: MP4_LIBRARY MP4_INCLUDE_DIR) 
-- Could NOT find MP4v2 (missing: MP4v2_LIBRARY MP4v2_INCLUDE_DIR) 
-- Searching for FFMPEG components
--   - libavcodec 58.134.100 found.
--   - libavformat 58.76.100 found.
--   - libavdevice 58.13.100 found.
--   - libavutil 56.70.100 found.
--   - libavfilter 7.110.100 found.
--   - libswscale 5.9.100 found.
--   - libpostproc 55.9.100 found.
--   - libswresample 3.9.100 found.
-- Found FFMPEG: /usr/local/lib/libavcodec.so;/usr/local/lib/libavformat.so;/usr/local/lib/libavutil.so;/usr/local/lib/libswresample.so  
-- Found lilv: /usr/local/lib/liblilv-0.so  
-- Could NOT find Shoutidjc (missing: Shoutidjc_LIBRARY Shoutidjc_INCLUDE_DIR) 
-- Using internal libshout-idjc
-- Found OpenSSL: /usr/lib/libcrypto.so (found version "1.1.1k")  
-- Looking for __GNU_LIBRARY__
-- Looking for __GNU_LIBRARY__ - not found
-- Looking for _GNU_SOURCE
-- Looking for _GNU_SOURCE - not found
-- Looking for arpa/inet.h
-- Looking for arpa/inet.h - found
-- Looking for inttypes.h
-- Looking for inttypes.h - found
-- Looking for stdint.h
-- Looking for stdint.h - found
-- Looking for sys/select.h
-- Looking for sys/select.h - found
-- Looking for sys/socket.h
-- Looking for sys/socket.h - found
-- Looking for winsock2.h
-- Looking for winsock2.h - not found
-- Looking for sys/uio.h
-- Looking for sys/uio.h - found
-- Looking for writev
-- Looking for writev - found
-- Looking for sys/time.h
-- Looking for sys/time.h - found
-- Looking for gettimeofday
-- Looking for gettimeofday - found
-- Looking for sys/timeb.h
-- Looking for sys/timeb.h - found
-- Looking for ftime
-- Looking for ftime - not found
-- Looking for time.h
-- Looking for time.h - found
-- Performing Test HAVE_STRUCT_TIMESPEC
-- Performing Test HAVE_STRUCT_TIMESPEC - Success
-- Looking for pthread_spin_init
-- Looking for pthread_spin_init - not found
-- Looking for unistd.h
-- Looking for unistd.h - found
-- Looking for poll
-- Looking for poll - not found
-- Looking for endhostent
-- Looking for endhostent - found
-- Looking for getaddrinfo
-- Looking for getaddrinfo - found
-- Looking for getnameinfo
-- Looking for getnameinfo - found
-- Looking for inet_aton
-- Looking for inet_aton - not found
-- Looking for inet_pton
-- Looking for inet_pton - found
-- Looking for sethostent
-- Looking for sethostent - found
-- Looking for strcasestr
-- Looking for strcasestr - not found
-- Looking for X509_check_host
-- Looking for X509_check_host - not found
-- Found SQLite3: /usr/local/lib/libsqlite3.so  
-- Found Opus: /usr/local/lib/libopus.so  
-- Found MAD: /usr/local/lib/libmad.so  
-- Found ID3Tag: /usr/local/lib/libid3tag.so  
-- Found Modplug: /usr/local/lib/libmodplug.so  
-- Found LibUSB: /usr/lib/libusb.so  
-- Found hidapi: /usr/local/lib/libhidapi.so  
-- Linking internal libhidapi statically
-- Found wavpack: /usr/local/lib/libwavpack.so  
-- Configuring done
-- Generating done
CMake Warning:
  Manually-specified variables were not used by the project:

    CMAKE_COLOR_MAKEFILE
    CMAKE_MODULE_LINKER_FLAGS
    CMAKE_SHARED_LINKER_FLAGS
    CMAKE_VERBOSE_MAKEFILE
    ICONV_INCLUDE_DIR
    ICONV_LIBRARIES
    ICONV_LIBRARY
    LIBICONV_INCLUDE_DIR
    LIBICONV_LIBRARIES
    LIBICONV_LIBRARY


-- Build files have been written to: /wrkdirs/usr/ports/audio/mixxx/work/.build
===========================================================================
=======================<phase: build          >============================
===>  Building for mixxx-2.3.0_1
[  0% 2/811] /usr/bin/c++ -DKS_STR_ENCODING_NONE -isystem /wrkdirs/usr/ports/audio/mixxx/work/mixxx-2.3.0/lib/kaitai -O2 -pipe -DLIBICONV_PLUG -fstack-protector-strong -fno-strict-aliasing  -DLIBICONV_PLUG -O2 -pipe -DLIBICONV_PLUG -fstack-protector-strong -fno-strict-aliasing  -DLIBICONV_PLUG -pipe -O3 -ffast-math -funroll-loops -fomit-frame-pointer -march=native -std=gnu++17 -MD -MT CMakeFiles/Kaitai.dir/lib/kaitai/kaitaistream.cpp.o -MF CMakeFiles/Kaitai.dir/lib/kaitai/kaitaistream.cpp.o.d -o CMakeFiles/Kaitai.dir/lib/kaitai/kaitaistream.cpp.o -c /wrkdirs/usr/ports/audio/mixxx/work/mixxx-2.3.0/lib/kaitai/kaitaistream.cpp
FAILED: CMakeFiles/Kaitai.dir/lib/kaitai/kaitaistream.cpp.o 
/usr/bin/c++ -DKS_STR_ENCODING_NONE -isystem /wrkdirs/usr/ports/audio/mixxx/work/mixxx-2.3.0/lib/kaitai -O2 -pipe -DLIBICONV_PLUG -fstack-protector-strong -fno-strict-aliasing  -DLIBICONV_PLUG -O2 -pipe -DLIBICONV_PLUG -fstack-protector-strong -fno-strict-aliasing  -DLIBICONV_PLUG -pipe -O3 -ffast-math -funroll-loops -fomit-frame-pointer -march=native -std=gnu++17 -MD -MT CMakeFiles/Kaitai.dir/lib/kaitai/kaitaistream.cpp.o -MF CMakeFiles/Kaitai.dir/lib/kaitai/kaitaistream.cpp.o.d -o CMakeFiles/Kaitai.dir/lib/kaitai/kaitaistream.cpp.o -c /wrkdirs/usr/ports/audio/mixxx/work/mixxx-2.3.0/lib/kaitai/kaitaistream.cpp
c++: error: the clang compiler does not support '-march=native'
[  0% 2/811] /usr/bin/c++   -O2 -pipe -DLIBICONV_PLUG -fstack-protector-strong -fno-strict-aliasing  -DLIBICONV_PLUG -O2 -pipe -DLIBICONV_PLUG -fstack-protector-strong -fno-strict-aliasing  -DLIBICONV_PLUG -pipe -O3 -ffast-math -funroll-loops -fomit-frame-pointer -march=native -fno-fast-math -std=gnu++17 -MD -MT CMakeFiles/FpClassify.dir/src/util/fpclassify.cpp.o -MF CMakeFiles/FpClassify.dir/src/util/fpclassify.cpp.o.d -o CMakeFiles/FpClassify.dir/src/util/fpclassify.cpp.o -c /wrkdirs/usr/ports/audio/mixxx/work/mixxx-2.3.0/src/util/fpclassify.cpp
FAILED: CMakeFiles/FpClassify.dir/src/util/fpclassify.cpp.o 
/usr/bin/c++   -O2 -pipe -DLIBICONV_PLUG -fstack-protector-strong -fno-strict-aliasing  -DLIBICONV_PLUG -O2 -pipe -DLIBICONV_PLUG -fstack-protector-strong -fno-strict-aliasing  -DLIBICONV_PLUG -pipe -O3 -ffast-math -funroll-loops -fomit-frame-pointer -march=native -fno-fast-math -std=gnu++17 -MD -MT CMakeFiles/FpClassify.dir/src/util/fpclassify.cpp.o -MF CMakeFiles/FpClassify.dir/src/util/fpclassify.cpp.o.d -o CMakeFiles/FpClassify.dir/src/util/fpclassify.cpp.o -c /wrkdirs/usr/ports/audio/mixxx/work/mixxx-2.3.0/src/util/fpclassify.cpp
c++: error: the clang compiler does not support '-march=native'
ninja: build stopped: subcommand failed.
===> Compilation failed unexpectedly.
Try to set MAKE_JOBS_UNSAFE=yes and rebuild before reporting the failure to
the maintainer.
*** Error code 1

Stop.
make: stopped in /usr/ports/audio/mixxx
Received on Tue Jul 27 2021 - 15:17:18 UTC

Original text of this message