[package - 114amd64-default][sysutils/passwordsafe] Failed for passwordsafe-1.12.0_1 in build

From: <pkg-fallout_at_FreeBSD.org>
Date: Tue, 27 Jul 2021 14:11:24 GMT
You are receiving this mail as a port that you maintain
is failing to build on the FreeBSD package build server.
Please investigate the failure and submit a PR to fix
build.

Maintainer:     brnrd_at_FreeBSD.org
Log URL:        http://beefy9.nyi.freebsd.org/data/114amd64-default/7129d8928446/logs/passwordsafe-1.12.0_1.log
Build URL:      http://beefy9.nyi.freebsd.org/build.html?mastername=114amd64-default&build=7129d8928446
Log:

=>> Building sysutils/passwordsafe
build started at Tue Jul 27 14:08:37 UTC 2021
port directory: /usr/ports/sysutils/passwordsafe
package name: passwordsafe-1.12.0_1
building for: FreeBSD 114amd64-default-job-04 11.4-RELEASE-p12 FreeBSD 11.4-RELEASE-p12 amd64
maintained by: brnrd_at_FreeBSD.org
Makefile ident: 
Poudriere version: 3.2.8-16-g00a37fcb
Host OSVERSION: 1400008
Jail OSVERSION: 1104001
Job Id: 04

---Begin Environment---
SHELL=/bin/csh
OSVERSION=1104001
UNAME_v=FreeBSD 11.4-RELEASE-p12
UNAME_r=11.4-RELEASE-p12
BLOCKSIZE=K
MAIL=/var/mail/root
STATUS=1
HOME=/root
PATH=/sbin:/bin:/usr/sbin:/usr/bin:/usr/local/sbin:/usr/local/bin:/root/bin
LOCALBASE=/usr/local
USER=root
LIBEXECPREFIX=/usr/local/libexec/poudriere
POUDRIERE_VERSION=3.2.8-16-g00a37fcb
MASTERMNT=/usr/local/poudriere/data/.m/114amd64-default/ref
POUDRIERE_BUILD_TYPE=bulk
PACKAGE_BUILDING=yes
SAVED_TERM=
PWD=/usr/local/poudriere/data/.m/114amd64-default/ref/.p/pool
P_PORTS_FEATURES=FLAVORS SELECTED_OPTIONS
MASTERNAME=114amd64-default
SCRIPTPREFIX=/usr/local/share/poudriere
OLDPWD=/usr/local/poudriere/data/.m/114amd64-default/ref/.p
SCRIPTPATH=/usr/local/share/poudriere/bulk.sh
POUDRIEREPATH=/usr/local/bin/poudriere
---End Environment---

---Begin Poudriere Port Flags/Env---
PORT_FLAGS=
PKGENV=
FLAVOR=
DEPENDS_ARGS=
MAKE_ARGS=
---End Poudriere Port Flags/Env---

---Begin OPTIONS List---
===> The following configuration options are available for passwordsafe-1.12.0_1:
     NLS=on: Native Language Support
     YUBIKEY=off: Yubikey support
===> Use 'make config' to modify these settings
---End OPTIONS List---

--MAINTAINER--
brnrd_at_FreeBSD.org
--End MAINTAINER--

--CONFIGURE_ARGS--

--End CONFIGURE_ARGS--

--CONFIGURE_ENV--
MAKE=gmake PKG_CONFIG=pkgconf XDG_DATA_HOME=/wrkdirs/usr/ports/sysutils/passwordsafe/work  XDG_CONFIG_HOME=/wrkdirs/usr/ports/sysutils/passwordsafe/work  HOME=/wrkdirs/usr/ports/sysutils/passwordsafe/work TMPDIR="/tmp" PATH=/wrkdirs/usr/ports/sysutils/passwordsafe/work/.bin:/sbin:/bin:/usr/sbin:/usr/bin:/usr/local/sbin:/usr/local/bin:/root/bin SHELL=/bin/sh CONFIG_SHELL=/bin/sh WX_CONFIG=/usr/local/bin/wxgtk3u-3.0-config
--End CONFIGURE_ENV--

--MAKE_ENV--
NO_QR=yes NO_YUBI=yes XDG_DATA_HOME=/wrkdirs/usr/ports/sysutils/passwordsafe/work  XDG_CONFIG_HOME=/wrkdirs/usr/ports/sysutils/passwordsafe/work  HOME=/wrkdirs/usr/ports/sysutils/passwordsafe/work TMPDIR="/tmp" PATH=/wrkdirs/usr/ports/sysutils/passwordsafe/work/.bin:/sbin:/bin:/usr/sbin:/usr/bin:/usr/local/sbin:/usr/local/bin:/root/bin NO_PIE=yes MK_DEBUG_FILES=no MK_KERNEL_SYMBOLS=no SHELL=/bin/sh NO_LINT=YES WX_CONFIG=/usr/local/bin/wxgtk3u-3.0-config PREFIX=/usr/local  LOCALBASE=/usr/local  CC="cc" CFLAGS="-O2 -pipe  -fstack-protector-strong -fno-strict-aliasing "  CPP="cpp" CPPFLAGS=""  LDFLAGS="-L/usr/local/lib -lqrencode -fstack-protector-strong " LIBS=""  CXX="c++" CXXFLAGS="-O2 -pipe -fstack-protector-strong -fno-strict-aliasing  "  MANPREFIX="/usr/local" BSD_INSTALL_PROGRAM="install  -s -m 555"  BSD_INSTALL_LIB="install  -s -m 0644"  BSD_INSTALL_SCRIPT="install  -m 555"  BSD_INSTALL_DATA="install  -m 0644"  BSD_INSTALL_MAN="install  -m 444"
--End MAKE_ENV--

--PLIST_SUB--
NLS="" NO_NLS="_at_comment " YUBIKEY="_at_comment " NO_YUBIKEY="" OSREL=11.4 PREFIX=%D LOCALBASE=/usr/local  RESETPREFIX=/usr/local LIB32DIR=lib DOCSDIR="share/doc/passwordsafe"  EXAMPLESDIR="share/examples/passwordsafe"  DATADIR="share/passwordsafe"  WWWDIR="www/passwordsafe"  ETCDIR="etc/passwordsafe"
--End PLIST_SUB--

--SUB_LIST--
NLS="" NO_NLS="_at_comment " YUBIKEY="_at_comment " NO_YUBIKEY="" PREFIX=/usr/local LOCALBASE=/usr/local  DATADIR=/usr/local/share/passwordsafe DOCSDIR=/usr/local/share/doc/passwordsafe EXAMPLESDIR=/usr/local/share/examples/passwordsafe  WWWDIR=/usr/local/www/passwordsafe ETCDIR=/usr/local/etc/passwordsafe
--End SUB_LIST--

---Begin make.conf---
USE_PACKAGE_DEPENDS=yes
BATCH=yes
WRKDIRPREFIX=/wrkdirs
PORTSDIR=/usr/ports
PACKAGES=/packages
DISTDIR=/distfiles
PACKAGE_BUILDING=yes
PACKAGE_BUILDING_FLAVORS=yes
#### /usr/local/etc/poudriere.d/make.conf ####
# XXX: We really need this but cannot use it while 'make checksum' does not
# try the next mirror on checksum failure.  It currently retries the same
# failed mirror and then fails rather then trying another.  It *does*
# try the next if the size is mismatched though.
#MASTER_SITE_FREEBSD=yes
# Build ALLOW_MAKE_JOBS_PACKAGES with 2 jobs
MAKE_JOBS_NUMBER=2
#### /usr/ports/Mk/Scripts/ports_env.sh ####
_CCVERSION_921dbbb2=FreeBSD clang version 10.0.0 (git_at_github.com:llvm/llvm-project.git llvmorg-10.0.0-0-gd32170dbd5b) Target: x86_64-unknown-freebsd11.4 Thread model: posix InstalledDir: /usr/bin
_ALTCCVERSION_921dbbb2=none
_CXXINTERNAL_acaad9ca=FreeBSD clang version 10.0.0 (git_at_github.com:llvm/llvm-project.git llvmorg-10.0.0-0-gd32170dbd5b) Target: x86_64-unknown-freebsd11.4 Thread model: posix InstalledDir: /usr/bin "/usr/bin/ld" "--eh-frame-hdr" "-dynamic-linker" "/libexec/ld-elf.so.1" "--hash-style=both" "--enable-new-dtags" "-o" "a.out" "/usr/lib/crt1.o" "/usr/lib/crti.o" "/usr/lib/crtbegin.o" "-L/usr/lib" "/dev/null" "-lc++" "-lm" "-lgcc" "--as-needed" "-lgcc_s" "--no-as-needed" "-lc" "-lgcc" "--as-needed" "-lgcc_s" "--no-as-needed" "/usr/lib/crtend.o" "/usr/lib/crtn.o"
CC_OUTPUT_921dbbb2_58173849=yes
CC_OUTPUT_921dbbb2_9bdba57c=yes
CC_OUTPUT_921dbbb2_6a4fe7f5=yes
CC_OUTPUT_921dbbb2_6bcac02b=yes
CC_OUTPUT_921dbbb2_67d20829=yes
CC_OUTPUT_921dbbb2_bfa62e83=yes
CC_OUTPUT_921dbbb2_f0b4d593=yes
CC_OUTPUT_921dbbb2_308abb44=yes
CC_OUTPUT_921dbbb2_f00456e5=yes
CC_OUTPUT_921dbbb2_65ad290d=yes
CC_OUTPUT_921dbbb2_f2776b26=yes
CC_OUTPUT_921dbbb2_b2657cc3=yes
CC_OUTPUT_921dbbb2_380987f7=yes
CC_OUTPUT_921dbbb2_160933ec=yes
CC_OUTPUT_921dbbb2_fb62803b=yes
_OBJC_CCVERSION_921dbbb2=FreeBSD clang version 10.0.0 (git_at_github.com:llvm/llvm-project.git llvmorg-10.0.0-0-gd32170dbd5b) Target: x86_64-unknown-freebsd11.4 Thread model: posix InstalledDir: /usr/bin
_OBJC_ALTCCVERSION_921dbbb2=none
ARCH=amd64
OPSYS=FreeBSD
_OSRELEASE=11.4-RELEASE-p12
OSREL=11.4
OSVERSION=1104001
PYTHONBASE=/usr/local
HAVE_COMPAT_IA32_KERN=YES
CONFIGURE_MAX_CMD_LEN=524288
HAVE_PORTS_ENV=1
#### Misc Poudriere ####
GID=0
UID=0
DISABLE_MAKE_JOBS=poudriere
---End make.conf---
--Resource limits--
cpu time               (seconds, -t)  unlimited
file size           (512-blocks, -f)  unlimited
data seg size           (kbytes, -d)  33554432
stack size              (kbytes, -s)  524288
core file size      (512-blocks, -c)  unlimited
max memory size         (kbytes, -m)  unlimited
locked memory           (kbytes, -l)  unlimited
max user processes              (-u)  89999
open files                      (-n)  1024
virtual mem size        (kbytes, -v)  unlimited
swap limit              (kbytes, -w)  unlimited
socket buffer size       (bytes, -b)  unlimited
pseudo-terminals                (-p)  unlimited
kqueues                         (-k)  unlimited
umtx shared locks               (-o)  unlimited
--End resource limits--
=======================<phase: check-sanity   >============================
===>  License ART20 accepted by the user
===========================================================================
=======================<phase: pkg-depends    >============================
===>   passwordsafe-1.12.0_1 depends on file: /usr/local/sbin/pkg - not found
===>   Installing existing package /packages/All/pkg-1.17.0.pkg
[114amd64-default-job-04] Installing pkg-1.17.0...
[114amd64-default-job-04] Extracting pkg-1.17.0: .......... done
===>   passwordsafe-1.12.0_1 depends on file: /usr/local/sbin/pkg - found
===>   Returning to build of passwordsafe-1.12.0_1
===========================================================================
=======================<phase: fetch-depends  >============================
===========================================================================
=======================<phase: fetch          >============================
===>  License ART20 accepted by the user
===> Fetching all distfiles required by passwordsafe-1.12.0_1 for building
===========================================================================
=======================<phase: checksum       >============================
===>  License ART20 accepted by the user
===> Fetching all distfiles required by passwordsafe-1.12.0_1 for building
=> SHA256 Checksum OK for pwsafe-pwsafe-1.12.0_GH0.tar.gz.
===========================================================================
=======================<phase: extract-depends>============================
===========================================================================
=======================<phase: extract        >============================
===>  License ART20 accepted by the user
===> Fetching all distfiles required by passwordsafe-1.12.0_1 for building
===>  Extracting for passwordsafe-1.12.0_1
=> SHA256 Checksum OK for pwsafe-pwsafe-1.12.0_GH0.tar.gz.
===========================================================================
=======================<phase: patch-depends  >============================
===========================================================================
=======================<phase: patch          >============================
===>  Patching for passwordsafe-1.12.0_1
===>  Applying FreeBSD patches for passwordsafe-1.12.0_1 from /usr/ports/sysutils/passwordsafe/files
/usr/bin/sed -i.bak -e 's|/usr/local|/usr/local|' /wrkdirs/usr/ports/sysutils/passwordsafe/work/pwsafe-1.12.0/Makefile.freebsd
/usr/bin/sed -i.bak -e 's|/usr/local|/usr/local|' /wrkdirs/usr/ports/sysutils/passwordsafe/work/pwsafe-1.12.0/help/Makefile.freebsd
/usr/bin/sed -i.bak -e 's|/usr/local|/usr/local|' /wrkdirs/usr/ports/sysutils/passwordsafe/work/pwsafe-1.12.0/src/os/unix/Makefile
/usr/bin/sed -i.bak -e 's|/usr/local|/usr/local|' /wrkdirs/usr/ports/sysutils/passwordsafe/work/pwsafe-1.12.0/src/os/unix/dir.cpp
/usr/bin/sed -i.bak -e 's|/usr/local|/usr/local|' /wrkdirs/usr/ports/sysutils/passwordsafe/work/pwsafe-1.12.0/src/ui/wxWidgets/Makefile
===========================================================================
=======================<phase: build-depends  >============================
===>   passwordsafe-1.12.0_1 depends on executable: zip - not found
===>   Installing existing package /packages/All/zip-3.0_1.pkg
[114amd64-default-job-04] Installing zip-3.0_1...
[114amd64-default-job-04] Extracting zip-3.0_1: .......... done
===>   passwordsafe-1.12.0_1 depends on executable: zip - found
===>   Returning to build of passwordsafe-1.12.0_1
===>   passwordsafe-1.12.0_1 depends on package: gmake>=4.3 - not found
===>   Installing existing package /packages/All/gmake-4.3_2.pkg
[114amd64-default-job-04] Installing gmake-4.3_2...
[114amd64-default-job-04] `-- Installing gettext-runtime-0.21...
<snip>
KeySend.cpp:27:1: warning: 'PrefT' defined as a struct template here but previously declared as a class template; this is valid, but may result in linker errors under the Microsoft C++ ABI [-Wmismatched-tags]
struct PrefT<PWSprefs::IntPrefs> {
^
KeySend.cpp:19:1: note: did you mean struct here?
class PrefT;
^~~~~
struct
KeySend.cpp:32:1: warning: 'PrefT' defined as a struct template here but previously declared as a class template; this is valid, but may result in linker errors under the Microsoft C++ ABI [-Wmismatched-tags]
struct PrefT<PWSprefs::StringPrefs> {
^
KeySend.cpp:19:1: note: did you mean struct here?
class PrefT;
^~~~~
struct
3 warnings generated.
c++ -O2 -pipe -fstack-protector-strong -fno-strict-aliasing   -I/usr/local/include -fPIC -Wall -I../../core -I../.. `/usr/local/bin/wxgtk3u-3.0-config --debug=no --unicode=yes --inplace --cxxflags`  -O2 -pipe -fstack-protector-strong -fno-strict-aliasing   -I/usr/local/include -fPIC -Wall -I../../core -I../.. `/usr/local/bin/wxgtk3u-3.0-config --debug=no --unicode=yes --inplace --cxxflags`  -std=c++11 -O0 -g -ggdb -DUNICODE -DDEBUG -O -DUNICODE -DNDEBUG -c sleep.cpp -o ../../../obj/unicoderelease/os/sleep.o
c++ -O2 -pipe -fstack-protector-strong -fno-strict-aliasing   -I/usr/local/include -fPIC -Wall -I../../core -I../.. `/usr/local/bin/wxgtk3u-3.0-config --debug=no --unicode=yes --inplace --cxxflags`  -O2 -pipe -fstack-protector-strong -fno-strict-aliasing   -I/usr/local/include -fPIC -Wall -I../../core -I../.. `/usr/local/bin/wxgtk3u-3.0-config --debug=no --unicode=yes --inplace --cxxflags`  -std=c++11 -O0 -g -ggdb -DUNICODE -DDEBUG -O -DUNICODE -DNDEBUG -c xsendstring.cpp -o ../../../obj/unicoderelease/os/xsendstring.o
c++ -O2 -pipe -fstack-protector-strong -fno-strict-aliasing   -I/usr/local/include -fPIC -Wall -I../../core -I../.. `/usr/local/bin/wxgtk3u-3.0-config --debug=no --unicode=yes --inplace --cxxflags`  -O2 -pipe -fstack-protector-strong -fno-strict-aliasing   -I/usr/local/include -fPIC -Wall -I../../core -I../.. `/usr/local/bin/wxgtk3u-3.0-config --debug=no --unicode=yes --inplace --cxxflags`  -std=c++11 -O0 -g -ggdb -DUNICODE -DDEBUG -O -DUNICODE -DNDEBUG -c keyname.cpp -o ../../../obj/unicoderelease/os/keyname.o
c++ -O2 -pipe -fstack-protector-strong -fno-strict-aliasing   -I/usr/local/include -fPIC -Wall -I../../core -I../.. `/usr/local/bin/wxgtk3u-3.0-config --debug=no --unicode=yes --inplace --cxxflags`  -O2 -pipe -fstack-protector-strong -fno-strict-aliasing   -I/usr/local/include -fPIC -Wall -I../../core -I../.. `/usr/local/bin/wxgtk3u-3.0-config --debug=no --unicode=yes --inplace --cxxflags`  -std=c++11 -O0 -g -ggdb -DUNICODE -DDEBUG -O -DUNICODE -DNDEBUG -c registry.cpp -o ../../../obj/unicoderelease/os/registry.o
c++ -O2 -pipe -fstack-protector-strong -fno-strict-aliasing   -I/usr/local/include -fPIC -Wall -I../../core -I../.. `/usr/local/bin/wxgtk3u-3.0-config --debug=no --unicode=yes --inplace --cxxflags`  -O2 -pipe -fstack-protector-strong -fno-strict-aliasing   -I/usr/local/include -fPIC -Wall -I../../core -I../.. `/usr/local/bin/wxgtk3u-3.0-config --debug=no --unicode=yes --inplace --cxxflags`  -std=c++11 -O0 -g -ggdb -DUNICODE -DDEBUG -O -DUNICODE -DNDEBUG -c UUID.cpp -o ../../../obj/unicoderelease/os/UUID.o
c++ -O2 -pipe -fstack-protector-strong -fno-strict-aliasing   -I/usr/local/include -fPIC -Wall -I../../core -I../.. `/usr/local/bin/wxgtk3u-3.0-config --debug=no --unicode=yes --inplace --cxxflags`  -O2 -pipe -fstack-protector-strong -fno-strict-aliasing   -I/usr/local/include -fPIC -Wall -I../../core -I../.. `/usr/local/bin/wxgtk3u-3.0-config --debug=no --unicode=yes --inplace --cxxflags`  -std=c++11 -O0 -g -ggdb -DUNICODE -DDEBUG -O -DUNICODE -DNDEBUG -c unicode2keysym.cpp -o ../../../obj/unicoderelease/os/unicode2keysym.o
ar rvus ../../../lib/unicoderelease/libos.a ../../../obj/unicoderelease/os/cleanup.o ../../../obj/unicoderelease/os/debug.o ../../../obj/unicoderelease/os/dir.o ../../../obj/unicoderelease/os/env.o ../../../obj/unicoderelease/os/file.o ../../../obj/unicoderelease/os/logit.o ../../../obj/unicoderelease/os/media.o ../../../obj/unicoderelease/os/mem.o ../../../obj/unicoderelease/os/pws_str.o ../../../obj/unicoderelease/os/pws_time.o ../../../obj/unicoderelease/os/rand.o ../../../obj/unicoderelease/os/run.o ../../../obj/unicoderelease/os/utf8conv.o ../../../obj/unicoderelease/os/KeySend.o ../../../obj/unicoderelease/os/sleep.o ../../../obj/unicoderelease/os/xsendstring.o ../../../obj/unicoderelease/os/keyname.o ../../../obj/unicoderelease/os/registry.o ../../../obj/unicoderelease/os/UUID.o ../../../obj/unicoderelease/os/unicode2keysym.o
ar: warning: creating ../../../lib/unicoderelease/libos.a
a - ../../../obj/unicoderelease/os/cleanup.o
a - ../../../obj/unicoderelease/os/debug.o
a - ../../../obj/unicoderelease/os/dir.o
a - ../../../obj/unicoderelease/os/env.o
a - ../../../obj/unicoderelease/os/file.o
a - ../../../obj/unicoderelease/os/logit.o
a - ../../../obj/unicoderelease/os/media.o
a - ../../../obj/unicoderelease/os/mem.o
a - ../../../obj/unicoderelease/os/pws_str.o
a - ../../../obj/unicoderelease/os/pws_time.o
a - ../../../obj/unicoderelease/os/rand.o
a - ../../../obj/unicoderelease/os/run.o
a - ../../../obj/unicoderelease/os/utf8conv.o
a - ../../../obj/unicoderelease/os/KeySend.o
a - ../../../obj/unicoderelease/os/sleep.o
a - ../../../obj/unicoderelease/os/xsendstring.o
a - ../../../obj/unicoderelease/os/keyname.o
a - ../../../obj/unicoderelease/os/registry.o
a - ../../../obj/unicoderelease/os/UUID.o
a - ../../../obj/unicoderelease/os/unicode2keysym.o
gmake[3]: Leaving directory '/wrkdirs/usr/ports/sysutils/passwordsafe/work/pwsafe-1.12.0/src/os/unix'
gmake[2]: Leaving directory '/wrkdirs/usr/ports/sysutils/passwordsafe/work/pwsafe-1.12.0/src/os/unix'
gmake -C src/core unicoderelease
gmake[2]: Entering directory '/wrkdirs/usr/ports/sysutils/passwordsafe/work/pwsafe-1.12.0/src/core'
./../Misc/rc2cpp.pl core.rc2
gmake all CONFIG=unicoderelease
gmake[3]: Entering directory '/wrkdirs/usr/ports/sysutils/passwordsafe/work/pwsafe-1.12.0/src/core'
c++ -O2 -pipe -fstack-protector-strong -fno-strict-aliasing   -I/usr/local/include -fPIC -Wall -I. -I.. -I../.. -O2 -pipe -fstack-protector-strong -fno-strict-aliasing   -I/usr/local/include -fPIC -Wall -I. -I.. -I../.. -std=c++11 -DLINUX -O0 -g -ggdb -DUNICODE -DUSE_XML_LIBRARY=XERCES -DWCHAR_INCOMPATIBLE_XMLCH -D_DEBUG -DDEBUG `/usr/local/bin/wxgtk3u-3.0-config --debug=yes --unicode=yes --inplace --cxxflags` -DLINUX -O -DUNICODE -DUSE_XML_LIBRARY=XERCES -DWCHAR_INCOMPATIBLE_XMLCH -DNDEBUG `/usr/local/bin/wxgtk3u-3.0-config --debug=no --unicode=yes --inplace --cxxflags` -c CheckVersion.cpp -o ../../obj/unicoderelease/core/CheckVersion.o
c++ -O2 -pipe -fstack-protector-strong -fno-strict-aliasing   -I/usr/local/include -fPIC -Wall -I. -I.. -I../.. -O2 -pipe -fstack-protector-strong -fno-strict-aliasing   -I/usr/local/include -fPIC -Wall -I. -I.. -I../.. -std=c++11 -DLINUX -O0 -g -ggdb -DUNICODE -DUSE_XML_LIBRARY=XERCES -DWCHAR_INCOMPATIBLE_XMLCH -D_DEBUG -DDEBUG `/usr/local/bin/wxgtk3u-3.0-config --debug=yes --unicode=yes --inplace --cxxflags` -DLINUX -O -DUNICODE -DUSE_XML_LIBRARY=XERCES -DWCHAR_INCOMPATIBLE_XMLCH -DNDEBUG `/usr/local/bin/wxgtk3u-3.0-config --debug=no --unicode=yes --inplace --cxxflags` -c Item.cpp -o ../../obj/unicoderelease/core/Item.o
c++ -O2 -pipe -fstack-protector-strong -fno-strict-aliasing   -I/usr/local/include -fPIC -Wall -I. -I.. -I../.. -O2 -pipe -fstack-protector-strong -fno-strict-aliasing   -I/usr/local/include -fPIC -Wall -I. -I.. -I../.. -std=c++11 -DLINUX -O0 -g -ggdb -DUNICODE -DUSE_XML_LIBRARY=XERCES -DWCHAR_INCOMPATIBLE_XMLCH -D_DEBUG -DDEBUG `/usr/local/bin/wxgtk3u-3.0-config --debug=yes --unicode=yes --inplace --cxxflags` -DLINUX -O -DUNICODE -DUSE_XML_LIBRARY=XERCES -DWCHAR_INCOMPATIBLE_XMLCH -DNDEBUG `/usr/local/bin/wxgtk3u-3.0-config --debug=no --unicode=yes --inplace --cxxflags` -c ItemData.cpp -o ../../obj/unicoderelease/core/ItemData.o
c++ -O2 -pipe -fstack-protector-strong -fno-strict-aliasing   -I/usr/local/include -fPIC -Wall -I. -I.. -I../.. -O2 -pipe -fstack-protector-strong -fno-strict-aliasing   -I/usr/local/include -fPIC -Wall -I. -I.. -I../.. -std=c++11 -DLINUX -O0 -g -ggdb -DUNICODE -DUSE_XML_LIBRARY=XERCES -DWCHAR_INCOMPATIBLE_XMLCH -D_DEBUG -DDEBUG `/usr/local/bin/wxgtk3u-3.0-config --debug=yes --unicode=yes --inplace --cxxflags` -DLINUX -O -DUNICODE -DUSE_XML_LIBRARY=XERCES -DWCHAR_INCOMPATIBLE_XMLCH -DNDEBUG `/usr/local/bin/wxgtk3u-3.0-config --debug=no --unicode=yes --inplace --cxxflags` -c ItemAtt.cpp -o ../../obj/unicoderelease/core/ItemAtt.o
c++ -O2 -pipe -fstack-protector-strong -fno-strict-aliasing   -I/usr/local/include -fPIC -Wall -I. -I.. -I../.. -O2 -pipe -fstack-protector-strong -fno-strict-aliasing   -I/usr/local/include -fPIC -Wall -I. -I.. -I../.. -std=c++11 -DLINUX -O0 -g -ggdb -DUNICODE -DUSE_XML_LIBRARY=XERCES -DWCHAR_INCOMPATIBLE_XMLCH -D_DEBUG -DDEBUG `/usr/local/bin/wxgtk3u-3.0-config --debug=yes --unicode=yes --inplace --cxxflags` -DLINUX -O -DUNICODE -DUSE_XML_LIBRARY=XERCES -DWCHAR_INCOMPATIBLE_XMLCH -DNDEBUG `/usr/local/bin/wxgtk3u-3.0-config --debug=no --unicode=yes --inplace --cxxflags` -c ItemField.cpp -o ../../obj/unicoderelease/core/ItemField.o
c++ -O2 -pipe -fstack-protector-strong -fno-strict-aliasing   -I/usr/local/include -fPIC -Wall -I. -I.. -I../.. -O2 -pipe -fstack-protector-strong -fno-strict-aliasing   -I/usr/local/include -fPIC -Wall -I. -I.. -I../.. -std=c++11 -DLINUX -O0 -g -ggdb -DUNICODE -DUSE_XML_LIBRARY=XERCES -DWCHAR_INCOMPATIBLE_XMLCH -D_DEBUG -DDEBUG `/usr/local/bin/wxgtk3u-3.0-config --debug=yes --unicode=yes --inplace --cxxflags` -DLINUX -O -DUNICODE -DUSE_XML_LIBRARY=XERCES -DWCHAR_INCOMPATIBLE_XMLCH -DNDEBUG `/usr/local/bin/wxgtk3u-3.0-config --debug=no --unicode=yes --inplace --cxxflags` -c Match.cpp -o ../../obj/unicoderelease/core/Match.o
c++ -O2 -pipe -fstack-protector-strong -fno-strict-aliasing   -I/usr/local/include -fPIC -Wall -I. -I.. -I../.. -O2 -pipe -fstack-protector-strong -fno-strict-aliasing   -I/usr/local/include -fPIC -Wall -I. -I.. -I../.. -std=c++11 -DLINUX -O0 -g -ggdb -DUNICODE -DUSE_XML_LIBRARY=XERCES -DWCHAR_INCOMPATIBLE_XMLCH -D_DEBUG -DDEBUG `/usr/local/bin/wxgtk3u-3.0-config --debug=yes --unicode=yes --inplace --cxxflags` -DLINUX -O -DUNICODE -DUSE_XML_LIBRARY=XERCES -DWCHAR_INCOMPATIBLE_XMLCH -DNDEBUG `/usr/local/bin/wxgtk3u-3.0-config --debug=no --unicode=yes --inplace --cxxflags` -c PolicyManager.cpp -o ../../obj/unicoderelease/core/PolicyManager.o
c++ -O2 -pipe -fstack-protector-strong -fno-strict-aliasing   -I/usr/local/include -fPIC -Wall -I. -I.. -I../.. -O2 -pipe -fstack-protector-strong -fno-strict-aliasing   -I/usr/local/include -fPIC -Wall -I. -I.. -I../.. -std=c++11 -DLINUX -O0 -g -ggdb -DUNICODE -DUSE_XML_LIBRARY=XERCES -DWCHAR_INCOMPATIBLE_XMLCH -D_DEBUG -DDEBUG `/usr/local/bin/wxgtk3u-3.0-config --debug=yes --unicode=yes --inplace --cxxflags` -DLINUX -O -DUNICODE -DUSE_XML_LIBRARY=XERCES -DWCHAR_INCOMPATIBLE_XMLCH -DNDEBUG `/usr/local/bin/wxgtk3u-3.0-config --debug=no --unicode=yes --inplace --cxxflags` -c PWCharPool.cpp -o ../../obj/unicoderelease/core/PWCharPool.o
c++ -O2 -pipe -fstack-protector-strong -fno-strict-aliasing   -I/usr/local/include -fPIC -Wall -I. -I.. -I../.. -O2 -pipe -fstack-protector-strong -fno-strict-aliasing   -I/usr/local/include -fPIC -Wall -I. -I.. -I../.. -std=c++11 -DLINUX -O0 -g -ggdb -DUNICODE -DUSE_XML_LIBRARY=XERCES -DWCHAR_INCOMPATIBLE_XMLCH -D_DEBUG -DDEBUG `/usr/local/bin/wxgtk3u-3.0-config --debug=yes --unicode=yes --inplace --cxxflags` -DLINUX -O -DUNICODE -DUSE_XML_LIBRARY=XERCES -DWCHAR_INCOMPATIBLE_XMLCH -DNDEBUG `/usr/local/bin/wxgtk3u-3.0-config --debug=no --unicode=yes --inplace --cxxflags` -c CoreImpExp.cpp -o ../../obj/unicoderelease/core/CoreImpExp.o
CoreImpExp.cpp:258:16: warning: unused variable 'numwritten' [-Wunused-variable]
        size_t numwritten = fwrite(m_ofs.str().c_str(), 1, m_ofs.str().length(), m_txtfile);
               ^
CoreImpExp.cpp:419:12: warning: unused variable 'numwritten' [-Wunused-variable]
    size_t numwritten = fwrite(m_ofs.str().c_str(), 1, m_ofs.str().length(), m_xmlfile);
           ^
2 warnings generated.
c++ -O2 -pipe -fstack-protector-strong -fno-strict-aliasing   -I/usr/local/include -fPIC -Wall -I. -I.. -I../.. -O2 -pipe -fstack-protector-strong -fno-strict-aliasing   -I/usr/local/include -fPIC -Wall -I. -I.. -I../.. -std=c++11 -DLINUX -O0 -g -ggdb -DUNICODE -DUSE_XML_LIBRARY=XERCES -DWCHAR_INCOMPATIBLE_XMLCH -D_DEBUG -DDEBUG `/usr/local/bin/wxgtk3u-3.0-config --debug=yes --unicode=yes --inplace --cxxflags` -DLINUX -O -DUNICODE -DUSE_XML_LIBRARY=XERCES -DWCHAR_INCOMPATIBLE_XMLCH -DNDEBUG `/usr/local/bin/wxgtk3u-3.0-config --debug=no --unicode=yes --inplace --cxxflags` -c PWPolicy.cpp -o ../../obj/unicoderelease/core/PWPolicy.o
PWPolicy.cpp:301:7: warning: unused variable 'total_sublength' [-Wunused-variable]
  int total_sublength = (
      ^
1 warning generated.
c++ -O2 -pipe -fstack-protector-strong -fno-strict-aliasing   -I/usr/local/include -fPIC -Wall -I. -I.. -I../.. -O2 -pipe -fstack-protector-strong -fno-strict-aliasing   -I/usr/local/include -fPIC -Wall -I. -I.. -I../.. -std=c++11 -DLINUX -O0 -g -ggdb -DUNICODE -DUSE_XML_LIBRARY=XERCES -DWCHAR_INCOMPATIBLE_XMLCH -D_DEBUG -DDEBUG `/usr/local/bin/wxgtk3u-3.0-config --debug=yes --unicode=yes --inplace --cxxflags` -DLINUX -O -DUNICODE -DUSE_XML_LIBRARY=XERCES -DWCHAR_INCOMPATIBLE_XMLCH -DNDEBUG `/usr/local/bin/wxgtk3u-3.0-config --debug=no --unicode=yes --inplace --cxxflags` -c PWHistory.cpp -o ../../obj/unicoderelease/core/PWHistory.o
c++ -O2 -pipe -fstack-protector-strong -fno-strict-aliasing   -I/usr/local/include -fPIC -Wall -I. -I.. -I../.. -O2 -pipe -fstack-protector-strong -fno-strict-aliasing   -I/usr/local/include -fPIC -Wall -I. -I.. -I../.. -std=c++11 -DLINUX -O0 -g -ggdb -DUNICODE -DUSE_XML_LIBRARY=XERCES -DWCHAR_INCOMPATIBLE_XMLCH -D_DEBUG -DDEBUG `/usr/local/bin/wxgtk3u-3.0-config --debug=yes --unicode=yes --inplace --cxxflags` -DLINUX -O -DUNICODE -DUSE_XML_LIBRARY=XERCES -DWCHAR_INCOMPATIBLE_XMLCH -DNDEBUG `/usr/local/bin/wxgtk3u-3.0-config --debug=no --unicode=yes --inplace --cxxflags` -c PWSAuxParse.cpp -o ../../obj/unicoderelease/core/PWSAuxParse.o
c++ -O2 -pipe -fstack-protector-strong -fno-strict-aliasing   -I/usr/local/include -fPIC -Wall -I. -I.. -I../.. -O2 -pipe -fstack-protector-strong -fno-strict-aliasing   -I/usr/local/include -fPIC -Wall -I. -I.. -I../.. -std=c++11 -DLINUX -O0 -g -ggdb -DUNICODE -DUSE_XML_LIBRARY=XERCES -DWCHAR_INCOMPATIBLE_XMLCH -D_DEBUG -DDEBUG `/usr/local/bin/wxgtk3u-3.0-config --debug=yes --unicode=yes --inplace --cxxflags` -DLINUX -O -DUNICODE -DUSE_XML_LIBRARY=XERCES -DWCHAR_INCOMPATIBLE_XMLCH -DNDEBUG `/usr/local/bin/wxgtk3u-3.0-config --debug=no --unicode=yes --inplace --cxxflags` -c PWScore.cpp -o ../../obj/unicoderelease/core/PWScore.o
PWScore.cpp:3693:28: warning: 'bind2nd<std::__1::equal_to<pws_os::CUUID>, pws_os::CUUID>' is deprecated [-Wdeprecated-declarations]
                      std::bind2nd(std::equal_to<pws_os::CUUID>(), uuid));
                           ^
/usr/include/c++/v1/functional:1089:1: note: 'bind2nd<std::__1::equal_to<pws_os::CUUID>, pws_os::CUUID>' has been explicitly marked deprecated here
_LIBCPP_DEPRECATED_IN_CXX11 inline _LIBCPP_INLINE_VISIBILITY
^
/usr/include/c++/v1/__config:972:39: note: expanded from macro '_LIBCPP_DEPRECATED_IN_CXX11'
#  define _LIBCPP_DEPRECATED_IN_CXX11 _LIBCPP_DEPRECATED
                                      ^
/usr/include/c++/v1/__config:961:48: note: expanded from macro '_LIBCPP_DEPRECATED'
#    define _LIBCPP_DEPRECATED __attribute__ ((deprecated))
                                               ^
PWScore.cpp:734:12: warning: private field 'm_pcore' is not used [-Wunused-private-field]
  PWScore *m_pcore;
           ^
2 warnings generated.
c++ -O2 -pipe -fstack-protector-strong -fno-strict-aliasing   -I/usr/local/include -fPIC -Wall -I. -I.. -I../.. -O2 -pipe -fstack-protector-strong -fno-strict-aliasing   -I/usr/local/include -fPIC -Wall -I. -I.. -I../.. -std=c++11 -DLINUX -O0 -g -ggdb -DUNICODE -DUSE_XML_LIBRARY=XERCES -DWCHAR_INCOMPATIBLE_XMLCH -D_DEBUG -DDEBUG `/usr/local/bin/wxgtk3u-3.0-config --debug=yes --unicode=yes --inplace --cxxflags` -DLINUX -O -DUNICODE -DUSE_XML_LIBRARY=XERCES -DWCHAR_INCOMPATIBLE_XMLCH -DNDEBUG `/usr/local/bin/wxgtk3u-3.0-config --debug=no --unicode=yes --inplace --cxxflags` -c PWSdirs.cpp -o ../../obj/unicoderelease/core/PWSdirs.o
c++ -O2 -pipe -fstack-protector-strong -fno-strict-aliasing   -I/usr/local/include -fPIC -Wall -I. -I.. -I../.. -O2 -pipe -fstack-protector-strong -fno-strict-aliasing   -I/usr/local/include -fPIC -Wall -I. -I.. -I../.. -std=c++11 -DLINUX -O0 -g -ggdb -DUNICODE -DUSE_XML_LIBRARY=XERCES -DWCHAR_INCOMPATIBLE_XMLCH -D_DEBUG -DDEBUG `/usr/local/bin/wxgtk3u-3.0-config --debug=yes --unicode=yes --inplace --cxxflags` -DLINUX -O -DUNICODE -DUSE_XML_LIBRARY=XERCES -DWCHAR_INCOMPATIBLE_XMLCH -DNDEBUG `/usr/local/bin/wxgtk3u-3.0-config --debug=no --unicode=yes --inplace --cxxflags` -c PWSfile.cpp -o ../../obj/unicoderelease/core/PWSfile.o
In file included from PWSfile.cpp:9:
./PWSfileV1V2.h:38:10: warning: 'PWSfileV1V2::ReadCBC' hides overloaded virtual function [-Woverloaded-virtual]
  size_t ReadCBC(unsigned char &type, StringX &data);
         ^
./PWSfile.h:163:18: note: hidden overloaded virtual function 'PWSfile::ReadCBC' declared here: different number of parameters (3 vs 2)
  virtual size_t ReadCBC(unsigned char &type, unsigned char* &data,
                 ^
1 warning generated.
c++ -O2 -pipe -fstack-protector-strong -fno-strict-aliasing   -I/usr/local/include -fPIC -Wall -I. -I.. -I../.. -O2 -pipe -fstack-protector-strong -fno-strict-aliasing   -I/usr/local/include -fPIC -Wall -I. -I.. -I../.. -std=c++11 -DLINUX -O0 -g -ggdb -DUNICODE -DUSE_XML_LIBRARY=XERCES -DWCHAR_INCOMPATIBLE_XMLCH -D_DEBUG -DDEBUG `/usr/local/bin/wxgtk3u-3.0-config --debug=yes --unicode=yes --inplace --cxxflags` -DLINUX -O -DUNICODE -DUSE_XML_LIBRARY=XERCES -DWCHAR_INCOMPATIBLE_XMLCH -DNDEBUG `/usr/local/bin/wxgtk3u-3.0-config --debug=no --unicode=yes --inplace --cxxflags` -c PWSfileHeader.cpp -o ../../obj/unicoderelease/core/PWSfileHeader.o
c++ -O2 -pipe -fstack-protector-strong -fno-strict-aliasing   -I/usr/local/include -fPIC -Wall -I. -I.. -I../.. -O2 -pipe -fstack-protector-strong -fno-strict-aliasing   -I/usr/local/include -fPIC -Wall -I. -I.. -I../.. -std=c++11 -DLINUX -O0 -g -ggdb -DUNICODE -DUSE_XML_LIBRARY=XERCES -DWCHAR_INCOMPATIBLE_XMLCH -D_DEBUG -DDEBUG `/usr/local/bin/wxgtk3u-3.0-config --debug=yes --unicode=yes --inplace --cxxflags` -DLINUX -O -DUNICODE -DUSE_XML_LIBRARY=XERCES -DWCHAR_INCOMPATIBLE_XMLCH -DNDEBUG `/usr/local/bin/wxgtk3u-3.0-config --debug=no --unicode=yes --inplace --cxxflags` -c PWSfileV1V2.cpp -o ../../obj/unicoderelease/core/PWSfileV1V2.o
In file included from PWSfileV1V2.cpp:8:
./PWSfileV1V2.h:38:10: warning: 'PWSfileV1V2::ReadCBC' hides overloaded virtual function [-Woverloaded-virtual]
  size_t ReadCBC(unsigned char &type, StringX &data);
         ^
./PWSfile.h:163:18: note: hidden overloaded virtual function 'PWSfile::ReadCBC' declared here: different number of parameters (3 vs 2)
  virtual size_t ReadCBC(unsigned char &type, unsigned char* &data,
                 ^
1 warning generated.
c++ -O2 -pipe -fstack-protector-strong -fno-strict-aliasing   -I/usr/local/include -fPIC -Wall -I. -I.. -I../.. -O2 -pipe -fstack-protector-strong -fno-strict-aliasing   -I/usr/local/include -fPIC -Wall -I. -I.. -I../.. -std=c++11 -DLINUX -O0 -g -ggdb -DUNICODE -DUSE_XML_LIBRARY=XERCES -DWCHAR_INCOMPATIBLE_XMLCH -D_DEBUG -DDEBUG `/usr/local/bin/wxgtk3u-3.0-config --debug=yes --unicode=yes --inplace --cxxflags` -DLINUX -O -DUNICODE -DUSE_XML_LIBRARY=XERCES -DWCHAR_INCOMPATIBLE_XMLCH -DNDEBUG `/usr/local/bin/wxgtk3u-3.0-config --debug=no --unicode=yes --inplace --cxxflags` -c PWSfileV3.cpp -o ../../obj/unicoderelease/core/PWSfileV3.o
c++ -O2 -pipe -fstack-protector-strong -fno-strict-aliasing   -I/usr/local/include -fPIC -Wall -I. -I.. -I../.. -O2 -pipe -fstack-protector-strong -fno-strict-aliasing   -I/usr/local/include -fPIC -Wall -I. -I.. -I../.. -std=c++11 -DLINUX -O0 -g -ggdb -DUNICODE -DUSE_XML_LIBRARY=XERCES -DWCHAR_INCOMPATIBLE_XMLCH -D_DEBUG -DDEBUG `/usr/local/bin/wxgtk3u-3.0-config --debug=yes --unicode=yes --inplace --cxxflags` -DLINUX -O -DUNICODE -DUSE_XML_LIBRARY=XERCES -DWCHAR_INCOMPATIBLE_XMLCH -DNDEBUG `/usr/local/bin/wxgtk3u-3.0-config --debug=no --unicode=yes --inplace --cxxflags` -c PWSfileV4.cpp -o ../../obj/unicoderelease/core/PWSfileV4.o
c++ -O2 -pipe -fstack-protector-strong -fno-strict-aliasing   -I/usr/local/include -fPIC -Wall -I. -I.. -I../.. -O2 -pipe -fstack-protector-strong -fno-strict-aliasing   -I/usr/local/include -fPIC -Wall -I. -I.. -I../.. -std=c++11 -DLINUX -O0 -g -ggdb -DUNICODE -DUSE_XML_LIBRARY=XERCES -DWCHAR_INCOMPATIBLE_XMLCH -D_DEBUG -DDEBUG `/usr/local/bin/wxgtk3u-3.0-config --debug=yes --unicode=yes --inplace --cxxflags` -DLINUX -O -DUNICODE -DUSE_XML_LIBRARY=XERCES -DWCHAR_INCOMPATIBLE_XMLCH -DNDEBUG `/usr/local/bin/wxgtk3u-3.0-config --debug=no --unicode=yes --inplace --cxxflags` -c PWSFilters.cpp -o ../../obj/unicoderelease/core/PWSFilters.o
PWSFilters.cpp:736:14: warning: 'mem_fun_ref<void, st_FilterRow>' is deprecated [-Wdeprecated-declarations]
             mem_fun_ref(&st_FilterRow::SetFilterComplete));
             ^
/usr/include/c++/v1/functional:1191:1: note: 'mem_fun_ref<void, st_FilterRow>' has been explicitly marked deprecated here
_LIBCPP_DEPRECATED_IN_CXX11 inline _LIBCPP_INLINE_VISIBILITY
^
/usr/include/c++/v1/__config:972:39: note: expanded from macro '_LIBCPP_DEPRECATED_IN_CXX11'
#  define _LIBCPP_DEPRECATED_IN_CXX11 _LIBCPP_DEPRECATED
                                      ^
/usr/include/c++/v1/__config:961:48: note: expanded from macro '_LIBCPP_DEPRECATED'
#    define _LIBCPP_DEPRECATED __attribute__ ((deprecated))
                                               ^
PWSFilters.cpp:738:14: warning: 'mem_fun_ref<void, st_FilterRow>' is deprecated [-Wdeprecated-declarations]
             mem_fun_ref(&st_FilterRow::SetFilterComplete));
             ^
/usr/include/c++/v1/functional:1191:1: note: 'mem_fun_ref<void, st_FilterRow>' has been explicitly marked deprecated here
_LIBCPP_DEPRECATED_IN_CXX11 inline _LIBCPP_INLINE_VISIBILITY
^
/usr/include/c++/v1/__config:972:39: note: expanded from macro '_LIBCPP_DEPRECATED_IN_CXX11'
#  define _LIBCPP_DEPRECATED_IN_CXX11 _LIBCPP_DEPRECATED
                                      ^
/usr/include/c++/v1/__config:961:48: note: expanded from macro '_LIBCPP_DEPRECATED'
#    define _LIBCPP_DEPRECATED __attribute__ ((deprecated))
                                               ^
PWSFilters.cpp:740:14: warning: 'mem_fun_ref<void, st_FilterRow>' is deprecated [-Wdeprecated-declarations]
             mem_fun_ref(&st_FilterRow::SetFilterComplete));
             ^
/usr/include/c++/v1/functional:1191:1: note: 'mem_fun_ref<void, st_FilterRow>' has been explicitly marked deprecated here
_LIBCPP_DEPRECATED_IN_CXX11 inline _LIBCPP_INLINE_VISIBILITY
^
/usr/include/c++/v1/__config:972:39: note: expanded from macro '_LIBCPP_DEPRECATED_IN_CXX11'
#  define _LIBCPP_DEPRECATED_IN_CXX11 _LIBCPP_DEPRECATED
                                      ^
/usr/include/c++/v1/__config:961:48: note: expanded from macro '_LIBCPP_DEPRECATED'
#    define _LIBCPP_DEPRECATED __attribute__ ((deprecated))
                                               ^
PWSFilters.cpp:742:7: warning: 'mem_fun_ref<void, st_FilterRow>' is deprecated [-Wdeprecated-declarations]
      mem_fun_ref(&st_FilterRow::SetFilterComplete));
      ^
/usr/include/c++/v1/functional:1191:1: note: 'mem_fun_ref<void, st_FilterRow>' has been explicitly marked deprecated here
_LIBCPP_DEPRECATED_IN_CXX11 inline _LIBCPP_INLINE_VISIBILITY
^
/usr/include/c++/v1/__config:972:39: note: expanded from macro '_LIBCPP_DEPRECATED_IN_CXX11'
#  define _LIBCPP_DEPRECATED_IN_CXX11 _LIBCPP_DEPRECATED
                                      ^
/usr/include/c++/v1/__config:961:48: note: expanded from macro '_LIBCPP_DEPRECATED'
#    define _LIBCPP_DEPRECATED __attribute__ ((deprecated))
                                               ^
4 warnings generated.
c++ -O2 -pipe -fstack-protector-strong -fno-strict-aliasing   -I/usr/local/include -fPIC -Wall -I. -I.. -I../.. -O2 -pipe -fstack-protector-strong -fno-strict-aliasing   -I/usr/local/include -fPIC -Wall -I. -I.. -I../.. -std=c++11 -DLINUX -O0 -g -ggdb -DUNICODE -DUSE_XML_LIBRARY=XERCES -DWCHAR_INCOMPATIBLE_XMLCH -D_DEBUG -DDEBUG `/usr/local/bin/wxgtk3u-3.0-config --debug=yes --unicode=yes --inplace --cxxflags` -DLINUX -O -DUNICODE -DUSE_XML_LIBRARY=XERCES -DWCHAR_INCOMPATIBLE_XMLCH -DNDEBUG `/usr/local/bin/wxgtk3u-3.0-config --debug=no --unicode=yes --inplace --cxxflags` -c PWSLog.cpp -o ../../obj/unicoderelease/core/PWSLog.o
c++ -O2 -pipe -fstack-protector-strong -fno-strict-aliasing   -I/usr/local/include -fPIC -Wall -I. -I.. -I../.. -O2 -pipe -fstack-protector-strong -fno-strict-aliasing   -I/usr/local/include -fPIC -Wall -I. -I.. -I../.. -std=c++11 -DLINUX -O0 -g -ggdb -DUNICODE -DUSE_XML_LIBRARY=XERCES -DWCHAR_INCOMPATIBLE_XMLCH -D_DEBUG -DDEBUG `/usr/local/bin/wxgtk3u-3.0-config --debug=yes --unicode=yes --inplace --cxxflags` -DLINUX -O -DUNICODE -DUSE_XML_LIBRARY=XERCES -DWCHAR_INCOMPATIBLE_XMLCH -DNDEBUG `/usr/local/bin/wxgtk3u-3.0-config --debug=no --unicode=yes --inplace --cxxflags` -c PWSprefs.cpp -o ../../obj/unicoderelease/core/PWSprefs.o
Stack dump:
0.	Program arguments: /usr/bin/c++ -cc1 -triple x86_64-unknown-freebsd11.4 -emit-obj -disable-free -disable-llvm-verifier -discard-value-names -main-file-name PWSprefs.cpp -mrelocation-model pic -pic-level 2 -mthread-model posix -mframe-pointer=all -relaxed-aliasing -fno-rounding-math -masm-verbose -mconstructor-aliases -munwind-tables -fno-use-init-array -target-cpu x86-64 -dwarf-column-info -fno-split-dwarf-inlining -debug-info-kind=standalone -dwarf-version=2 -debugger-tuning=gdb -resource-dir /usr/lib/clang/10.0.0 -I /usr/local/include -I . -I .. -I ../.. -I /usr/local/include -I . -I .. -I ../.. -D LINUX -D UNICODE -D USE_XML_LIBRARY=XERCES -D WCHAR_INCOMPATIBLE_XMLCH -D _DEBUG -D DEBUG -I /usr/local/lib/wx/include/gtk3-unicode-3.0 -I /usr/local/include/wx-3.0 -D _FILE_OFFSET_BITS=64 -D WXUSINGDLL -D __WXGTK__ -D _THREAD_SAFE -D LINUX -D UNICODE -D USE_XML_LIBRARY=XERCES -D WCHAR_INCOMPATIBLE_XMLCH -D NDEBUG -I /usr/local/lib/wx/include/gtk3-unicode-3.0 -I /usr/local/include/wx-
 3.0 -D _FILE_OFFSET_BITS=64 -D WXUSINGDLL -D __WXGTK__ -D _THREAD_SAFE -internal-isystem /usr/include/c++/v1 -O2 -Wall -Wall -std=c++11 -fdeprecated-macro -fdebug-compilation-dir /wrkdirs/usr/ports/sysutils/passwordsafe/work/pwsafe-1.12.0/src/core -ferror-limit 19 -fmessage-length 0 -pthread -stack-protector 2 -fgnuc-version=4.2.1 -fobjc-runtime=gnustep -fcxx-exceptions -fexceptions -fdiagnostics-show-option -vectorize-loops -vectorize-slp -faddrsig -o ../../obj/unicoderelease/core/PWSprefs.o -x c++ PWSprefs.cpp 
1.	PWSprefs.cpp:252:3: current parser token 'InitializePreferences'
2.	PWSprefs.cpp:237:1: parsing function body 'PWSprefs::PWSprefs'
3.	PWSprefs.cpp:237:1: in compound statement ('{}')
#0 0x00000000024ca7ee (/usr/bin/c+++0x24ca7ee)
#1 0x00000000024c8a65 (/usr/bin/c+++0x24c8a65)
#2 0x00000000024cb160 (/usr/bin/c+++0x24cb160)
#3 0x00000000033d5240 (/usr/bin/c+++0x33d5240)
c++: error: unable to execute command: Segmentation fault (core dumped)
c++: error: clang frontend command failed due to signal (use -v to see invocation)
FreeBSD clang version 10.0.0 (git_at_github.com:llvm/llvm-project.git llvmorg-10.0.0-0-gd32170dbd5b)
Target: x86_64-unknown-freebsd11.4
Thread model: posix
InstalledDir: /usr/bin
c++: note: diagnostic msg: PLEASE submit a bug report to https://bugs.freebsd.org/submit/ and include the crash backtrace, preprocessed source, and associated run script.
c++: note: diagnostic msg: 
********************

PLEASE ATTACH THE FOLLOWING FILES TO THE BUG REPORT:
Preprocessed source(s) and associated run script(s) are located at:
c++: note: diagnostic msg: /tmp/PWSprefs-429b76.cpp
c++: note: diagnostic msg: /tmp/PWSprefs-429b76.sh
c++: note: diagnostic msg: 

********************
gmake[3]: *** [Makefile:89: ../../obj/unicoderelease/core/PWSprefs.o] Error 254
gmake[3]: Leaving directory '/wrkdirs/usr/ports/sysutils/passwordsafe/work/pwsafe-1.12.0/src/core'
gmake[2]: *** [Makefile:94: unicoderelease] Error 2
gmake[2]: Leaving directory '/wrkdirs/usr/ports/sysutils/passwordsafe/work/pwsafe-1.12.0/src/core'
gmake[1]: *** [Makefile.freebsd:55: unicoderelease] Error 2
gmake[1]: Leaving directory '/wrkdirs/usr/ports/sysutils/passwordsafe/work/pwsafe-1.12.0'
*** Error code 1

Stop.
make: stopped in /usr/ports/sysutils/passwordsafe
Received on Tue Jul 27 2021 - 14:11:24 UTC

Original text of this message